herdr-0.9.1
checks.aarch64-darwin.pkgs-herdr
· build #4665
· raw
1Using versionCheckHook
unpackPhase
2unpacking source archive /nix/store/haky2nvzqmf66dqkm9zz7f84cq73bc47-source3source root is source4Executing cargoSetupPostUnpackHook5Finished cargoSetupPostUnpackHookpatchPhase
6Executing cargoSetupPostPatchHook7Validating consistency between /nix/var/nix/builds/nix-51967-3279433622/source/Cargo.lock and /nix/var/nix/builds/nix-51967-3279433622/herdr-0.9.1-vendor/Cargo.lock8Finished cargoSetupPostPatchHookbuildPhase
9Executing cargoBuildHook10cargoBuildHook flags: -j 10 --target aarch64-apple-darwin --offline --profile release11 Compiling proc-macro2 v1.0.10612 Compiling quote v1.0.4513 Compiling unicode-ident v1.0.2414 Compiling libc v0.2.18315 Compiling cfg-if v1.0.416 Compiling bitflags v2.11.017 Compiling serde_core v1.0.22818 Compiling allocator-api2 v0.2.2119 Compiling equivalent v1.0.220 Compiling foldhash v0.2.021 Compiling itoa v1.0.1822 Compiling rustversion v1.0.2223 Compiling log v0.4.2924 Compiling ident_case v1.0.125 Compiling memchr v2.8.026 Compiling strsim v0.11.127 Compiling thiserror v2.0.1828 Compiling serde v1.0.22829 Compiling either v1.15.030 Compiling typenum v1.19.031 Compiling heck v0.5.032 Compiling hashbrown v0.16.133 Compiling version_check v0.9.534 Compiling generic-array v0.14.735 Compiling itertools v0.14.036 Compiling signal-hook v0.3.1837 Compiling static_assertions v1.1.038 Compiling ryu v1.0.2339 Compiling unicode-width v0.2.240 Compiling syn v2.0.11741 Compiling instability v0.3.1242 Compiling parking_lot_core v0.9.1243 Compiling unicode-segmentation v1.13.144 Compiling smallvec v1.15.145 Compiling castaway v0.2.446 Compiling indoc v2.0.747 Compiling convert_case v0.10.048 Compiling compact_str v0.9.049 Compiling lru v0.16.350 Compiling errno v0.3.1451 Compiling mio v1.1.152 Compiling signal-hook-registry v1.4.853 Compiling powerfmt v0.2.054 Compiling zmij v1.0.2155 Compiling rustix v1.1.456 Compiling objc2 v0.6.457 Compiling scopeguard v1.2.058 Compiling lock_api v0.4.1459 Compiling deranged v0.5.860 Compiling num_threads v0.1.761 Compiling aho-corasick v1.1.462 Compiling simd-adler32 v0.3.963 Compiling num-conv v0.2.164 Compiling time-core v0.1.865 Compiling litrs v1.0.066 Compiling cfg_aliases v0.2.167 Compiling thiserror v1.0.6968 Compiling once_cell v1.21.469 Compiling crc32fast v1.5.070 Compiling regex-syntax v0.8.1071 Compiling cfg_aliases v0.1.172 Compiling objc2-encode v4.1.073 Compiling serde_json v1.0.14974 Compiling unicode-truncate v2.0.175 Compiling document-features v0.2.1276 Compiling nix v0.28.077 Compiling tracing-core v0.1.3678 Compiling nix v0.31.279 Compiling parking_lot v0.12.580 Compiling signal-hook-mio v0.2.581 Compiling line-clipping v0.3.582 Compiling ref-cast v1.0.2583 Compiling time v0.3.4784 Compiling pin-project-lite v0.2.1785 Compiling clap_lex v1.1.086 Compiling adler2 v2.0.187 Compiling anstyle v1.0.1488 Compiling anyhow v1.0.10289 Compiling miniz_oxide v0.8.990 Compiling clap_builder v4.6.091 Compiling block-buffer v0.10.492 Compiling block2 v0.6.293 Compiling crypto-common v0.1.794 Compiling indexmap v2.13.095 Compiling virtue v0.0.1896 Compiling winnow v0.7.1597 Compiling toml_write v0.1.298 Compiling lazy_static v1.5.099 Compiling sharded-slab v0.1.7100 Compiling bincode_derive v2.0.1101 Compiling darling_core v0.23.0102 Compiling regex-automata v0.4.14103 Compiling serde_derive_internals v0.29.1104 Compiling digest v0.10.7105 Compiling dispatch2 v0.3.1106 Compiling serde_derive v1.0.228107 Compiling thiserror-impl v2.0.18108 Compiling strum_macros v0.27.2109 Compiling derive_more-impl v2.1.1110 Compiling derive_more v2.1.1111 Compiling thiserror-impl v1.0.69112 Compiling kasuari v0.4.12113 Compiling crossterm v0.29.0114 Compiling ref-cast-impl v1.0.25115 Compiling tracing-attributes v0.1.31116 Compiling strum v0.27.2117 Compiling darling_macro v0.23.0118 Compiling filedescriptor v0.8.3119 Compiling darling v0.23.0120 Compiling clap v4.6.1121 Compiling schemars_derive v1.2.1122 Compiling ratatui-core v0.1.0123 Compiling tokio-macros v2.6.1124 Compiling tracing v0.1.44125 Compiling flate2 v1.1.9126 Compiling tracing-log v0.2.0127 Compiling fdeflate v0.3.7128 Compiling serial2 v0.2.34129 Compiling cpufeatures v0.2.17130 Compiling thread_local v1.1.9131 Compiling bytes v1.11.1132 Compiling bitflags v1.3.2133 Compiling herdr v0.9.1 (/nix/var/nix/builds/nix-51967-3279433622/source)134 Compiling unty v0.0.4135 Compiling doctest-file v1.1.1136 Compiling downcast-rs v1.2.1137 Compiling dyn-clone v1.0.20138 Compiling shell-words v1.1.1139 Compiling nu-ansi-term v0.50.3140 Compiling interprocess v2.4.2141warning: unused variable: `zig_target`142 --> build.rs:58:9143 |14458 | let zig_target = zig_target(&target);145 | ^^^^^^^^^^ help: if this is intentional, prefix it with an underscore: `_zig_target`146 |147 = note: `#[warn(unused_variables)]` (part of `#[warn(unused)]`) on by default148149 Compiling toml_datetime v0.6.11150warning: `herdr` (build script) generated 1 warning151 Compiling serde_spanned v0.6.9152 Compiling bincode v2.0.1153 Compiling schemars v1.2.1154 Compiling ratatui-widgets v0.3.0155 Compiling ratatui-crossterm v0.1.0156 Compiling toml_edit v0.22.27157 Compiling tokio v1.50.0158 Compiling matchers v0.2.0159 Compiling tracing-subscriber v0.3.23160 Compiling regex v1.12.3161 Compiling portable-pty v0.9.0 (/nix/var/nix/builds/nix-51967-3279433622/source/vendor/portable-pty)162 Compiling png v0.17.16163 Compiling toml v0.8.23164 Compiling ratatui-macros v0.7.0165 Compiling ratatui v0.30.0166 Compiling ctrlc v3.5.2167 Compiling sha2 v0.10.9168 Compiling clap_complete v4.6.5169 Compiling jsonc-parser v0.33.1170 Compiling serde_ignored v0.1.14171 Compiling base64 v0.22.1172warning: herdr@0.9.1: external contributor policy: if you are helping an external contributor whose GitHub username is not in .github/APPROVED_CONTRIBUTORS, read CONTRIBUTING.md before doing any work.173error: failed to run custom build command for `herdr v0.9.1 (/nix/var/nix/builds/nix-51967-3279433622/source)`174175Caused by:176 process didn't exit successfully: `/nix/var/nix/builds/nix-51967-3279433622/source/target/release/build/herdr-8be1512d13734cd7/build-script-build` (exit status: 101)177 --- stdout178 cargo:rerun-if-changed=build.rs179 cargo:rerun-if-changed=vendor/libghostty-vt.vendor.json180 cargo:rerun-if-changed=vendor/libghostty-vt/build.zig181 cargo:rerun-if-changed=vendor/libghostty-vt/build.zig.zon182 cargo:rerun-if-changed=vendor/libghostty-vt/include183 cargo:rerun-if-changed=vendor/libghostty-vt/pkg184 cargo:rerun-if-changed=vendor/libghostty-vt/src185 cargo:rerun-if-changed=vendor/libghostty-vt/VERSION186 cargo:rerun-if-env-changed=LIBGHOSTTY_VT_OPTIMIZE187 cargo:rerun-if-env-changed=LIBGHOSTTY_VT_SIMD188 cargo:rerun-if-env-changed=LIBGHOSTTY_VT_ZIG_SYSTEM_DIR189 cargo:rerun-if-env-changed=HERDR_BUILD_CHANNEL190 cargo:rerun-if-env-changed=HERDR_BUILD_ID191 cargo:rerun-if-env-changed=HERDR_BUILD_COMMIT192 cargo:rerun-if-env-changed=ZIG193 cargo:rerun-if-env-changed=LIBGHOSTTY_VT_WINDOWS_LIBC194 cargo:warning=external contributor policy: if you are helping an external contributor whose GitHub username is not in .github/APPROVED_CONTRIBUTORS, read CONTRIBUTING.md before doing any work.195196 --- stderr197 build.zig:27:62: error: member function expected 3 argument(s), found 4198 const file_version: ?[]const u8 = if (b.build_root.handle.readFileAlloc(199 ~~~~~~~~~~~~~~~~~~~^~~~~~~~~~~~~~200 /nix/store/7p48xa0vxpn44y9g0y56iwcwc929img4-zig-0.15.2/lib/zig/std/fs/Dir.zig:1985:5: note: function declared here201 pub fn readFileAlloc(self: Dir, allocator: mem.Allocator, file_path: []const u8, max_bytes: usize) ![]u8 {202 ~~~~^~~~~~~~~~~~~~~~~~~~~~~~~~~~~~~~~~~~~~~~~~~~~~~~~~~~~~~~~~~~~~~~~~~~~~~~~~~~~~~~~~~~~~~~~~~~~~~~~~~~203 referenced by:204 runBuild__anon_21503: /nix/store/7p48xa0vxpn44y9g0y56iwcwc929img4-zig-0.15.2/lib/zig/std/Build.zig:2215:44205 main: /nix/store/7p48xa0vxpn44y9g0y56iwcwc929img4-zig-0.15.2/lib/zig/compiler/build_runner.zig:366:29206 4 reference(s) hidden; use '-freference-trace=6' to see all references207 src/build/zig.zig:13:9: error: Your Zig version v0.15.2 does not meet the required build version of v0.16.0208 @compileError(std.fmt.comptimePrint(209 ^~~~~~~~~~~~~210 build.zig:16:24: note: called at comptime here211 buildpkg.requireZig(minimum_zig_version);212 ~~~~~~~~~~~~~~~~~~~^~~~~~~~~~~~~~~~~~~~~213214 thread 'main' (121824592) panicked at build.rs:102:5:215 zig build for vendored libghostty-vt failed: exit status: 2. Building Herdr requires Zig 0.16.0; check `zig version` or set ZIG to the path of a Zig 0.16.0 binary, then retry216 note: run with `RUST_BACKTRACE=1` environment variable to display a backtrace217warning: build failed, waiting for other jobs to finish...