nixbot

builds

failed iets-nextest-0.1.0 checks.x86_64-linux.test · build #87 · raw

unpackPhase
1unpacking source archive /nix/store/fkjq30a7sx5a72d970sbgfw7jlw2n7n0-source2source root is source
patchPhase
3Executing configureCargoCommonVars4decompressing cargo artifacts from /nix/store/m3h2vrllwkg71qk2n21gz9kxsd8gxvik-iets-deps-0.1.0/target.tar.zst to target
configurePhase
5will append /build/source/.cargo-home/config.toml with contents of /nix/store/kcp4b936hbdmdqyk70cz6fyd4gnf3msb-vendor-cargo-deps/config.toml6default configurePhase, nothing to do
buildPhase
7+++ command cargo --version8cargo 1.98.0 (797e8a9bc 2026-08-05)9+++ command cargo nextest --version10cargo-nextest 0.9.14311release: 0.9.14312host: x86_64-unknown-linux-gnu
checkPhase
13+++ command cargo nextest run --cargo-profile dev14 Compiling iets v0.1.0 (/build/source)15 Finished `dev` profile [unoptimized + debuginfo] target(s) in 7m 21s16------------17 Nextest run ID b6d508cf-fb7d-4574-acf9-c5d41ccdfeee with nextest profile: default18 Starting 520 tests across 12 binaries (5 tests skipped)19 PASS [ 0.133s] ( 1/520) iets build::fanout::tests::dependencies_run_first20 PASS [ 0.133s] ( 2/520) iets build::fixhash::tests::a_longer_hash_is_not_a_match21 PASS [ 0.139s] ( 3/520) iets build::fixhash::tests::two_matches_are_left_alone22 PASS [ 0.172s] ( 4/520) iets api::drvshow::tests::inputs_and_structured_attrs23 PASS [ 0.174s] ( 5/520) iets api::drvshow::tests::a_non_canonical_structured_attrs_text_is_renormalised24 PASS [ 0.162s] ( 6/520) iets api::fetch::tests::only_a_fixed_output_drv_can_be_prefetched25 PASS [ 0.131s] ( 7/520) iets build::event::tests::durations26 PASS [ 0.174s] ( 8/520) iets api::drvshow::tests::a_multi_output_derivation27 PASS [ 0.126s] ( 9/520) iets build::executor::tests::no_place_at_all_is_a_usage_error28 PASS [ 0.135s] ( 10/520) iets argv::tests::every_byte_round_trips29 PASS [ 0.132s] ( 11/520) iets build::executor::tests::a_feature_the_place_lacks_rules_it_out30 PASS [ 0.173s] ( 12/520) iets api::drvshow::tests::pretty_matches_serde_json31 PASS [ 0.166s] ( 13/520) iets api::installable::tests::the_name_a_program_takes_from_a_derivation_name32 PASS [ 0.165s] ( 14/520) iets api::installable::tests::default_and_fragment_attr_paths33 PASS [ 0.163s] ( 15/520) iets api::fetch::tests::the_fake_hash_moves_the_output_and_the_drv34 PASS [ 0.175s] ( 16/520) iets api::drvshow::tests::floats_take_nlohmanns_form35 PASS [ 0.129s] ( 17/520) iets build::executor::tests::one_place_declaring_nothing_takes_everything36 PASS [ 0.134s] ( 18/520) iets build::executor::tests::a_refusal_names_every_place_and_what_it_declared37 PASS [ 0.137s] ( 19/520) iets build::render::tests::a_daemon_failure_message_decides_the_verdict38 PASS [ 0.151s] ( 20/520) iets build::executor::tests::a_declared_system_filters39 PASS [ 0.158s] ( 21/520) iets build::fixhash::tests::one_match_is_rewritten_in_its_own_spelling40 PASS [ 0.151s] ( 22/520) iets build::executor::tests::an_unsupported_url_says_what_is_expected41 PASS [ 0.148s] ( 23/520) iets build::render::tests::a_build_log_never_reports_a_mismatch42 PASS [ 0.183s] ( 24/520) iets api::drvshow::tests::a_fixed_output_shows_its_content_address_and_no_path43 PASS [ 0.029s] ( 25/520) iets build::render::tests::drv_paths_of_a_failure_message44 PASS [ 0.166s] ( 26/520) iets build::backend::tests::the_timings_report_with_every_line45 PASS [ 0.160s] ( 27/520) iets build::render::tests::a_failure_after_the_activity_ended_never_claims_a_success46 PASS [ 0.183s] ( 28/520) iets build::backend::tests::output_specs47 PASS [ 0.175s] ( 29/520) iets build::backend::tests::base_names_drop_the_store_dir48 PASS [ 0.054s] ( 30/520) iets build::render::tests::ci_folds_a_success_and_never_a_failure49 PASS [ 0.175s] ( 31/520) iets build::render::tests::an_unfolded_success_ends_with_its_verdict50 PASS [ 0.180s] ( 32/520) iets build::render::tests::a_stalled_build_that_fails_still_shows_its_cause51 PASS [ 0.185s] ( 33/520) iets build::render::tests::an_owned_build_is_verdicted_once_by_its_op52 PASS [ 0.232s] ( 34/520) iets build::fanout::tests::a_failed_dependency_blocks_its_dependants53 PASS [ 0.050s] ( 35/520) iets builtins::store_hooks::tests::a_relative_path_inside_an_entry_joins_once54 PASS [ 0.022s] ( 36/520) iets cachefs::tests::a_touch_inside_the_interval_writes_nothing55 PASS [ 0.056s] ( 37/520) iets cachefs::tests::a_directory_that_is_not_ours_is_refused_untouched56 PASS [ 0.243s] ( 38/520) iets build::fanout::tests::at_most_limit_builds_run_at_once57 PASS [ 0.089s] ( 39/520) iets builtins::text::fromtoml::tests::new_escapes_are_refused58 PASS [ 0.264s] ( 40/520) iets build::executor::tests::the_first_place_that_takes_it_wins59 PASS [ 0.067s] ( 41/520) iets cachefs::tests::a_stamp_in_the_future_is_due60 PASS [ 0.123s] ( 42/520) iets builtins::derivation::tests::the_two_placeholders_are_not_the_same61 PASS [ 0.096s] ( 43/520) iets builtins::fetch_git::tests::a_working_tree_is_a_file_url_of_an_absolute_path62 PASS [ 0.024s] ( 44/520) iets cachefs::tests::sweep_ages_a_root_by_its_link_not_by_what_it_names63 PASS [ 0.102s] ( 45/520) iets cachefs::tests::a_store_without_a_version_file_is_wiped_once64 PASS [ 0.156s] ( 46/520) iets build::render::tests::tty_keeps_successful_logs_off_the_screen65 PASS [ 0.167s] ( 47/520) iets build::render::tests::heartbeat_names_running_builds66 PASS [ 0.175s] ( 48/520) iets build::render::tests::logs_of_two_builds_do_not_interleave67 PASS [ 0.059s] ( 49/520) iets cachefs::tests::an_input_store_of_the_spool_layout_is_wiped68 PASS [ 0.159s] ( 50/520) iets builtins::text::fromtoml::tests::inline_tables_stay_on_one_line69 PASS [ 0.114s] ( 51/520) iets cachefs::tests::a_sweep_runs_once_per_interval70 PASS [ 0.171s] ( 52/520) iets build::tests::hash_stripping71 PASS [ 0.154s] ( 53/520) iets builtins::fetch_git::tests::only_a_plain_rev_or_ref_is_read_by_iets72 PASS [ 0.130s] ( 54/520) iets cachefs::tests::a_wipe_keeps_what_iets_did_not_create73 PASS [ 0.210s] ( 55/520) iets build::tests::targets_become_jobs74 PASS [ 0.228s] ( 56/520) iets build::tests::a_fan_out_backend_keeps_the_cap_and_the_log_blocks75 PASS [ 0.186s] ( 57/520) iets builtins::text::regex::tests::size_limit76 PASS [ 0.216s] ( 58/520) iets build::tests::a_target_with_no_verdict_fails77 PASS [ 0.135s] ( 59/520) iets cachefs::tests::a_wait_lock_waits_for_its_holder78 PASS [ 0.053s] ( 60/520) iets cli::build::tests::a_path_on_stdout_is_silent79 PASS [ 0.125s] ( 61/520) iets cachefs::tests::a_wipe_of_the_ir_cache_walks_its_shards80 PASS [ 0.083s] ( 62/520) iets cachefs::tests::sweep_walks_the_shards_of_the_ir_cache81 PASS [ 0.113s] ( 63/520) iets cachefs::tests::garbled_stamp_wipes_the_store82 PASS [ 0.219s] ( 64/520) iets builtins::derivation::tests::a_dynamic_output_renders_the_placeholder_nix_renders83 PASS [ 0.170s] ( 65/520) iets cachefs::tests::sweep_drops_old_entries_and_keeps_young_ones84 PASS [ 0.181s] ( 66/520) iets cachefs::tests::an_empty_directory_is_ours_to_take85 PASS [ 0.277s] ( 67/520) iets builtins::text::regex::tests::names86 PASS [ 0.167s] ( 68/520) iets cachefs::tests::version_mismatch_wipes_the_store87 PASS [ 0.166s] ( 69/520) iets cachefs::tests::the_writer_lock_excludes_one_holder_at_a_time88 PASS [ 0.119s] ( 70/520) iets cli::classic::shell::tests::declares_for_every_bash_shaped_value89 PASS [ 0.027s] ( 71/520) iets cli::help::tests::suggestions_come_from_the_help90 PASS [ 0.026s] ( 72/520) iets cli::help::tests::help_fits_80_columns91 PASS [ 0.021s] ( 73/520) iets cli::search::tests::drv_names92 PASS [ 0.030s] ( 74/520) iets cli::classic::tests::a_flag_with_no_effect_is_noted_and_one_that_holds_is_not93 PASS [ 0.025s] ( 75/520) iets cli::render::tests::sizes_render_as_nix_renders_them94 PASS [ 0.026s] ( 76/520) iets cli::search::tests::merged_highlights95 PASS [ 0.034s] ( 77/520) iets cli::help::tests::messages96 PASS [ 0.035s] ( 78/520) iets cli::render::text::tests::a_long_value_shows_the_lines_that_differ97 PASS [ 0.018s] ( 79/520) iets config::tests::a_classic_name_leaves_an_unimplemented_setting_to_nix98 PASS [ 0.067s] ( 80/520) iets cli::classic::shell::tests::outputs_become_placeholders99 PASS [ 0.069s] ( 81/520) iets cli::help::tests::a_mistyped_command_is_suggested100 PASS [ 0.023s] ( 82/520) iets config::tests::bad_typed_values_error_where_they_are_set101 PASS [ 0.038s] ( 83/520) iets config::tests::an_alias_is_its_setting102 PASS [ 0.209s] ( 84/520) iets cli::build::tests::no_build_result_is_named103 PASS [ 0.127s] ( 85/520) iets cli::plumbing::tests::a_url_is_the_positional_fetch_takes_itself104 PASS [ 0.086s] ( 86/520) iets cli::search::tests::index_round_trip105 PASS [ 0.014s] ( 87/520) iets config::tests::max_jobs_auto_is_the_cpu_count106 PASS [ 0.022s] ( 88/520) iets config::tests::extra_appends_to_list_settings_only107 PASS [ 0.029s] ( 89/520) iets config::tests::include_chain108 PASS [ 0.255s] ( 90/520) iets cli::build::tests::a_success_with_no_output_path_is_named109 PASS [ 0.395s] ( 91/520) iets cachefs::tests::a_lock_that_cannot_be_opened_is_not_a_busy_lock110 PASS [ 0.245s] ( 92/520) iets cli::build::tests::no_outcome_at_all_is_named111 PASS [ 0.115s] ( 93/520) iets cli::plumbing::tests::a_file_url_needs_one_slash_not_three112 PASS [ 0.116s] ( 94/520) iets cli::docs::tests::every_embedded_page_has_a_heading113 PASS [ 0.019s] ( 95/520) iets config::tests::overrides_win_over_files114 PASS [ 0.277s] ( 96/520) iets cli::build::tests::a_failed_build_reports_itself115 PASS [ 0.025s] ( 97/520) iets config::tests::option_nix_path_replaces_nix_path_and_extra_adds116 PASS [ 0.019s] ( 98/520) iets config::tests::syntax_errors117 PASS [ 0.025s] ( 99/520) iets config::tests::missing_include_errors_and_bang_include_does_not118 PASS [ 0.031s] (100/520) iets config::tests::the_daemon_gets_the_store_settings_set_outside_the_system_file119 PASS [ 0.026s] (101/520) iets config::tests::unknown_settings_are_kept120 PASS [ 0.255s] (102/520) iets cli::build::tests::an_out_flag_that_matches_nothing_is_named121 PASS [ 0.020s] (103/520) iets devenv::tests::output_checks_are_erased_only_when_present122 PASS [ 0.082s] (104/520) iets config::tests::bool_spellings123 PASS [ 0.035s] (105/520) iets config::tests::user_conf_files_are_in_precedence_order124 PASS [ 0.113s] (106/520) iets config::tests::a_setting_with_no_effect_is_noted125 PASS [ 0.181s] (107/520) iets cli::docs::tests::the_topic_list_fits_80_columns126 PASS [ 0.047s] (108/520) iets config::tests::typed_getters_and_defaults127 PASS [ 0.028s] (109/520) iets devenv::tests::rewrites_apply_in_map_order_to_every_occurrence128 PASS [ 0.184s] (110/520) iets cli::diff::tests::a_name_ends_at_the_first_dash_before_a_digit129 PASS [ 0.051s] (111/520) iets devenv::tests::get_env_sh_store_path_matches_nix130 PASS [ 0.052s] (112/520) iets devenv::tests::json_roundtrip_and_bash_forms131 PASS [ 0.186s] (113/520) iets cli::docs::tests::topics_resolve_bare_and_qualified132 PASS [ 0.076s] (114/520) iets config::tests::the_setting_tables_name_nix_settings133 PASS [ 0.073s] (115/520) iets devenv::tests::rc_script_rewrites_outputs_and_writes_attrs134 PASS [ 0.216s] (116/520) iets cli::classic::shell::tests::sh_var_names135 PASS [ 0.082s] (117/520) iets devenv::tests::cached_result_roundtrip136 PASS [ 0.086s] (118/520) iets devenv::tests::non_bash_builder_is_refused137 PASS [ 0.128s] (119/520) iets devenv::tests::shell_escaping138 PASS [ 0.288s] (120/520) iets config::tests::basic_syntax139 PASS [ 1.181s] (121/520) iets builtins::text::regex::tests::long_inputs_do_not_recurse140 PASS [ 1.587s] (122/520) iets compile::cache::tests::a_malformed_entry_is_a_miss_and_never_a_crash141 PASS [ 1.715s] (123/520) iets eval::tests::fetch_mercurial_names_a_way_out142 PASS [ 2.725s] (124/520) iets api::value::tests::lists143 PASS [ 2.326s] (125/520) iets compile::cache::tests::a_changed_byte_of_a_stored_entry_is_a_miss144 PASS [ 2.758s] (126/520) iets compile::cache::tests::nesting_past_the_cap_misses145 PASS [ 0.137s] (127/520) iets fetch::http::tests::credentials_in_the_url_are_sent_and_never_printed146 PASS [ 0.105s] (128/520) iets fetch::http::tests::credentials_stay_on_the_first_origin147 PASS [ 0.841s] (129/520) iets fetch::http::tests::a_transient_status_is_retried148 PASS [ 0.018s] (130/520) iets fetch::http::tests::file_urls_name_a_local_path149 PASS [ 3.728s] (131/520) iets api::run::tests::a_fiber_template_carries_the_configuration150 PASS [ 0.022s] (132/520) iets fetch::http::tests::magic_bytes151 PASS [ 0.040s] (133/520) iets fetch::http::tests::redirects_keep_credentials_only_on_the_same_origin152 PASS [ 0.024s] (134/520) iets fetch::http::tests::redirects_resolve153 PASS [ 1.154s] (135/520) iets fetch::http::tests::a_stalled_download_fails154 PASS [ 0.050s] (136/520) iets fetch::roots::tests::a_named_file_that_is_missing_or_empty_is_an_error155 PASS [ 0.138s] (137/520) iets fetch::http::tests::trailing_bytes_and_a_second_layer156 PASS [ 0.022s] (138/520) iets fetch::roots::tests::an_empty_nix_ssl_cert_file_hides_ssl_cert_file157 PASS [ 0.431s] (139/520) iets fetch::http::tests::downloads_stop_at_the_size_limit158 PASS [ 0.028s] (140/520) iets fetch::roots::tests::nix_ssl_cert_file_wins_over_ssl_cert_file_and_the_platform159 PASS [ 0.020s] (141/520) iets fetch::roots::tests::no_bundle_anywhere_gives_the_compiled_in_set160 PASS [ 0.024s] (142/520) iets fetch::roots::tests::the_platform_store_wins_over_the_compiled_in_set161 PASS [ 0.028s] (143/520) iets fetch::spool::tests::a_changed_index_byte_is_a_miss162 PASS [ 0.028s] (144/520) iets fetch::spool::tests::a_stored_tree_dumps_the_spools_nar163 PASS [ 0.057s] (145/520) iets fetch::spool::tests::a_sparse_member_counts_against_the_size_limit164 PASS [ 0.073s] (146/520) iets fetch::spool::tests::an_empty_archive_is_an_empty_directory165 PASS [ 0.042s] (147/520) iets fetch::spool::tests::nar_hash_of_the_fixture166 PASS [ 0.110s] (148/520) iets fetch::spool::tests::archives_the_git_sink_accepts167 PASS [ 0.078s] (149/520) iets fetch::spool::tests::spool_matches_the_tree168 PASS [ 0.035s] (150/520) iets fetch::spool::tests::spool_matches_the_tree_on_the_top_level169 PASS [ 3.661s] (151/520) iets eval::tests::a_second_pseudo_file_keeps_its_own_positions170 PASS [ 0.049s] (152/520) iets fetch::spool::tests::the_errors_match171 PASS [ 0.026s] (153/520) iets fetch::spool::tests::the_scratch_file_never_follows_a_symlink172 PASS [ 0.546s] (154/520) iets fetch::http::tests::urls_split173 PASS [ 0.023s] (155/520) iets fetch::unpack::tests::an_unsupported_member_type_is_an_error174 PASS [ 0.026s] (156/520) iets fetch::unpack::tests::member_names_are_made_relative_and_cannot_escape175 PASS [ 3.741s] (157/520) iets eval::tests::derivation_wrapper_exists176 PASS [ 0.061s] (158/520) iets fetch::unpack::tests::keeps_the_root_when_it_is_not_a_single_directory177 PASS [ 0.104s] (159/520) iets fetch::unpack::tests::a_repeated_member_keeps_the_last_copy178 PASS [ 2.046s] (160/520) iets fetch::http::tests::a_decompression_bomb_is_refused179 PASS [ 0.031s] (161/520) iets fetch::unpack::tests::nar_hash_of_the_fixture180 PASS [ 0.021s] (162/520) iets flake::flakeref::tests::errors_and_unsupported181 PASS [ 0.031s] (163/520) iets fetch::unpack::tests::strips_one_leading_component182 PASS [ 0.071s] (164/520) iets fetch::unpack::tests::modes_symlinks_and_empty_dirs183 PASS [ 0.024s] (165/520) iets flake::flakeref::tests::parses_the_kept_schemes184 PASS [ 0.031s] (166/520) iets flake::flakeref::tests::git_urls_are_fixed_like_nix185 PASS [ 0.018s] (167/520) iets flake::tests::attr_paths186 PASS [ 0.086s] (168/520) iets jobs::constituents::tests::fnmatch_basics187 PASS [ 0.104s] (169/520) iets flake::flakeref::tests::round_trips188 PASS [ 0.083s] (170/520) iets jobs::constituents::tests::topo_sort_orders_and_detects_cycles189 PASS [ 0.021s] (171/520) iets jobs::line::tests::error_line_round_trip190 PASS [ 0.030s] (172/520) iets jobs::line::tests::split_and_round_trip191 PASS [ 0.135s] (173/520) iets flake::flakeref::tests::to_string_from_attrs192 PASS [ 0.031s] (174/520) iets lint::allow::tests::comment_names193 PASS [ 0.622s] (175/520) iets fetch::spool::tests::a_hard_link_never_replaces_a_member194 PASS [ 0.144s] (176/520) iets flake::tests::refs_resolve_against_cwd_and_home195 PASS [ 0.022s] (177/520) iets lint::site::tests::a_literal_lint_of_nix_has_an_edit196 PASS [ 0.018s] (178/520) iets lint::allow::tests::lines197 PASS [ 0.020s] (179/520) iets lint::site::tests::the_span_is_the_innermost_node_of_the_kind_of_the_lint198 PASS [ 0.020s] (180/520) iets lint::tests::keys199 PASS [ 0.014s] (181/520) iets lint::tests::names_are_unique_kebab_case200 PASS [ 0.016s] (182/520) iets lint::tests::specificity_inside_a_source_and_order_between_sources201 PASS [ 0.026s] (183/520) iets lint::tests::selectors_and_order202 PASS [ 4.472s] (184/520) iets builtins::fetch::tests::nix_sees_no_mark203 PASS [ 0.024s] (185/520) iets lint::tests::the_project_file_walk_stops_at_the_project_root204 PASS [ 0.011s] (186/520) iets log::tests::a_fixed_hash_has_the_shape_of_a_finding_with_an_edit205 PASS [ 0.045s] (187/520) iets lint::tests::scope_and_inputs206 PASS [ 0.027s] (188/520) iets log::tests::a_coloured_error_is_an_error_record207 PASS [ 0.022s] (189/520) iets log::tests::a_forged_mismatch_is_dropped208 PASS [ 0.075s] (190/520) iets lint::tests::an_unknown_name_is_a_warning_in_a_file_and_an_error_in_a_flag209 PASS [ 0.021s] (191/520) iets log::tests::a_hash_mismatch_names_the_hash_it_got210 PASS [ 0.047s] (192/520) iets lint::tests::toml_table211 PASS [ 0.535s] (193/520) iets fetch::spool::tests::pax_sparse_members_are_expanded212 PASS [ 0.017s] (194/520) iets log::tests::a_resolved_copy_reports_its_mismatch_as_a_line213 PASS [ 0.019s] (195/520) iets log::tests::activity_records_are_nix_json_logger_records214 PASS [ 0.010s] (196/520) iets log::tests::escapes_are_filtered_the_way_nix_filters_them215 PASS [ 0.016s] (197/520) iets log::tests::exit_status_flags_combine_like_nix216 PASS [ 0.027s] (198/520) iets log::tests::ansi_stripping217 PASS [ 0.027s] (199/520) iets log::tests::record_is_nix_log_ei_plus_code_and_hint218 PASS [ 0.032s] (200/520) iets log::tests::lint_warning_is_a_level_1_record219 PASS [ 0.032s] (201/520) iets nixbin::tests::every_iets_build_is_skipped220 PASS [ 0.041s] (202/520) iets log::tests::text_shows_the_hint_of_an_unsupported_error221 PASS [ 0.083s] (203/520) iets log::tests::a_session_id_is_a_uuid_v7222 PASS [ 0.149s] (204/520) iets log::tests::a_mismatch_reason_keeps_both_hashes223 PASS [ 0.076s] (205/520) iets parallel::deque::tests::lifo_owner_fifo_thief224 PASS [ 0.015s] (206/520) iets parallel::fiber::tests::reservation_is_capped_and_mmap_failure_is_an_error225 PASS [ 0.076s] (207/520) iets parallel::fiber::tests::migrates_between_threads226 PASS [ 0.142s] (208/520) iets log::tests::record_without_position227 PASS [ 0.119s] (209/520) iets nixbin::tests::farm_marker_is_found_through_two_hops228 PASS [ 0.032s] (210/520) iets parallel::fiber::tests::resume_yield_finish229 PASS [ 0.019s] (211/520) iets parallel::interner::tests::empty_name_misses_the_cache_sentinel230 PASS [ 0.027s] (212/520) iets parallel::interner::tests::intern_is_stable_and_shared231 PASS [ 0.042s] (213/520) iets parallel::sched::tests::a_task_survives_packing_past_the_old_24_bit_start232 PASS [ 0.032s] (214/520) iets parallel::sched::tests::main_parks_and_is_woken_by_helper233 PASS [ 0.028s] (215/520) iets parallel::sched::tests::park_and_wake_across_workers234 PASS [ 0.066s] (216/520) iets parallel::sched::tests::fan_out_from_main235 PASS [ 0.027s] (217/520) iets print::tests::float_formatting_edge_cases236 PASS [ 0.047s] (218/520) iets parallel::thunk::tests::deadlocked_fibers_are_cancelled237 PASS [ 0.017s] (219/520) iets profile::tests::a_sample_is_taken_once_per_tick238 PASS [ 0.226s] (220/520) iets parallel::deque::tests::concurrent_sum239 PASS [ 0.030s] (221/520) iets profile::tests::a_frame_keeps_its_call_site_and_its_name240 PASS [ 0.223s] (222/520) iets parallel::fiber::tests::large_stack_use_and_release241 PASS [ 0.020s] (223/520) iets profile::tests::an_unwind_returns_to_a_depth242 PASS [ 0.027s] (224/520) iets progress::tests::a_download_inside_a_copy_is_part_of_the_copy243 PASS [ 0.027s] (225/520) iets profile::tests::a_weight_is_bytes_when_the_profile_asks_for_them244 PASS [ 0.078s] (226/520) iets profile::tests::a_deep_stack_is_capped245 PASS [ 0.022s] (227/520) iets progress::tests::a_transfer_that_does_not_move_says_so246 PASS [ 0.025s] (228/520) iets progress::tests::a_log_hears_of_a_task_after_first_and_then_every_heartbeat247 PASS [ 0.019s] (229/520) iets progress::tests::several_of_a_kind_are_counted248 PASS [ 0.173s] (230/520) iets parallel::interner::tests::concurrent_intern_agrees249 PASS [ 0.028s] (231/520) iets progress::tests::store_hashes_are_left_out250 PASS [ 0.025s] (232/520) iets project::tests::a_working_tree_wins_over_a_file_marker_below_it251 PASS [ 0.027s] (233/520) iets project::tests::a_config_file_never_shrinks_the_root252 PASS [ 0.019s] (234/520) iets provenance::tests::a_tree_copied_from_a_store_tree_resolves_to_the_local_one253 PASS [ 0.038s] (235/520) iets provenance::tests::a_path_followed_by_a_colour_escape_still_matches254 PASS [ 0.042s] (236/520) iets project::tests::the_nearest_flake_wins_without_a_working_tree255 PASS [ 0.025s] (237/520) iets provenance::tests::failed_line_names_the_attribute_and_the_position256 PASS [ 0.023s] (238/520) iets provenance::tests::locate_takes_the_longest_prefix257 PASS [ 0.053s] (239/520) iets project::tests::each_marker_is_a_root258 PASS [ 0.022s] (240/520) iets provenance::tests::rewrite_replaces_every_known_path_in_a_line259 PASS [ 0.010s] (241/520) iets remote::grpc::build::tests::reschedules_back_off_past_a_dead_worker260 PASS [ 0.025s] (242/520) iets remote::grpc::build::tests::a_self_reference_does_not_loop261 PASS [ 0.028s] (243/520) iets remote::grpc::build::tests::required_features_come_from_the_env_or_structured_attrs262 PASS [ 0.031s] (244/520) iets remote::grpc::build::tests::a_local_upload_failure_beats_the_stream_ended_status263 PASS [ 0.051s] (245/520) iets provenance::tests::locate_without_a_match_is_none264 PASS [ 0.044s] (246/520) iets provenance::tests::rewrite_leaves_unknown_text_alone265 PASS [ 0.014s] (247/520) iets remote::grpc::build::tests::topo_sort_puts_references_first266 PASS [ 0.017s] (248/520) iets remote::grpc::build::tests::the_timings_report_with_every_line267 PASS [ 0.020s] (249/520) iets remote::grpc::drvwire::tests::a_failure_keeps_its_message268 PASS [ 0.027s] (250/520) iets remote::grpc::drvwire::tests::basic_derivation_matches_the_cxx_field_order269 PASS [ 0.031s] (251/520) iets remote::grpc::drvwire::tests::an_unresolvable_input_output_is_an_error270 PASS [ 0.019s] (252/520) iets remote::grpc::health::tests::a_completed_build_clears_the_history271 PASS [ 0.027s] (253/520) iets remote::grpc::drvwire::tests::path_info_round_trips272 PASS [ 0.022s] (254/520) iets remote::grpc::health::tests::a_passed_cooldown_lets_one_caller_through273 PASS [ 0.024s] (255/520) iets remote::grpc::health::tests::two_bounces_refuse_it274 PASS [ 0.053s] (256/520) iets remote::grpc::health::tests::one_bounce_does_not_refuse_an_address275 PASS [ 0.021s] (257/520) iets remote::grpc::tests::defaults_match_the_cxx_settings276 PASS [ 0.050s] (258/520) iets remote::grpc::tests::a_token_needs_tls_and_unknown_parameters_are_errors277 PASS [ 0.019s] (259/520) iets remote::grpc::tests::every_parameter_parses278 PASS [ 0.012s] (260/520) iets remote::grpc::tests::insecure_is_a_bare_flag_or_a_boolean279 PASS [ 0.023s] (261/520) iets remote::grpc::tests::percent_escapes_decode_in_values280 PASS [ 0.026s] (262/520) iets remote::grpc::tests::mtls_needs_both_halves281 PASS [ 0.021s] (263/520) iets remote::plan::tests::hash_source_matches_nar_hash282 PASS [ 0.029s] (264/520) iets remote::plan::tests::memory_source_matches_dump_string283 PASS [ 0.150s] (265/520) iets remote::grpc::health::tests::one_address_does_not_refuse_another284 PASS [ 0.147s] (266/520) iets remote::grpc::health::tests::the_cooldown_grows_and_stops_at_30s285 PASS [ 5.252s] (267/520) iets api::value::tests::thunk_reads_as_thunk286 PASS [ 0.024s] (268/520) iets remote::worker::tests::a_status_over_a_byte_is_not_a_success287 PASS [ 0.024s] (269/520) iets remote::worker::tests::nix_sshopts_split_like_a_shell288 PASS [ 0.025s] (270/520) iets remote::worker::tests::an_ssh_host_is_never_an_option289 PASS [ 0.028s] (271/520) iets remote::worker::tests::ssh_argv_puts_the_host_first290 PASS [ 0.023s] (272/520) iets remote::worker::tests::transport_from_url291 PASS [ 0.022s] (273/520) iets remote::worker::wire::tests::build_results_are_read_as_nix_reads_them292 PASS [ 0.017s] (274/520) iets remote::worker::wire::tests::framed_sink_frames_and_terminates293 PASS [ 0.026s] (275/520) iets remote::worker::wire::tests::strings_are_padded294 PASS [ 0.021s] (276/520) iets remote::worker::wire::tests::replies_are_read_as_nix_reads_them295 PASS [ 0.210s] (277/520) iets remote::grpc::health::tests::an_unknown_address_is_usable296 PASS [ 5.333s] (278/520) iets api::value::tests::attrs_by_name_and_index297 PASS [ 0.028s] (279/520) iets runtime::value::alloc_tests::a_list_too_long_to_address_has_no_size298 PASS [ 0.256s] (280/520) iets remote::grpc::drvwire::tests::build_result_round_trips_a_daemon_reply299 PASS [ 0.036s] (281/520) iets runtime::value::layout::a_primop_pays_nothing_for_its_symbol300 PASS [ 0.021s] (282/520) iets settings::tests::a_project_file_holds_lint_and_nothing_else301 PASS [ 0.051s] (283/520) iets session::tests::two_sessions_share_no_state302 PASS [ 0.022s] (284/520) iets settings::tests::builder_reads_all_three_forms303 PASS [ 0.050s] (285/520) iets settings::tests::a_settings_file_may_hold_lint_and_the_other_sources_may_not304 PASS [ 0.030s] (286/520) iets settings::tests::a_wrong_type_names_the_key_and_the_file305 PASS [ 5.194s] (287/520) iets builtins::store_hooks::tests::virtual_tree_reads_go_to_the_local_files306 PASS [ 0.020s] (288/520) iets settings::tests::the_environment_wins_over_the_file307 PASS [ 0.029s] (289/520) iets settings::tests::source_map_adds_up_and_every_other_key_replaces308 PASS [ 0.030s] (290/520) iets settings::tests::each_source_wins_over_the_one_before309 PASS [ 0.116s] (291/520) iets settings::tests::a_flag_carries_several_places_separated_by_a_semicolon310 PASS [ 0.024s] (292/520) iets settings::tests::the_flag_leaves_the_argv311 PASS [ 0.016s] (293/520) iets settings::tests::the_flag_value_is_toml_when_it_reads_as_toml312 PASS [ 0.117s] (294/520) iets settings::tests::a_missing_file_is_skipped_and_the_defaults_hold313 PASS [ 0.021s] (295/520) iets settings::tests::the_flag_pairs_are_kept_for_a_second_iets314 PASS [ 0.057s] (296/520) iets settings::tests::the_file_is_the_users315 PASS [ 0.022s] (297/520) iets settings::tests::unknown_key_names_the_file316 PASS [ 0.031s] (298/520) iets settings::tests::the_user_file_turns_purity_off317 PASS [ 0.029s] (299/520) iets source::local::tests::only_a_content_addressed_store_path_names_its_content318 PASS [ 0.021s] (300/520) iets source::lock::tests::incomplete_locks_fail319 PASS [ 0.035s] (301/520) iets source::lock::tests::complete_lock_passes320 PASS [ 0.027s] (302/520) iets source::remote::tests::access_tokens_match_the_longest_prefix321 PASS [ 0.070s] (303/520) iets source::local::tests::accepted_set_adds_parent_directories322 PASS [ 0.064s] (304/520) iets source::local::tests::max_mtime_covers_root_and_children323 PASS [ 0.028s] (305/520) iets source::remote::tests::download_urls_match_the_fetchers324 PASS [ 0.024s] (306/520) iets source::remote::tests::nix_literal_escapes325 PASS [ 0.024s] (307/520) iets source::remote::tests::only_the_archive_types_are_fetched_by_iets326 PASS [ 0.029s] (308/520) iets source::scm::git::tests::a_directory_in_a_repository_is_found327 PASS [ 0.030s] (309/520) iets source::scm::ledger::tests::a_directory_in_a_working_tree_is_found328 PASS [ 5.897s] (310/520) iets api::value::tests::calling_a_function329 PASS [ 0.535s] (311/520) iets source::remote::tests::a_leftover_is_not_a_valid_path330 PASS [ 0.016s] (312/520) iets source::tests::dates331 PASS [ 0.021s] (313/520) iets store::drv::tests::a_dynamic_input_writes_the_versioned_aterm_and_parses_back332 PASS [ 0.017s] (314/520) iets store::drv::tests::an_env_key_named_json_is_refused333 PASS [ 0.018s] (315/520) iets store::drv::tests::fixed_output_from_scratch334 PASS [ 1.328s] (316/520) iets parallel::thunk::tests::many_fibers_force_one_shared_graph335 PASS [ 0.152s] (317/520) iets store::drv::tests::fixtures_output_paths_recompute336 PASS [ 0.312s] (318/520) iets store::drv::tests::fixtures_drv_path_matches_store_path337 PASS [ 0.031s] (319/520) iets store::drv::tests::fixtures_roundtrip_byte_exact338 PASS [ 0.027s] (320/520) iets store::drv::tests::input_addressed_multi_output_from_scratch339 PASS [ 0.028s] (321/520) iets store::drv::tests::input_drvs_hash_modulo_from_scratch340 PASS [ 0.023s] (322/520) iets store::drv::tests::masked_unparse_blanks_output_paths_and_env341 PASS [ 0.022s] (323/520) iets store::drv::tests::string_escapes_roundtrip342 PASS [ 0.031s] (324/520) iets store::drvdiff::tests::a_changed_input_drv_is_paired_by_name_and_recursed_into343 PASS [ 0.021s] (325/520) iets store::drvdiff::tests::an_input_source_an_added_input_drv_and_a_fixed_output_show_up344 PASS [ 0.023s] (326/520) iets store::drvdiff::tests::json_names_what_differs345 PASS [ 0.029s] (327/520) iets store::drvdiff::tests::env_name_shows_only_when_it_is_not_the_derivation_name346 PASS [ 0.018s] (328/520) iets store::drvdiff::tests::the_depth_limit_names_the_input_without_walking_it347 PASS [ 0.019s] (329/520) iets store::drvdiff::tests::the_local_fields_the_env_and_an_absent_value348 PASS [ 0.023s] (330/520) iets store::drvdiff::tests::the_same_derivation_is_empty349 PASS [ 0.022s] (331/520) iets store::hash::tests::base64_roundtrip350 PASS [ 0.009s] (332/520) iets store::hash::tests::compress_hash_xors351 PASS [ 0.011s] (333/520) iets store::hash::tests::empty_sha256352 PASS [ 0.010s] (334/520) iets store::hash::tests::nix32_roundtrip_and_reject353 PASS [ 0.020s] (335/520) iets store::hash::tests::md5_nix32354 PASS [ 0.015s] (336/520) iets store::hash::tests::parse_any_all_formats355 PASS [ 0.014s] (337/520) iets store::hash::tests::sha256_nix32356 PASS [ 0.024s] (338/520) iets store::hash::tests::sha1_nix32357 PASS [ 0.007s] (339/520) iets store::hash::tests::sha512_nix32_base64358 PASS [ 0.009s] (340/520) iets store::hash::tests::sha256_sri359 PASS [ 0.007s] (341/520) iets store::hash::tests::streaming_matches_oneshot360 PASS [ 0.009s] (342/520) iets store::nar::tests::directory_nar361 PASS [ 0.010s] (343/520) iets store::nar::tests::directory_nar_hash_formats362 PASS [ 0.010s] (344/520) iets store::nar::tests::filter_sees_types_and_paths363 PASS [ 0.019s] (345/520) iets store::nar::tests::executable_file_nar364 PASS [ 0.011s] (346/520) iets store::nar::tests::readers_refuse_what_nix_refuses365 PASS [ 0.016s] (347/520) iets store::nar::tests::regular_file_nar366 PASS [ 0.012s] (348/520) iets store::nar::tests::restore_rejects_garbage367 PASS [ 0.010s] (349/520) iets store::nar::tests::symlink_nar368 PASS [ 0.016s] (350/520) iets store::nar::tests::restore_roundtrip369 PASS [ 0.011s] (351/520) iets store::path::tests::a_multibyte_char_across_the_hash_part_is_an_error370 PASS [ 0.011s] (352/520) iets store::path::tests::check_name_rules371 PASS [ 0.010s] (353/520) iets store::path::tests::filter_source372 PASS [ 0.010s] (354/520) iets store::path::tests::fixed_flat_sha1373 PASS [ 0.015s] (355/520) iets store::path::tests::fixed_flat_sha256374 PASS [ 0.021s] (356/520) iets store::path::tests::fixed_recursive_sha256375 PASS [ 0.009s] (357/520) iets store::path::tests::output_names376 PASS [ 0.016s] (358/520) iets store::path::tests::path_copy_directory377 PASS [ 0.020s] (359/520) iets store::path::tests::parse_and_accessors378 PASS [ 0.010s] (360/520) iets store::path::tests::path_with_name379 PASS [ 0.023s] (361/520) iets store::path::tests::path_copy_file380 PASS [ 0.018s] (362/520) iets store::path::tests::placeholder381 PASS [ 0.018s] (363/520) iets store::path::tests::to_file382 PASS [ 0.186s] (364/520) iets store::path::tests::to_file_with_reference383 PASS [ 0.181s] (365/520) iets syntax::tests::a_line_ends_at_cr_lf_and_lone_cr384 PASS [ 0.028s] (366/520) iets syntax::tests::allow_comments385 PASS [ 0.026s] (367/520) iets syntax::tests::an_interpolated_name_is_static_when_nix_has_one_string_node386 PASS [ 0.033s] (368/520) iets syntax::tests::attrs_and_bindings387 PASS [ 0.032s] (369/520) iets syntax::tests::comments_and_misc388 PASS [ 0.042s] (370/520) iets syntax::tests::end_of_file_inside_a_path_is_at_its_last_token389 PASS [ 0.024s] (371/520) iets syntax::tests::indented_string_stripping390 PASS [ 0.026s] (372/520) iets syntax::tests::json_gives_every_node_its_kind_and_span391 PASS [ 0.020s] (373/520) iets syntax::tests::lambdas392 PASS [ 1.814s] (374/520) iets runtime::value::tests::union_lookup_agrees_with_iteration393 PASS [ 0.017s] (375/520) iets syntax::tests::line_col_counts_bytes394 PASS [ 0.042s] (376/520) iets syntax::tests::nul_in_string_literals395 PASS [ 0.127s] (377/520) iets syntax::tests::numbers396 PASS [ 0.030s] (378/520) iets syntax::tests::operator_precedence397 PASS [ 0.041s] (379/520) iets syntax::tests::paths398 PASS [ 0.051s] (380/520) iets syntax::tests::spans_cover_tokens399 PASS [ 0.022s] (381/520) iets syntax::tests::string_escapes_and_interpolation400 PASS [ 0.016s] (382/520) iets syntax::tests::the_error_reported_is_the_one_nix_meets_first401 PASS [ 0.015s] (383/520) iets trace::key::tests::key_is_order_and_value_sensitive402 PASS [ 0.019s] (384/520) iets trace::key::tests::relative_path_detection403 PASS [ 0.011s] (385/520) iets trace::store::tests::a_reader_of_one_generation_never_sees_the_next404 PASS [ 0.009s] (386/520) iets trace::store::tests::bytes_that_are_not_an_entry_are_bad_not_a_panic405 PASS [ 0.017s] (387/520) iets trace::store::tests::one_rename_publishes_every_part406 PASS [ 0.021s] (388/520) iets trace::tests::dedupe_keeps_conflicting_values407 PASS [ 0.785s] (389/520) iets syntax::tests::lang_corpus408 PASS [ 0.024s] (390/520) iets trace::tests::dump_fingerprint_matches_the_separate_walk409 PASS [ 0.030s] (391/520) iets trace::tests::fingerprint_changes_with_content_size_and_seen_entries410 PASS [ 0.066s] (392/520) iets trace::tests::only_a_named_query_is_an_observation411 PASS [ 0.065s] (393/520) iets trace::validate::dir_hash_tests::dir_hash_agrees_with_dir_listing_hash412 PASS [ 0.056s] (394/520) iets trace::validate::tests::a_copy_in_place_that_keeps_the_stat_still_misses413 PASS [ 0.040s] (395/520) iets trace::validate::tests::dir_stat_env_checks414 PASS [ 0.051s] (396/520) iets trace::validate::tests::file_touch_refreshes_edit_misses415 PASS [ 0.082s] (397/520) iets trace::validate::tests::the_lowest_failing_observation_is_the_one_reported416 PASS [ 0.039s] (398/520) iets trace::watch::tests::only_the_paths_an_mtime_can_speak_for417 PASS [ 0.053s] (399/520) iets trace::wire::tests::drvs_sources_roots_roundtrip418 PASS [ 0.014s] (400/520) iets trace::wire::tests::readset_roundtrip419 PASS [ 0.052s] (401/520) iets treestore::pack::tests::a_changed_index_byte_is_not_a_pack420 PASS [ 0.034s] (402/520) iets treestore::pack::tests::a_pack_reads_back_what_was_written421 PASS [ 0.024s] (403/520) iets treestore::pack::tests::a_reader_sees_a_pack_written_after_it_listed422 PASS [ 0.032s] (404/520) iets treestore::pack::tests::a_set_finds_objects_across_packs_and_drops_a_broken_one423 PASS [ 0.060s] (405/520) iets treestore::pack::tests::an_empty_writer_leaves_no_file424 PASS [ 0.032s] (406/520) iets treestore::pack::tests::collect_removes_dead_packs_and_compacts_mostly_dead_ones425 PASS [ 0.031s] (407/520) iets treestore::tests::a_flat_file_is_named_by_the_hash_of_its_bytes426 PASS [ 0.046s] (408/520) iets treestore::tests::a_put_after_a_collection_brings_its_own_objects427 PASS [ 0.012s] (409/520) iets treestore::tests::a_staged_directory_goes_when_it_is_dropped428 PASS [ 0.033s] (410/520) iets treestore::tests::a_stored_input_reads_back_and_a_wrong_hash_is_refused429 PASS [ 0.019s] (411/520) iets treestore::tests::a_tree_is_named_by_its_nar_hash430 PASS [ 0.040s] (412/520) iets treestore::tests::collect_keeps_what_an_entry_names431 PASS [ 0.040s] (413/520) iets treestore::tests::two_inputs_share_their_common_files432 PASS [ 0.042s] (414/520) iets::aterm_crosscheck bytes_that_are_not_utf8_roundtrip433 PASS [ 3.396s] (415/520) iets source::scm::ledger::tests::the_metadata_has_the_mark_of_its_tree434 PASS [ 0.010s] (416/520) iets::aterm_crosscheck fixed_output_inputs_hide_their_provenance435 PASS [ 0.013s] (417/520) iets::aterm_crosscheck fixed_output_path_is_recomputed_not_trusted436 PASS [ 0.008s] (418/520) iets::aterm_crosscheck floating_ca_defers_itself_and_downstream437 PASS [ 0.010s] (419/520) iets::aterm_crosscheck harmonia_cases_roundtrip438 PASS [ 0.007s] (420/520) iets::aterm_crosscheck malformed_aterm_is_an_error439 PASS [ 0.018s] (421/520) iets::aterm_crosscheck masked_and_unmasked_hashes_differ_once_filled440 PASS [ 0.024s] (422/520) iets::aterm_crosscheck upstream_bench_drvs_parse_and_reprint_stably441 PASS [ 0.027s] (423/520) iets::aterm_crosscheck upstream_drvs_roundtrip_byte_exact442 PASS [ 0.085s] (424/520) iets::aterm_crosscheck upstream_bad_drvs_are_rejected443 PASS [ 0.019s] (425/520) iets::aterm_crosscheck upstream_input_addressed_paths_recompute444 PASS [ 0.016s] (426/520) iets::aterm_crosscheck upstream_invariants_fill_in_deferred445 PASS [ 0.017s] (427/520) iets::aterm_crosscheck upstream_invariants_ca_floating_dependency446 PASS [ 0.028s] (428/520) iets::aterm_crosscheck upstream_invariants_input_addressed_kept_or_rejected447 PASS [ 0.051s] (429/520) iets::cache_hygiene a_cache_is_private_to_its_owner448 PASS [ 0.039s] (430/520) iets::cache_hygiene a_corrupt_entry_is_dropped_and_a_corrupt_store_is_wiped449 PASS [ 0.082s] (431/520) iets::cache_hygiene a_changed_byte_or_a_copied_entry_is_a_miss450 PASS [ 0.015s] (432/520) iets::cache_hygiene an_entry_that_is_not_a_plain_file_is_refused451 PASS [ 0.035s] (433/520) iets::cache_hygiene an_input_observation_marks_its_entry_as_used452 PASS [ 2.094s] (434/520) iets trace::tests::dedupe_of_many_repeats_is_linear453 PASS [ 0.834s] (435/520) iets::cache_hygiene a_killed_writer_leaves_the_store_usable454 PASS [ 0.273s] (436/520) iets::cache_hygiene crash_writer_child455 PASS [ 0.017s] (437/520) iets::cache_hygiene input_touch_child456 PASS [ 10.610s] (438/520) iets api::value::tests::wrong_type_is_an_error457 PASS [ 10.992s] (439/520) iets builtins::fetch::tests::an_entry_of_the_compiled_file_cache_keeps_the_site458 PASS [ 2.802s] (440/520) iets::cache_hygiene concurrent_readers_and_writers_never_see_a_torn_entry459 PASS [ 3.288s] (441/520) iets::cache_hygiene cache_gc_removes_entries_past_the_ttl460 PASS [ 7.089s] (442/520) iets source::scm::ledger::tests::a_name_resolves_to_a_revision_and_a_revision_has_a_tree461 PASS [ 0.293s] (443/520) iets::events a_group_that_does_not_exist_is_a_settings_error462 PASS [ 12.254s] (444/520) iets eval::tests::a_function_select_is_a_fresh_slot_when_its_subject_is_forced463 PASS [ 7.529s] (445/520) iets source::scm::ledger::tests::a_change_of_the_ledger_is_a_change_of_the_working_tree464 PASS [ 13.225s] (446/520) iets builtins::fetch::tests::the_mark_follows_the_string_like_store_context465 PASS [ 8.326s] (447/520) iets source::scm::ledger::tests::an_untracked_file_is_the_error_of_nix466 PASS [ 14.042s] (448/520) iets api::value::tests::construction467 PASS [ 13.455s] (449/520) iets eval::tests::from_json_and_toml_reject_null_bytes468 PASS [ 10.800s] (450/520) iets jobs::tests::a_numeric_name_selects_an_attribute_under_a_set469 PASS [ 16.216s] (451/520) iets api::value::tests::force_deep_forces_the_whole_tree470 PASS [ 0.534s] (452/520) iets::help_topics a_page_the_binary_does_not_carry_names_its_path471 PASS [ 16.775s] (453/520) iets api::value::tests::strings_and_context472 PASS [ 0.173s] (454/520) iets::help_topics an_unknown_topic_is_a_usage_error_with_a_suggestion473 PASS [ 16.895s] (455/520) iets builtins::fetch::tests::the_first_read_of_a_tree_gives_its_finding474 PASS [ 0.252s] (456/520) iets::help_topics help_lists_the_topics475 PASS [ 0.102s] (457/520) iets::layering porcelain_signatures_name_no_evaluator_value476 PASS [ 0.079s] (458/520) iets::nar_parity dump_is_byte_identical_to_nix_store_dump477 PASS [ 15.284s] (459/520) iets eval::tests::update_forces_the_right_operand_first478 PASS [ 0.022s] (460/520) iets::nar_parity every_node_hashes_like_nix479 PASS [ 0.027s] (461/520) iets::nar_parity reader_caps_names_and_targets480 PASS [ 0.039s] (462/520) iets::nar_parity parse_length_matches_nix481 PASS [ 0.067s] (463/520) iets::nar_parity restore_round_trips_the_awkward_tree482 PASS [ 5.077s] (464/520) iets::cli io_errors_read_like_strerror483 PASS [ 17.184s] (465/520) iets eval::tests::nix_eq_forces_what_the_shortcut_skips484 PASS [ 12.080s] (466/520) iets source::scm::ledger::tests::the_tracked_files_and_the_metadata_are_the_tree485 PASS [ 18.107s] (467/520) iets api::value::tests::missing_attribute486 PASS [ 1.482s] (468/520) iets::help_topics a_topic_prints_its_page487 PASS [ 1.351s] (469/520) iets::layering porcelain_names_no_layer_below_the_api488 PASS [ 17.789s] (470/520) iets eval::tests::an_invalid_regex_fails_before_the_string_is_forced489 PASS [ 17.599s] (471/520) iets eval::tests::sets_compare_in_the_symbol_order_of_nix490 PASS [ 0.837s] (472/520) iets::profile a_profile_that_is_not_eval_is_a_settings_error491 PASS [ 1.243s] (473/520) iets::profile a_profile_refuses_more_than_one_worker492 PASS [ 8.212s] (474/520) iets::cli help_and_version_go_to_stdout493 PASS [ 6.513s] (475/520) iets::help_topics a_command_wins_over_a_topic_of_the_same_name494 PASS [ 22.089s] (476/520) iets api::value::tests::apply_is_lazy495 PASS [ 16.787s] (477/520) iets runtime::value::alloc_tests::a_speculated_thunk_is_forced_but_not_demanded496 PASS [ 5.815s] (478/520) iets::profile a_run_shorter_than_a_tick_says_it_sampled_nothing497 PASS [ 23.130s] (479/520) iets eval::tests::laziness_and_recursion498 PASS [ 5.557s] (480/520) iets::pure a_directory_with_no_marker_is_its_own_project499 PASS [ 10.694s] (481/520) iets::events the_sink_is_its_own_knob500 PASS [ 6.928s] (482/520) iets::profile an_unprofiled_run_says_nothing_about_a_profile501 FAIL [ 14.559s] (483/520) iets::events a_text_add_names_its_size_and_its_position502 stdout ---503504 running 1 test505 test a_text_add_names_its_size_and_its_position ... FAILED506507 failures:508509 failures:510 a_text_add_names_its_size_and_its_position511512 test result: FAILED. 0 passed; 1 failed; 0 ignored; 0 measured; 5 filtered out; finished in 14.54s513 514 stderr ---515516 thread 'a_text_add_names_its_size_and_its_position' (2253) panicked at tests/events.rs:37:5:517 ⏵ evaluating the expression (5s)518 {"event":"store-add","path":"/nix/store/hxk820apsjsq6709id0vbfsikipvfka6-t","kind":"text","size":2,"from":"text","at":"«string»:1:4"}519520 note: run with `RUST_BACKTRACE=1` environment variable to display a backtrace521522 Cancelling due to test failure: 37 tests still running523 PASS [ 17.994s] (484/520) iets::cli a_bad_command_line_names_the_problem524 PASS [ 26.893s] (485/520) iets eval::tests::try_eval_and_errors525 PASS [ 27.620s] (486/520) iets eval::tests::derivation_keeps_env_and_args_that_are_not_utf8526 PASS [ 9.557s] (487/520) iets::pure the_pure_setting_is_the_users_alone527 PASS [ 9.827s] (488/520) iets::pure the_other_purity_rules_hold_without_a_flag528 PASS [ 28.094s] (489/520) iets builtins::fetch::tests::the_tree_decides_the_level529 PASS [ 27.600s] (490/520) iets eval::tests::fetchurl_needs_a_sha256_in_every_mode530 PASS [ 28.097s] (491/520) iets builtins::fetch::tests::a_read_that_is_not_a_selection_has_no_site531 PASS [ 22.827s] (492/520) iets source::scm::ledger::tests::the_count_is_lazy_and_kept_by_revision532 PASS [ 15.548s] (493/520) iets::events a_tree_add_names_the_local_path_it_copied533 PASS [ 28.260s] (494/520) iets eval::tests::reading_a_derivation_output_is_unsupported534 PASS [ 28.388s] (495/520) iets eval::tests::equality535 PASS [ 15.273s] (496/520) iets::fetchurl a_wrong_hash_is_refused_with_the_hash_the_file_has536 PASS [ 28.644s] (497/520) iets eval::tests::fetchurl_checks_its_argument_like_nix537 PASS [ 28.646s] (498/520) iets eval::tests::printing538 PASS [ 29.517s] (499/520) iets eval::tests::arithmetic_and_strings539 PASS [ 30.026s] (500/520) iets compile::cache::tests::a_changed_byte_never_makes_the_evaluator_read_past_its_env540 PASS [ 29.836s] (501/520) iets eval::tests::scoping541 PASS [ 30.687s] (502/520) iets builtins::fetch::tests::a_read_of_the_count_is_one_finding_for_each_tree542 PASS [ 30.876s] (503/520) iets api::value::tests::scalars543 PASS [ 12.775s] (504/520) iets::pure a_read_in_the_project_is_pure_and_one_above_it_is_not544 PASS [ 17.223s] (505/520) iets::fetchurl without_a_hash_no_evaluation_fetches_and_prefetch_gives_the_hash545 PASS [ 19.053s] (506/520) iets::events a_group_nobody_named_says_nothing546 PASS [ 31.493s] (507/520) iets builtins::fetch::tests::a_selection_of_the_count_is_the_site547 PASS [ 18.666s] (508/520) iets::events all_takes_the_cold_groups548 PASS [ 18.106s] (509/520) iets::fetchurl a_hashed_fetch_has_the_store_path_nix_gives549 PASS [ 32.234s] (510/520) iets api::run::tests::the_counters_cover_the_helper_fibers550 PASS [ 31.765s] (511/520) iets eval::tests::attrs_and_lists551 PASS [ 16.847s] (512/520) iets::profile a_builtin_names_itself_in_a_frame552 PASS [ 26.058s] (513/520) iets::cli dash_f_names_the_file_in_the_native_namespace553 PASS [ 37.108s] (514/520) iets builtins::fetch::tests::the_name_on_a_value_that_is_not_a_tree_is_silent554 PASS [ 40.568s] (515/520) iets api::run::tests::helper_fibers_read_the_ir_cache555 PASS [ 24.551s] (516/520) iets::profile a_folded_line_is_a_stack_and_a_count556 PASS [ 47.724s] (517/520) iets eval::tests::pure_eval_answers_like_nix557 PASS [ 33.172s] (518/520) iets::profile an_allocation_profile_accounts_for_the_arena558 PASS [ 55.659s] (519/520) iets syntax::tests::deep_nesting_ends_with_an_error559 SLOW [> 60.000s] (-------) iets runtime::value::tests::union_iteration_merges_like_a_fold560 SLOW [>120.000s] (-------) iets runtime::value::tests::union_iteration_merges_like_a_fold561 SLOW [>180.000s] (-------) iets runtime::value::tests::union_iteration_merges_like_a_fold562 SLOW [>240.000s] (-------) iets runtime::value::tests::union_iteration_merges_like_a_fold563 SLOW [>300.000s] (-------) iets runtime::value::tests::union_iteration_merges_like_a_fold564 SLOW [>360.000s] (-------) iets runtime::value::tests::union_iteration_merges_like_a_fold565 SLOW [>420.000s] (-------) iets runtime::value::tests::union_iteration_merges_like_a_fold566 SLOW [>480.000s] (-------) iets runtime::value::tests::union_iteration_merges_like_a_fold567 SLOW [>540.000s] (-------) iets runtime::value::tests::union_iteration_merges_like_a_fold568 SLOW [>600.000s] (-------) iets runtime::value::tests::union_iteration_merges_like_a_fold569 SLOW [>660.000s] (-------) iets runtime::value::tests::union_iteration_merges_like_a_fold570 SLOW [>720.000s] (-------) iets runtime::value::tests::union_iteration_merges_like_a_fold571 SLOW [>780.000s] (-------) iets runtime::value::tests::union_iteration_merges_like_a_fold572 PASS [ 806.387s] (520/520) iets runtime::value::tests::union_iteration_merges_like_a_fold573------------574 Summary [ 812.101s] 520 tests run: 519 passed (1 slow), 1 failed, 5 skipped575 FAIL [ 14.559s] (483/520) iets::events a_text_add_names_its_size_and_its_position576error: test run failed