nixbot

builds

succeeded setup checks.x86_64-linux.test · build #8 · raw

1this derivation will be built:2 /nix/store/gdfz2g46k1lgq3iyplxd04qkcvlw0zvp-iets-test-0.1.0.drv3error: Cannot build '/nix/store/gdfz2g46k1lgq3iyplxd04qkcvlw0zvp-iets-test-0.1.0.drv'.4 Reason: builder failed with exit code 101.5 Output paths:6 /nix/store/rwgqcjs4whvpfjfb5vfhyvrinjmbhy88-iets-test-0.1.07 Last 25 log lines:8 > thread 'fetch::http::tests::credentials_in_the_url_are_sent_and_never_printed' (5385) panicked at src/fetch/http.rs:986:57:9 > called `Result::unwrap()` on an `Err` value: Usage("cannot fetch 'http://user:***@127.0.0.1:41681/x': no response (stalled-download-timeout)")10 >11 > ---- fetch::http::tests::credentials_stay_on_the_first_origin stdout ----12 >13 > thread 'fetch::http::tests::credentials_stay_on_the_first_origin' (5386) panicked at src/fetch/http.rs:889:59:14 > called `Result::unwrap()` on an `Err` value: Usage("cannot fetch 'http://127.0.0.1:45553/': no response (stalled-download-timeout)")15 >16 > ---- progress::tests::a_transfer_that_does_not_move_says_so stdout ----17 >18 > thread 'progress::tests::a_transfer_that_does_not_move_says_so' (5513) panicked at src/progress.rs:444:9:19 > assertion `left == right` failed20 > left: "⏵ downloading 'u', 2.0 KiB (46s, no data for 46s)"21 > right: "⏵ downloading 'u', 2.0 KiB (45s, no data for 45s)"22 >23 >24 > failures:25 > fetch::http::tests::a_transient_status_is_retried26 > fetch::http::tests::credentials_in_the_url_are_sent_and_never_printed27 > fetch::http::tests::credentials_stay_on_the_first_origin28 > progress::tests::a_transfer_that_does_not_move_says_so29 >30 > test result: FAILED. 444 passed; 4 failed; 5 ignored; 0 measured; 0 filtered out; finished in 90.88s31 >32 > error: test failed, to rerun pass `--lib`33 For full logs, run:34 nix log /nix/store/gdfz2g46k1lgq3iyplxd04qkcvlw0zvp-iets-test-0.1.0.drv