nixbot

builds

failed iets-nextest-0.2.0 checks.aarch64-linux.test · build #709 · raw

1elastic-arm-23d67df9: building dvi4qyv3wrd0carzdqpljl6pfliqflj4-iets-nextest-0.2.0.drv
unpackPhase
2unpacking source archive /nix/store/49vj0lmqbs50byc1j5d0069n79lzfi9x-source3source root is source
patchPhase
4Executing configureCargoCommonVars5decompressing cargo artifacts from /nix/store/85z9b7wjdsl61i3g9mfriixrg2klaph9-iets-deps-0.2.0/target.tar.zst to target
configurePhase
6will append /build/source/.cargo-home/config.toml with contents of /nix/store/3gsw1sxls8y5k26hv3pl9685hy9wrh61-vendor-cargo-deps/config.toml7default configurePhase, nothing to do
buildPhase
8+++ command cargo --version9cargo 1.99.0 (5f94df478 2026-08-27)10+++ command cargo nextest --version11cargo-nextest 0.9.14612release: 0.9.14613host: aarch64-unknown-linux-gnu
checkPhase
14+++ command cargo nextest run --cargo-profile dev15 Compiling iets v0.2.0 (/build/source)16 Finished `dev` profile [unoptimized + debuginfo] target(s) in 1m 24s17------------18 Nextest run ID 737c4baf-191c-4b17-88d7-34069a169d34 with nextest profile: default19 Starting 1760 tests across 33 binaries (6 tests skipped)20 PASS [ 0.132s] ( 1/1760) iets api::concurrent_eval::concurrent_eval_matches_sequential_eval::case_03_cycle21 PASS [ 0.137s] ( 2/1760) iets api::concurrent_eval::concurrent_eval_matches_sequential_eval::case_04_cycle_two_ranges22 PASS [ 0.136s] ( 3/1760) iets api::concurrent_eval::concurrent_eval_matches_sequential_eval::case_05_cycle_deep23 PASS [ 0.163s] ( 4/1760) iets api::concurrent_eval::concurrent_eval_matches_sequential_eval::case_06_error_elem24 PASS [ 0.128s] ( 5/1760) iets api::concurrent_eval::concurrent_eval_matches_sequential_eval::case_07_try_eval25 PASS [ 0.149s] ( 6/1760) iets api::concurrent_eval::concurrent_eval_matches_sequential_eval::case_08_trace_once26 PASS [ 0.497s] ( 7/1760) iets api::concurrent_eval::concurrent_eval_matches_sequential_eval::case_02_deep_attrs27 PASS [ 0.529s] ( 8/1760) iets api::concurrent_eval::concurrent_eval_matches_sequential_eval::case_01_shared_graph28 PASS [ 0.153s] ( 9/1760) iets api::concurrent_eval::concurrent_eval_matches_sequential_eval::case_09_warn_once29 PASS [ 0.123s] ( 10/1760) iets api::concurrent_eval::concurrent_eval_matches_sequential_eval::case_10_import_shared30 PASS [ 0.147s] ( 11/1760) iets api::concurrent_eval::concurrent_eval_matches_sequential_eval::case_11_drv31 PASS [ 0.119s] ( 12/1760) iets api::concurrent_eval::concurrent_eval_matches_sequential_eval::case_12_json32 PASS [ 0.128s] ( 13/1760) iets api::concurrent_eval::concurrent_eval_matches_sequential_eval::case_16_nan33 PASS [ 0.432s] ( 14/1760) iets api::concurrent_eval::concurrent_eval_matches_sequential_eval::case_15_print_code_single34 PASS [ 0.533s] ( 15/1760) iets api::concurrent_eval::concurrent_eval_matches_sequential_eval::case_14_print_code35 PASS [ 2.976s] ( 16/1760) iets api::concurrent_eval::concurrent_eval_matches_sequential_eval::case_17_deep_chain36 PASS [ 3.100s] ( 17/1760) iets api::concurrent_eval::concurrent_eval_matches_sequential_eval::case_18_failing_shared37 PASS [ 4.772s] ( 18/1760) iets api::concurrent_eval::concurrent_eval_matches_sequential_eval::case_13_fn_identity38 PASS [ 5.556s] ( 19/1760) iets api::concurrent_eval::concurrent_eval_matches_sequential_eval::case_19_lint_speculated39 PASS [ 4.616s] ( 20/1760) iets api::concurrent_eval::concurrent_eval_matches_sequential_eval::case_20_lint_demanded40 PASS [ 12.902s] ( 21/1760) iets api::concurrent_eval::concurrent_eval_matches_sequential_eval::case_21_lint_ahead41 PASS [ 14.725s] ( 22/1760) iets api::concurrent_eval::concurrent_eval_matches_sequential_eval::case_24_lint_shared_ahead42 PASS [ 22.160s] ( 23/1760) iets api::concurrent_eval::concurrent_eval_matches_sequential_eval::case_22_trace_ahead43 PASS [ 22.382s] ( 24/1760) iets api::concurrent_eval::concurrent_eval_matches_sequential_eval::case_23_warn_ahead44 PASS [ 3.952s] ( 25/1760) iets api::concurrent_eval::concurrent_eval_matches_sequential_eval::case_28_lint_try_helper45 PASS [ 10.772s] ( 26/1760) iets api::concurrent_eval::concurrent_eval_matches_sequential_eval::case_26_lint_shared_helper46 PASS [ 7.768s] ( 27/1760) iets api::concurrent_eval::concurrent_eval_matches_sequential_eval::case_27_lint_map_twice47 PASS [ 18.176s] ( 28/1760) iets api::concurrent_eval::concurrent_eval_matches_sequential_eval::case_25_trace_shared_ahead48 PASS [ 0.087s] ( 29/1760) iets api::concurrent_eval::concurrent_eval_matches_sequential_eval::case_31_drv_demanded49 PASS [ 3.407s] ( 30/1760) iets api::concurrent_eval::concurrent_eval_matches_sequential_eval::case_30_drv_speculated50 PASS [ 2.177s] ( 31/1760) iets api::concurrent_eval::concurrent_eval_matches_sequential_eval::case_33_route_select51 PASS [ 3.516s] ( 32/1760) iets api::concurrent_eval::concurrent_eval_matches_sequential_eval::case_32_route_local52 PASS [ 6.381s] ( 33/1760) iets api::concurrent_eval::concurrent_eval_matches_sequential_eval::case_29_lint_shared_map53 PASS [ 2.334s] ( 34/1760) iets api::concurrent_eval::concurrent_eval_matches_sequential_eval::case_34_route_apply54 PASS [ 2.547s] ( 35/1760) iets api::concurrent_eval::concurrent_eval_matches_sequential_eval::case_35_route_concat55 PASS [ 2.004s] ( 36/1760) iets api::concurrent_eval::concurrent_eval_matches_sequential_eval::case_37_route_filter56 PASS [ 1.858s] ( 37/1760) iets api::concurrent_eval::concurrent_eval_matches_sequential_eval::case_38_route_attr_values57 PASS [ 2.963s] ( 38/1760) iets api::concurrent_eval::concurrent_eval_matches_sequential_eval::case_36_route_tail58 PASS [ 1.828s] ( 39/1760) iets api::concurrent_eval::concurrent_eval_matches_sequential_eval::case_39_route_cat_attrs59 PASS [ 1.903s] ( 40/1760) iets api::concurrent_eval::concurrent_eval_matches_sequential_eval::case_40_route_list_to_attrs60 PASS [ 2.036s] ( 41/1760) iets api::concurrent_eval::concurrent_eval_matches_sequential_eval::case_41_route_update61 PASS [ 1.933s] ( 42/1760) iets api::concurrent_eval::concurrent_eval_matches_sequential_eval::case_42_route_inherit_from62 PASS [ 2.089s] ( 43/1760) iets api::concurrent_eval::concurrent_eval_matches_sequential_eval::case_43_route_rec_attrs63 PASS [ 2.108s] ( 44/1760) iets api::concurrent_eval::concurrent_eval_matches_sequential_eval::case_44_route_map_arg64 PASS [ 1.896s] ( 45/1760) iets api::concurrent_eval::concurrent_eval_matches_sequential_eval::case_45_route_map_attrs65 PASS [ 2.073s] ( 46/1760) iets api::concurrent_eval::concurrent_eval_matches_sequential_eval::case_46_route_zip_attrs66 PASS [ 1.988s] ( 47/1760) iets api::concurrent_eval::concurrent_eval_matches_sequential_eval::case_47_route_with_scope67 PASS [ 1.840s] ( 48/1760) iets api::concurrent_eval::concurrent_eval_matches_sequential_eval::case_48_route_remove_attrs68 PASS [ 0.012s] ( 49/1760) iets api::drvshow::tests::a_non_canonical_structured_attrs_text_is_renormalised69 PASS [ 0.028s] ( 50/1760) iets api::concurrent_eval::every_case_has_a_test70 PASS [ 0.029s] ( 51/1760) iets api::drvshow::tests::floats_take_nlohmanns_form71 PASS [ 0.018s] ( 52/1760) iets api::drvshow::tests::json::case_1_a_multi_output_derivation72 PASS [ 0.007s] ( 53/1760) iets api::drvshow::tests::pretty_matches_serde_json73 PASS [ 0.010s] ( 54/1760) iets api::drvshow::tests::json::case_2_a_fixed_output_shows_its_content_address_and_no_path74 PASS [ 0.010s] ( 55/1760) iets api::fetch::tests::only_a_fixed_output_drv_can_be_prefetched75 PASS [ 0.009s] ( 56/1760) iets api::fetch::tests::the_fake_hash_moves_the_output_and_the_drv76 PASS [ 0.019s] ( 57/1760) iets api::drvshow::tests::json::case_3_inputs_and_structured_attrs77 PASS [ 1.884s] ( 58/1760) iets api::concurrent_eval::concurrent_eval_matches_sequential_eval::case_49_route_intersect_attrs78 PASS [ 0.013s] ( 59/1760) iets api::installable::tests::default_and_fragment_attr_paths79 PASS [ 0.023s] ( 60/1760) iets api::run::tests::a_fiber_template_carries_the_configuration80 PASS [ 0.032s] ( 61/1760) iets api::installable::tests::the_name_a_program_takes_from_a_derivation_name81 PASS [ 0.028s] ( 62/1760) iets api::value::tests::apply_is_lazy82 PASS [ 0.029s] ( 63/1760) iets api::value::tests::attrs_by_name_and_index83 PASS [ 0.028s] ( 64/1760) iets api::value::tests::calling_a_function84 PASS [ 0.018s] ( 65/1760) iets api::value::tests::construction85 PASS [ 0.021s] ( 66/1760) iets api::value::tests::force_deep_forces_the_whole_tree86 PASS [ 0.017s] ( 67/1760) iets api::value::tests::strings_and_context87 PASS [ 0.028s] ( 68/1760) iets api::value::tests::lists88 PASS [ 0.028s] ( 69/1760) iets api::value::tests::missing_attribute89 PASS [ 0.015s] ( 70/1760) iets build::backend::tests::base_names_drop_the_store_dir90 PASS [ 0.028s] ( 71/1760) iets api::value::tests::thunk_reads_as_thunk91 PASS [ 0.022s] ( 72/1760) iets api::value::tests::wrong_type_is_an_error92 PASS [ 0.020s] ( 73/1760) iets argv::tests::every_byte_round_trips93 PASS [ 0.053s] ( 74/1760) iets api::value::tests::scalars94 PASS [ 0.020s] ( 75/1760) iets build::backend::tests::the_timings_report_with_every_line95 PASS [ 0.020s] ( 76/1760) iets build::event::tests::durations96 PASS [ 0.017s] ( 77/1760) iets build::executor::tests::a_declared_system_filters97 PASS [ 0.024s] ( 78/1760) iets build::backend::tests::output_specs98 PASS [ 0.022s] ( 79/1760) iets build::executor::tests::a_feature_the_place_lacks_rules_it_out99 PASS [ 0.021s] ( 80/1760) iets build::executor::tests::no_place_at_all_is_a_usage_error100 PASS [ 0.023s] ( 81/1760) iets build::executor::tests::an_unsupported_url_says_what_is_expected101 PASS [ 0.020s] ( 82/1760) iets build::executor::tests::one_place_declaring_nothing_takes_everything102 PASS [ 0.024s] ( 83/1760) iets build::executor::tests::a_refusal_names_every_place_and_what_it_declared103 PASS [ 0.011s] ( 84/1760) iets build::fixhash::tests::a_longer_hash_is_not_a_match104 PASS [ 0.020s] ( 85/1760) iets build::executor::tests::the_first_place_that_takes_it_wins105 PASS [ 0.020s] ( 86/1760) iets build::fanout::tests::dependencies_run_first106 PASS [ 0.030s] ( 87/1760) iets build::fanout::tests::a_failed_dependency_blocks_its_dependants107 PASS [ 0.022s] ( 88/1760) iets build::fixhash::tests::two_matches_are_left_alone108 PASS [ 0.020s] ( 89/1760) iets build::render::tests::a_build_log_never_reports_a_mismatch109 PASS [ 0.032s] ( 90/1760) iets build::fixhash::tests::one_match_is_rewritten_in_its_own_spelling110 PASS [ 0.024s] ( 91/1760) iets build::render::tests::a_build_the_backend_saw_succeed_is_verdicted_at_once111 PASS [ 0.020s] ( 92/1760) iets build::render::tests::a_daemon_failure_message_decides_the_verdict112 PASS [ 0.019s] ( 93/1760) iets build::render::tests::a_failure_after_the_activity_ended_never_claims_a_success113 PASS [ 0.020s] ( 94/1760) iets build::render::tests::a_failure_shows_a_short_extract114 PASS [ 0.021s] ( 95/1760) iets build::render::tests::a_long_attribute_keeps_its_ends115 PASS [ 0.026s] ( 96/1760) iets build::render::tests::a_stalled_build_that_fails_still_shows_its_cause116 PASS [ 0.025s] ( 97/1760) iets build::render::tests::an_owned_build_is_verdicted_once_by_its_op117 PASS [ 0.024s] ( 98/1760) iets build::render::tests::an_unfolded_success_ends_with_its_verdict118 PASS [ 0.092s] ( 99/1760) iets build::fanout::tests::at_most_limit_builds_run_at_once119 PASS [ 0.019s] ( 100/1760) iets build::render::tests::ci_folds_a_success_and_never_a_failure120 PASS [ 0.015s] ( 101/1760) iets build::render::tests::drv_paths_of_a_failure_message121 PASS [ 0.019s] ( 102/1760) iets build::render::tests::logs_of_two_builds_do_not_interleave122 PASS [ 0.015s] ( 103/1760) iets build::render::tests::the_status_line_takes_the_colours_of_the_rows_above123 PASS [ 0.026s] ( 104/1760) iets build::render::tests::heartbeat_names_running_builds124 PASS [ 0.022s] ( 105/1760) iets build::render::tests::the_live_region_spins_and_counts125 PASS [ 0.028s] ( 106/1760) iets build::render::tests::one_build_needs_no_summary126 PASS [ 0.019s] ( 107/1760) iets build::render::tests::tty_keeps_successful_logs_off_the_screen127 PASS [ 0.024s] ( 108/1760) iets build::render::tests::the_summary_follows_more_than_one_build128 PASS [ 0.021s] ( 109/1760) iets build::tests::a_dependency_the_store_stopped_is_not_a_success129 PASS [ 0.010s] ( 110/1760) iets build::tests::hash_stripping130 PASS [ 0.015s] ( 111/1760) iets builtins::derivation::tests::a_dynamic_output_renders_the_placeholder_nix_renders131 PASS [ 0.020s] ( 112/1760) iets build::tests::targets_become_jobs132 PASS [ 0.033s] ( 113/1760) iets build::tests::a_target_with_no_verdict_fails133 PASS [ 0.055s] ( 114/1760) iets build::tests::a_fan_out_backend_keeps_the_cap_and_the_log_blocks134 PASS [ 0.028s] ( 115/1760) iets builtins::derivation::tests::the_two_placeholders_are_not_the_same135 PASS [ 0.028s] ( 116/1760) iets builtins::fetch::tests::a_read_that_is_not_a_selection_has_no_site::case_2136 PASS [ 0.028s] ( 117/1760) iets builtins::fetch::tests::a_read_that_is_not_a_selection_has_no_site::case_1137 PASS [ 0.018s] ( 118/1760) iets builtins::fetch::tests::a_read_that_is_not_a_selection_has_no_site::case_4138 PASS [ 0.028s] ( 119/1760) iets builtins::fetch::tests::a_read_that_is_not_a_selection_has_no_site::case_3139 PASS [ 0.319s] ( 120/1760) iets api::run::tests::the_counters_cover_the_helper_fibers140 PASS [ 0.024s] ( 121/1760) iets builtins::fetch::tests::a_read_that_is_not_a_selection_has_no_site::case_5141 PASS [ 0.031s] ( 122/1760) iets builtins::fetch::tests::a_read_that_is_not_a_selection_has_no_site::case_6142 PASS [ 0.026s] ( 123/1760) iets builtins::fetch::tests::a_selection_of_the_count_is_the_site::case_01143 PASS [ 0.065s] ( 124/1760) iets builtins::fetch::tests::a_read_of_the_count_is_one_finding_for_each_tree144 PASS [ 0.031s] ( 125/1760) iets builtins::fetch::tests::a_selection_of_the_count_is_the_site::case_02145 PASS [ 0.027s] ( 126/1760) iets builtins::fetch::tests::a_selection_of_the_count_is_the_site::case_04146 PASS [ 0.024s] ( 127/1760) iets builtins::fetch::tests::a_selection_of_the_count_is_the_site::case_07147 PASS [ 0.024s] ( 128/1760) iets builtins::fetch::tests::a_selection_of_the_count_is_the_site::case_06148 PASS [ 0.036s] ( 129/1760) iets builtins::fetch::tests::a_selection_of_the_count_is_the_site::case_03149 PASS [ 0.033s] ( 130/1760) iets builtins::fetch::tests::a_selection_of_the_count_is_the_site::case_05150 PASS [ 0.032s] ( 131/1760) iets builtins::fetch::tests::a_selection_of_the_count_is_the_site::case_08151 PASS [ 0.027s] ( 132/1760) iets builtins::fetch::tests::a_selection_of_the_count_is_the_site::case_10152 PASS [ 0.026s] ( 133/1760) iets builtins::fetch::tests::a_selection_of_the_count_is_the_site::case_12153 PASS [ 0.032s] ( 134/1760) iets builtins::fetch::tests::a_selection_of_the_count_is_the_site::case_11154 PASS [ 0.037s] ( 135/1760) iets builtins::fetch::tests::a_selection_of_the_count_is_the_site::case_09155 PASS [ 0.030s] ( 136/1760) iets builtins::fetch::tests::a_selection_of_the_count_is_the_site::case_13156 PASS [ 0.019s] ( 137/1760) iets builtins::fetch::tests::a_selection_of_the_count_is_the_site::case_14157 PASS [ 0.017s] ( 138/1760) iets builtins::fetch::tests::nix_sees_no_mark158 PASS [ 0.025s] ( 139/1760) iets builtins::fetch::tests::an_entry_of_the_compiled_file_cache_keeps_the_site159 PASS [ 0.023s] ( 140/1760) iets builtins::fetch::tests::the_mark_follows_the_string_like_store_context160 PASS [ 0.017s] ( 141/1760) iets builtins::fetch::tests::the_name_on_a_value_that_is_not_a_tree_is_silent::case_2161 PASS [ 0.023s] ( 142/1760) iets builtins::fetch::tests::the_name_on_a_value_that_is_not_a_tree_is_silent::case_1162 PASS [ 0.031s] ( 143/1760) iets builtins::fetch::tests::the_first_read_of_a_tree_gives_its_finding163 PASS [ 0.022s] ( 144/1760) iets builtins::fetch::tests::the_name_on_a_value_that_is_not_a_tree_is_silent::case_3164 PASS [ 0.028s] ( 145/1760) iets builtins::fetch::tests::the_name_on_a_value_that_is_not_a_tree_is_silent::case_4165 PASS [ 0.008s] ( 146/1760) iets builtins::fetch_git::tests::a_plain_ref_name_is_read_by_iets::r_1___main__166 PASS [ 0.033s] ( 147/1760) iets builtins::fetch::tests::the_name_on_a_value_that_is_not_a_tree_is_silent::case_5167 PASS [ 0.031s] ( 148/1760) iets builtins::fetch::tests::the_name_on_a_value_that_is_not_a_tree_is_silent::case_7168 PASS [ 0.029s] ( 149/1760) iets builtins::fetch::tests::the_name_on_a_value_that_is_not_a_tree_is_silent::case_8169 PASS [ 0.036s] ( 150/1760) iets builtins::fetch::tests::the_name_on_a_value_that_is_not_a_tree_is_silent::case_6170 PASS [ 0.020s] ( 151/1760) iets builtins::fetch_git::tests::a_plain_ref_name_is_read_by_iets::r_2___HEAD__171 PASS [ 0.011s] ( 152/1760) iets builtins::fetch_git::tests::a_ref_name_git_would_refuse_is_not::r_01_____172 PASS [ 0.022s] ( 153/1760) iets builtins::fetch_git::tests::a_plain_ref_name_is_read_by_iets::r_3___v1_0__173 PASS [ 0.019s] ( 154/1760) iets builtins::fetch_git::tests::a_plain_ref_name_is_read_by_iets::r_5___a_b_c__174 PASS [ 0.020s] ( 155/1760) iets builtins::fetch_git::tests::a_plain_ref_name_is_read_by_iets::r_4___refs_tags_v1__175 PASS [ 0.016s] ( 156/1760) iets builtins::fetch_git::tests::a_ref_name_git_would_refuse_is_not::r_02____x__176 PASS [ 0.017s] ( 157/1760) iets builtins::fetch_git::tests::a_ref_name_git_would_refuse_is_not::r_06___a__b__177 PASS [ 0.020s] ( 158/1760) iets builtins::fetch_git::tests::a_ref_name_git_would_refuse_is_not::r_05___a__b__178 PASS [ 0.021s] ( 159/1760) iets builtins::fetch_git::tests::a_ref_name_git_would_refuse_is_not::r_04___a___179 PASS [ 0.011s] ( 160/1760) iets builtins::fetch_git::tests::a_ref_name_git_would_refuse_is_not::r_07___ab__180 PASS [ 0.027s] ( 161/1760) iets builtins::fetch_git::tests::a_ref_name_git_would_refuse_is_not::r_03____a__181 PASS [ 0.072s] ( 162/1760) iets builtins::fetch::tests::the_tree_decides_the_level182 PASS [ 0.013s] ( 163/1760) iets builtins::fetch_git::tests::a_ref_name_git_would_refuse_is_not::r_11____x__183 PASS [ 0.023s] ( 164/1760) iets builtins::fetch_git::tests::a_ref_name_git_would_refuse_is_not::r_10___x___184 PASS [ 0.024s] ( 165/1760) iets builtins::fetch_git::tests::a_ref_name_git_would_refuse_is_not::r_09___a___185 PASS [ 0.021s] ( 166/1760) iets builtins::fetch_git::tests::a_working_tree_is_a_file_url_of_an_absolute_path::case_1186 PASS [ 0.016s] ( 167/1760) iets builtins::fetch_git::tests::a_working_tree_is_a_file_url_of_an_absolute_path::case_2187 PASS [ 0.029s] ( 168/1760) iets builtins::fetch_git::tests::a_ref_name_git_would_refuse_is_not::r_08___a1__188 PASS [ 0.016s] ( 169/1760) iets builtins::fetch_git::tests::a_working_tree_is_a_file_url_of_an_absolute_path::case_3189 PASS [ 0.013s] ( 170/1760) iets builtins::store_hooks::tests::a_relative_path_inside_an_entry_joins_once190 PASS [ 0.014s] ( 171/1760) iets builtins::fetch_git::tests::only_a_full_lowercase_rev_is_a_rev191 PASS [ 2.068s] ( 172/1760) iets api::concurrent_eval::concurrent_eval_matches_sequential_eval::case_50_route_foldl192 PASS [ 0.021s] ( 173/1760) iets builtins::fetch_git::tests::a_working_tree_is_a_file_url_of_an_absolute_path::case_4193 PASS [ 0.024s] ( 174/1760) iets builtins::fetch_git::tests::a_working_tree_is_a_file_url_of_an_absolute_path::case_5194 PASS [ 0.012s] ( 175/1760) iets builtins::text::fromtoml::tests::inline_tables_stay_on_one_line::case_06195 PASS [ 0.014s] ( 176/1760) iets builtins::text::fromtoml::tests::inline_tables_stay_on_one_line::case_07196 PASS [ 0.024s] ( 177/1760) iets builtins::text::fromtoml::tests::inline_tables_stay_on_one_line::case_01197 PASS [ 0.017s] ( 178/1760) iets builtins::text::fromtoml::tests::inline_tables_stay_on_one_line::case_05198 PASS [ 0.030s] ( 179/1760) iets builtins::store_hooks::tests::virtual_tree_reads_go_to_the_local_files199 PASS [ 0.026s] ( 180/1760) iets builtins::text::fromtoml::tests::inline_tables_stay_on_one_line::case_02200 PASS [ 0.029s] ( 181/1760) iets builtins::text::fromtoml::tests::inline_tables_stay_on_one_line::case_03201 PASS [ 0.020s] ( 182/1760) iets builtins::text::fromtoml::tests::inline_tables_stay_on_one_line::case_09202 PASS [ 0.025s] ( 183/1760) iets builtins::text::fromtoml::tests::inline_tables_stay_on_one_line::case_08203 PASS [ 0.034s] ( 184/1760) iets builtins::text::fromtoml::tests::inline_tables_stay_on_one_line::case_04204 PASS [ 0.019s] ( 185/1760) iets builtins::text::fromtoml::tests::new_escapes_are_refused205 PASS [ 0.017s] ( 186/1760) iets builtins::text::regex::tests::names206 PASS [ 0.023s] ( 187/1760) iets builtins::text::fromtoml::tests::inline_tables_stay_on_one_line::case_10207 PASS [ 0.027s] ( 188/1760) iets builtins::text::regex::tests::size_limit208 PASS [ 0.041s] ( 189/1760) iets builtins::text::fromtoml::tests::inline_tables_stay_on_one_line::case_11209 PASS [ 0.027s] ( 190/1760) iets cachefs::tests::a_directory_that_is_not_ours_is_refused_untouched210 PASS [ 0.026s] ( 191/1760) iets cachefs::tests::a_stamp_in_the_future_is_due211 PASS [ 0.013s] ( 192/1760) iets cachefs::tests::a_touch_inside_the_interval_writes_nothing212 PASS [ 0.029s] ( 193/1760) iets cachefs::tests::a_store_without_a_version_file_is_wiped_once213 PASS [ 0.029s] ( 194/1760) iets cachefs::tests::a_sweep_runs_once_per_interval214 PASS [ 0.015s] ( 195/1760) iets cachefs::tests::a_wipe_of_the_ir_cache_walks_its_shards215 PASS [ 0.014s] ( 196/1760) iets cachefs::tests::an_input_store_of_the_spool_layout_is_wiped216 PASS [ 0.024s] ( 197/1760) iets cachefs::tests::a_wait_lock_waits_for_its_holder217 PASS [ 0.028s] ( 198/1760) iets cachefs::tests::a_wipe_keeps_what_iets_did_not_create218 PASS [ 0.019s] ( 199/1760) iets cachefs::tests::garbled_stamp_wipes_the_store219 PASS [ 0.024s] ( 200/1760) iets cachefs::tests::an_empty_directory_is_ours_to_take220 PASS [ 0.013s] ( 201/1760) iets cachefs::tests::sweep_ages_a_root_by_its_link_not_by_what_it_names221 PASS [ 0.013s] ( 202/1760) iets cachefs::tests::sweep_drops_old_entries_and_keeps_young_ones222 PASS [ 0.016s] ( 203/1760) iets cachefs::tests::sweep_walks_the_shards_of_the_ir_cache223 PASS [ 0.016s] ( 204/1760) iets cli::build::tests::no_build_result_is_named224 PASS [ 0.024s] ( 205/1760) iets cachefs::tests::version_mismatch_wipes_the_store225 PASS [ 0.020s] ( 206/1760) iets cli::build::tests::installables_are_sorted_without_repeats226 PASS [ 0.013s] ( 207/1760) iets cli::build::tests::out_links_are_named_as_nix_build_names_them227 PASS [ 0.019s] ( 208/1760) iets cli::build::tests::no_outcome_at_all_is_named228 PASS [ 0.085s] ( 209/1760) iets cachefs::tests::a_lock_that_cannot_be_opened_is_not_a_busy_lock229 PASS [ 0.021s] ( 210/1760) iets cli::build::tests::silence_reason::case_1_a_path_on_stdout_is_silent230 PASS [ 0.017s] ( 211/1760) iets cli::build::tests::silence_reason::case_3_a_success_with_no_output_path_is_named231 PASS [ 0.018s] ( 212/1760) iets cli::build::tests::silence_reason::case_2_a_failed_build_reports_itself232 PASS [ 0.018s] ( 213/1760) iets cli::build::tests::silence_reason::case_4_an_out_flag_that_matches_nothing_is_named233 PASS [ 1.977s] ( 214/1760) iets api::concurrent_eval::concurrent_eval_matches_sequential_eval::case_51_route_stress234 PASS [ 0.026s] ( 215/1760) iets cli::classic::nix::tests::eval_takes_print_build_logs235 PASS [ 0.019s] ( 216/1760) iets cli::classic::nix::tests::flake_registry_is_the_setting236 PASS [ 0.017s] ( 217/1760) iets cli::classic::shell::tests::sh_var_names237 PASS [ 0.020s] ( 218/1760) iets cli::classic::shell::tests::declares_for_every_bash_shaped_value238 PASS [ 0.020s] ( 219/1760) iets cli::classic::shell::tests::outputs_become_placeholders239 PASS [ 0.021s] ( 220/1760) iets cli::classic::tests::a_flag_with_no_effect_is_noted_and_one_that_holds_is_not240 PASS [ 0.018s] ( 221/1760) iets cli::complete::tests::a_flag_value_completes_by_its_placeholder241 PASS [ 0.016s] ( 222/1760) iets cli::diff::tests::a_name_ends_at_the_first_dash_before_a_digit242 PASS [ 0.023s] ( 223/1760) iets cli::complete::tests::every_script_asks_the_binary243 PASS [ 0.024s] ( 224/1760) iets cli::complete::tests::flags_complete_after_a_dash244 PASS [ 0.023s] ( 225/1760) iets cli::complete::tests::subcommands_and_topics245 PASS [ 0.027s] ( 226/1760) iets cli::complete::tests::commands_complete_with_their_summary246 PASS [ 0.019s] ( 227/1760) iets cli::docs::tests::the_topic_list_fits_80_columns247 PASS [ 0.017s] ( 228/1760) iets cli::docs::tests::topics_resolve_bare_and_qualified248 PASS [ 0.020s] ( 229/1760) iets cli::docs::tests::every_embedded_page_has_a_heading249 PASS [ 0.029s] ( 230/1760) iets cli::complete::tests::a_positional_is_left_to_the_shell250 PASS [ 0.083s] ( 231/1760) iets cachefs::tests::the_writer_lock_excludes_one_holder_at_a_time251 PASS [ 0.020s] ( 232/1760) iets cli::help::tests::a_mistyped_command_is_suggested::case_1252 PASS [ 0.016s] ( 233/1760) iets cli::help::tests::a_mistyped_command_is_suggested::case_2253 PASS [ 0.015s] ( 234/1760) iets cli::help::tests::a_mistyped_command_is_suggested::case_7254 PASS [ 0.021s] ( 235/1760) iets cli::help::tests::a_mistyped_command_is_suggested::case_3255 PASS [ 0.017s] ( 236/1760) iets cli::help::tests::a_mistyped_command_is_suggested::case_8256 PASS [ 0.019s] ( 237/1760) iets cli::help::tests::a_mistyped_command_is_suggested::case_9257 PASS [ 0.024s] ( 238/1760) iets cli::help::tests::a_mistyped_command_is_suggested::case_4258 PASS [ 0.020s] ( 239/1760) iets cli::help::tests::help_fits_80_columns259 PASS [ 0.025s] ( 240/1760) iets cli::help::tests::a_mistyped_command_is_suggested::case_5260 PASS [ 0.024s] ( 241/1760) iets cli::help::tests::a_mistyped_command_is_suggested::case_6261 PASS [ 0.024s] ( 242/1760) iets cli::help::tests::suggestions_come_from_the_help::case_1262 PASS [ 0.029s] ( 243/1760) iets cli::help::tests::messages263 PASS [ 0.012s] ( 244/1760) iets cli::plumbing::tests::a_file_url_needs_one_slash_not_three::case_3264 PASS [ 0.011s] ( 245/1760) iets cli::plumbing::tests::a_file_url_needs_one_slash_not_three::case_4265 PASS [ 0.025s] ( 246/1760) iets cli::help::tests::suggestions_come_from_the_help::case_2266 PASS [ 0.020s] ( 247/1760) iets cli::plumbing::tests::a_file_url_needs_one_slash_not_three::case_2267 PASS [ 0.020s] ( 248/1760) iets cli::plumbing::tests::a_file_url_needs_one_slash_not_three::case_1268 PASS [ 0.021s] ( 249/1760) iets cli::help::tests::suggestions_come_from_the_help::case_6269 PASS [ 0.025s] ( 250/1760) iets cli::help::tests::suggestions_come_from_the_help::case_3270 PASS [ 0.023s] ( 251/1760) iets cli::help::tests::suggestions_come_from_the_help::case_4271 PASS [ 0.023s] ( 252/1760) iets cli::help::tests::suggestions_come_from_the_help::case_5272 PASS [ 0.019s] ( 253/1760) iets cli::plumbing::tests::a_file_url_needs_one_slash_not_three::case_6273 PASS [ 0.020s] ( 254/1760) iets cli::plumbing::tests::a_file_url_needs_one_slash_not_three::case_7274 PASS [ 0.026s] ( 255/1760) iets cli::plumbing::tests::a_file_url_needs_one_slash_not_three::case_5275 PASS [ 0.019s] ( 256/1760) iets cli::render::text::tests::a_long_value_shows_the_lines_that_differ276 PASS [ 0.031s] ( 257/1760) iets cli::plumbing::tests::a_file_url_needs_one_slash_not_three::case_8277 PASS [ 0.025s] ( 258/1760) iets cli::render::tests::sizes_render_as_nix_renders_them278 PASS [ 0.023s] ( 259/1760) iets cli::plumbing::tests::a_url_is_the_positional_fetch_takes_itself279 PASS [ 0.031s] ( 260/1760) iets cli::plumbing::tests::a_file_url_needs_one_slash_not_three::case_9280 PASS [ 0.017s] ( 261/1760) iets cli::search::tests::drv_names281 PASS [ 0.016s] ( 262/1760) iets cli::search::tests::index_round_trip282 PASS [ 0.014s] ( 263/1760) iets cli::search::tests::merged_highlights283 PASS [ 0.032s] ( 264/1760) iets cli::run::tests::a_usage_error_is_an_exit_code_and_a_message284 PASS [ 0.017s] ( 265/1760) iets config::tests::a_setting_with_no_effect_is_noted285 PASS [ 0.027s] ( 266/1760) iets config::tests::an_alias_is_its_setting286 PASS [ 0.030s] ( 267/1760) iets config::tests::a_classic_name_leaves_an_unimplemented_setting_to_nix287 PASS [ 0.033s] ( 268/1760) iets compile::cache::tests::a_malformed_entry_is_a_miss_and_never_a_crash288 PASS [ 0.058s] ( 269/1760) iets cli::run::tests::eval_prints_its_value289 PASS [ 0.022s] ( 270/1760) iets config::tests::basic_syntax290 PASS [ 0.017s] ( 271/1760) iets config::tests::bool_spellings::case_1291 PASS [ 0.034s] ( 272/1760) iets config::tests::bad_typed_values_error_where_they_are_set292 PASS [ 0.069s] ( 273/1760) iets cli::run::tests::the_hosts_environment_reaches_the_lint_configuration293 PASS [ 0.019s] ( 274/1760) iets config::tests::bool_spellings::case_5294 PASS [ 0.021s] ( 275/1760) iets config::tests::bool_spellings::case_3295 PASS [ 0.021s] ( 276/1760) iets config::tests::bool_spellings::case_2296 PASS [ 0.019s] ( 277/1760) iets config::tests::bool_spellings::case_6297 PASS [ 0.020s] ( 278/1760) iets config::tests::bool_spellings::case_4298 PASS [ 0.054s] ( 279/1760) iets compile::cache::tests::nesting_past_the_cap_misses299 PASS [ 0.021s] ( 280/1760) iets config::tests::extra_appends_to_list_settings_only300 PASS [ 0.026s] ( 281/1760) iets config::tests::include_chain301 PASS [ 0.020s] ( 282/1760) iets config::tests::missing_include_errors_and_bang_include_does_not302 PASS [ 0.024s] ( 283/1760) iets config::tests::max_jobs_auto_is_the_cpu_count303 PASS [ 0.021s] ( 284/1760) iets config::tests::option_nix_path_replaces_nix_path_and_extra_adds304 PASS [ 0.021s] ( 285/1760) iets config::tests::syntax_errors305 PASS [ 0.023s] ( 286/1760) iets config::tests::the_daemon_gets_the_store_settings_set_outside_the_system_file306 PASS [ 0.027s] ( 287/1760) iets config::tests::overrides_win_over_files307 PASS [ 0.026s] ( 288/1760) iets config::tests::the_setting_tables_name_nix_settings308 PASS [ 0.022s] ( 289/1760) iets config::tests::typed_getters_and_defaults309 PASS [ 0.023s] ( 290/1760) iets config::tests::unknown_settings_are_kept310 PASS [ 0.019s] ( 291/1760) iets devenv::tests::cached_result_roundtrip311 PASS [ 0.017s] ( 292/1760) iets devenv::tests::non_bash_builder_is_refused312 PASS [ 0.025s] ( 293/1760) iets config::tests::user_conf_files_are_in_precedence_order313 PASS [ 0.024s] ( 294/1760) iets devenv::tests::json_roundtrip_and_bash_forms314 PASS [ 0.019s] ( 295/1760) iets devenv::tests::rc_script_rewrites_outputs_and_writes_attrs315 PASS [ 0.031s] ( 296/1760) iets devenv::tests::get_env_sh_store_path_matches_nix316 PASS [ 0.024s] ( 297/1760) iets devenv::tests::shell_escaping317 PASS [ 0.025s] ( 298/1760) iets display::tests::a_frame_is_one_synchronized_write318 PASS [ 0.038s] ( 299/1760) iets devenv::tests::output_checks_are_erased_only_when_present319 PASS [ 0.038s] ( 300/1760) iets devenv::tests::rewrites_apply_in_map_order_to_every_occurrence320 PASS [ 0.024s] ( 301/1760) iets display::tests::a_region_taller_than_the_screen_is_clamped321 PASS [ 0.033s] ( 302/1760) iets display::tests::a_full_width_line_keeps_its_last_column322 PASS [ 0.028s] ( 303/1760) iets display::tests::a_region_that_grows_and_shrinks_loses_no_output323 PASS [ 0.026s] ( 304/1760) iets display::tests::a_resize_burst_never_erases324 PASS [ 0.022s] ( 305/1760) iets display::tests::colour_and_width325 PASS [ 0.031s] ( 306/1760) iets display::tests::a_resize_keeps_one_region326 PASS [ 0.015s] ( 307/1760) iets display::tests::the_region_comes_down_on_close327 PASS [ 0.024s] ( 308/1760) iets display::tests::growth_does_not_eat_output328 PASS [ 0.025s] ( 309/1760) iets display::tests::output_scrolls_and_the_region_stays_at_the_bottom329 PASS [ 0.029s] ( 310/1760) iets display::tests::output_starts_at_the_origin330 PASS [ 0.151s] ( 311/1760) iets compile::cache::tests::a_changed_byte_never_makes_the_evaluator_read_past_its_env331 PASS [ 0.023s] ( 312/1760) iets display::tests::the_region_keeps_its_rows_until_a_smaller_size_lasts332 PASS [ 0.024s] ( 313/1760) iets display::tests::wrapped_output_does_not_corrupt_the_region333 PASS [ 0.020s] ( 314/1760) iets eval::tests::a_second_pseudo_file_keeps_its_own_positions334 PASS [ 0.036s] ( 315/1760) iets eval::tests::a_function_select_is_a_fresh_slot_when_its_subject_is_forced335 PASS [ 0.031s] ( 316/1760) iets eval::tests::an_invalid_regex_fails_before_the_string_is_forced::f_2___split__336 PASS [ 0.174s] ( 317/1760) iets compile::cache::tests::a_changed_byte_of_a_stored_entry_is_a_miss337 PASS [ 0.025s] ( 318/1760) iets eval::tests::builder_rpc_outputs_have_no_placeholder::case_4_fixed_output338 PASS [ 0.044s] ( 319/1760) iets eval::tests::an_invalid_regex_fails_before_the_string_is_forced::f_1___match__339 PASS [ 0.032s] ( 320/1760) iets eval::tests::builder_rpc_outputs_have_no_placeholder::case_1_list340 PASS [ 0.035s] ( 321/1760) iets eval::tests::builder_rpc_outputs_have_no_placeholder::case_3_structured341 PASS [ 0.030s] ( 322/1760) iets eval::tests::derivation_keeps_env_and_args_that_are_not_utf8::case_1_env342 PASS [ 0.039s] ( 323/1760) iets eval::tests::builder_rpc_outputs_have_no_placeholder::case_2_string343 PASS [ 0.014s] ( 324/1760) iets eval::tests::empty_literals::case_1_list_grows344 PASS [ 0.025s] ( 325/1760) iets eval::tests::derivation_keeps_env_and_args_that_are_not_utf8::case_3_pass_as_file345 PASS [ 0.058s] ( 326/1760) iets eval::tests::arithmetic_and_strings346 PASS [ 0.037s] ( 327/1760) iets eval::tests::derivation_keeps_env_and_args_that_are_not_utf8::case_2_args347 PASS [ 0.037s] ( 328/1760) iets eval::tests::derivation_wrapper_exists348 PASS [ 0.032s] ( 329/1760) iets eval::tests::empty_literals::case_6_dynamic_is_not_empty349 PASS [ 0.077s] ( 330/1760) iets eval::tests::attrs_and_lists350 PASS [ 0.028s] ( 331/1760) iets eval::tests::eval_config_defaults_to_the_system_this_build_is_for351 PASS [ 0.036s] ( 332/1760) iets eval::tests::empty_literals::case_4_types352 PASS [ 0.040s] ( 333/1760) iets eval::tests::empty_literals::case_2_attrs_grow353 PASS [ 0.043s] ( 334/1760) iets eval::tests::empty_literals::case_3_equal354 PASS [ 0.024s] ( 335/1760) iets eval::tests::fetch_mercurial_names_a_way_out355 PASS [ 0.032s] ( 336/1760) iets eval::tests::every_empty_list_and_set_is_one_object356 PASS [ 0.435s] ( 337/1760) iets bytescan::tests::finds_every_byte_to_escape::set_2_Escapes__Json357 PASS [ 0.046s] ( 338/1760) iets eval::tests::empty_literals::case_5_or_default358 PASS [ 0.046s] ( 339/1760) iets eval::tests::equality359 PASS [ 0.028s] ( 340/1760) iets eval::tests::fetchurl_needs_a_sha256_in_every_mode::pure_2_false::src_2_r__builtins_fetchurl_url__https___example_com_x__name__y_____360 PASS [ 0.028s] ( 341/1760) iets eval::tests::intersect_attrs_matches_a_filter::case_3_union_in_few361 PASS [ 0.043s] ( 342/1760) iets eval::tests::fetchurl_needs_a_sha256_in_every_mode::pure_1_true::src_1_r__builtins_fetchurl__https___example_com_x____362 PASS [ 0.039s] ( 343/1760) iets eval::tests::intersect_attrs_matches_a_filter::case_2_few_in_union363 PASS [ 0.041s] ( 344/1760) iets eval::tests::intersect_attrs_matches_a_filter::case_1_flat364 PASS [ 0.044s] ( 345/1760) iets eval::tests::fetchurl_needs_a_sha256_in_every_mode::pure_1_true::src_2_r__builtins_fetchurl_url__https___example_com_x__name__y_____365 PASS [ 0.045s] ( 346/1760) iets eval::tests::fetchurl_needs_a_sha256_in_every_mode::pure_2_false::src_1_r__builtins_fetchurl__https___example_com_x____366 PASS [ 0.049s] ( 347/1760) iets eval::tests::from_json_and_toml_reject_null_bytes367 PASS [ 0.059s] ( 348/1760) iets eval::tests::fetchurl_checks_its_argument_like_nix368 PASS [ 0.016s] ( 349/1760) iets eval::tests::lambda_params_read_or_ignored::case_03_reads_outer369 PASS [ 0.043s] ( 350/1760) iets eval::tests::lambda_params_read_or_ignored::case_01_ignored370 PASS [ 0.047s] ( 351/1760) iets eval::tests::intersect_attrs_matches_a_filter::case_4_both_unions371 PASS [ 0.017s] ( 352/1760) iets eval::tests::lambda_params_read_or_ignored::case_05_with_inside372 PASS [ 0.028s] ( 353/1760) iets eval::tests::lambda_params_read_or_ignored::case_02_curried373 PASS [ 0.016s] ( 354/1760) iets eval::tests::lambda_params_read_or_ignored::case_06_inherit374 PASS [ 0.023s] ( 355/1760) iets eval::tests::lambda_params_read_or_ignored::case_08_find_file375 PASS [ 0.027s] ( 356/1760) iets eval::tests::lambda_params_read_or_ignored::case_07_interpolation376 PASS [ 0.032s] ( 357/1760) iets eval::tests::lambda_params_read_or_ignored::case_04_let_inside377 PASS [ 0.019s] ( 358/1760) iets eval::tests::lambda_params_read_or_ignored::case_12_let_shadows_param378 PASS [ 0.017s] ( 359/1760) iets eval::tests::lambda_params_read_or_ignored::case_14_let_inherits_param379 PASS [ 0.030s] ( 360/1760) iets eval::tests::lambda_params_read_or_ignored::case_09_curried_full380 PASS [ 0.024s] ( 361/1760) iets eval::tests::lambda_params_read_or_ignored::case_11_inner_shadows_outer381 PASS [ 0.067s] ( 362/1760) iets eval::tests::intersect_attrs_matches_a_filter::case_5_disjoint382 PASS [ 0.035s] ( 363/1760) iets eval::tests::lambda_params_read_or_ignored::case_10_curried_partial383 PASS [ 0.028s] ( 364/1760) iets eval::tests::lambda_params_read_or_ignored::case_15_let_inherit_from384 PASS [ 0.028s] ( 365/1760) iets eval::tests::lambda_params_read_or_ignored::case_18_empty_formals385 PASS [ 0.039s] ( 366/1760) iets eval::tests::lambda_params_read_or_ignored::case_16_default_skips_let386 PASS [ 0.041s] ( 367/1760) iets eval::tests::lambda_params_read_or_ignored::case_13_let_reads_param387 PASS [ 0.025s] ( 368/1760) iets eval::tests::lambda_params_read_or_ignored::case_20_through_builtin388 PASS [ 0.033s] ( 369/1760) iets eval::tests::lambda_params_read_or_ignored::case_17_formals_curried389 PASS [ 0.041s] ( 370/1760) iets eval::tests::lambda_params_read_or_ignored::case_19_closure_in_merged390 PASS [ 0.031s] ( 371/1760) iets eval::tests::reading_a_derivation_output_is_unsupported::f_2___scopedImport____391 PASS [ 0.034s] ( 372/1760) iets eval::tests::reading_a_derivation_output_is_unsupported::f_1___import__392 PASS [ 0.043s] ( 373/1760) iets eval::tests::printing393 PASS [ 0.045s] ( 374/1760) iets eval::tests::nix_eq_forces_what_the_shortcut_skips394 PASS [ 0.033s] ( 375/1760) iets eval::tests::reading_a_derivation_output_is_unsupported::f_4___builtins_readDir__395 PASS [ 0.031s] ( 376/1760) iets eval::tests::reading_a_derivation_output_is_unsupported::f_7_r__builtins_hashFile__sha256____396 PASS [ 0.031s] ( 377/1760) iets eval::tests::reading_a_derivation_output_is_unsupported::f_6___builtins_readFileType__397 PASS [ 0.035s] ( 378/1760) iets eval::tests::reading_a_derivation_output_is_unsupported::f_3___builtins_readFile__398 PASS [ 0.033s] ( 379/1760) iets eval::tests::reading_a_derivation_output_is_unsupported::f_5___builtins_pathExists__399 PASS [ 0.060s] ( 380/1760) iets eval::tests::laziness_and_recursion400 PASS [ 0.564s] ( 381/1760) iets bytescan::tests::finds_every_byte_to_escape::set_1_Escapes__Aterm401 PASS [ 0.581s] ( 382/1760) iets builtins::text::regex::tests::long_inputs_do_not_recurse402 PASS [ 0.021s] ( 383/1760) iets fetch::http::tests::file_urls_name_a_local_path403 PASS [ 0.045s] ( 384/1760) iets eval::tests::update_forces_the_right_operand_first404 PASS [ 0.052s] ( 385/1760) iets eval::tests::scoping405 PASS [ 0.033s] ( 386/1760) iets fetch::http::tests::credentials_stay_on_the_first_origin406 PASS [ 0.023s] ( 387/1760) iets fetch::http::tests::magic_bytes407 PASS [ 0.052s] ( 388/1760) iets eval::tests::sets_compare_in_the_symbol_order_of_nix408 PASS [ 0.011s] ( 389/1760) iets fetch::http::tests::redirects_keep_credentials_only_on_the_same_origin409 PASS [ 0.037s] ( 390/1760) iets fetch::http::tests::credentials_in_the_url_are_sent_and_never_printed410 PASS [ 0.051s] ( 391/1760) iets eval::tests::try_eval_and_errors411 PASS [ 0.013s] ( 392/1760) iets fetch::http::tests::urls_split412 PASS [ 0.015s] ( 393/1760) iets fetch::roots::tests::an_empty_nix_ssl_cert_file_hides_ssl_cert_file413 PASS [ 0.019s] ( 394/1760) iets fetch::http::tests::trailing_bytes_and_a_second_layer414 PASS [ 0.021s] ( 395/1760) iets fetch::http::tests::time_the_reader_did_not_run_is_no_stall415 PASS [ 0.022s] ( 396/1760) iets fetch::http::tests::redirects_resolve416 PASS [ 0.019s] ( 397/1760) iets fetch::roots::tests::nix_ssl_cert_file_wins_over_ssl_cert_file_and_the_platform417 PASS [ 0.019s] ( 398/1760) iets fetch::roots::tests::no_bundle_anywhere_gives_the_compiled_in_set418 PASS [ 0.012s] ( 399/1760) iets fetch::roots::tests::the_platform_store_wins_over_the_compiled_in_set419 PASS [ 0.028s] ( 400/1760) iets fetch::roots::tests::a_named_file_that_is_missing_or_empty_is_an_error420 PASS [ 0.010s] ( 401/1760) iets fetch::spool::tests::an_empty_archive_is_an_empty_directory421 PASS [ 0.019s] ( 402/1760) iets fetch::spool::tests::a_sparse_member_counts_against_the_size_limit422 PASS [ 0.028s] ( 403/1760) iets fetch::spool::tests::a_stored_tree_dumps_the_spools_nar423 PASS [ 0.088s] ( 404/1760) iets fetch::http::tests::a_stalled_download_fails424 PASS [ 0.088s] ( 405/1760) iets fetch::http::tests::a_server_that_never_answers_is_a_stall425 PASS [ 0.021s] ( 406/1760) iets fetch::spool::tests::spool_matches_the_tree426 PASS [ 0.037s] ( 407/1760) iets fetch::spool::tests::a_changed_index_byte_is_a_miss427 PASS [ 0.034s] ( 408/1760) iets fetch::spool::tests::archives_the_git_sink_accepts428 PASS [ 0.029s] ( 409/1760) iets fetch::spool::tests::nar_hash_of_the_fixture429 PASS [ 0.038s] ( 410/1760) iets fetch::spool::tests::a_hard_link_never_replaces_a_member430 PASS [ 0.035s] ( 411/1760) iets fetch::spool::tests::pax_sparse_members_are_expanded431 PASS [ 0.017s] ( 412/1760) iets fetch::spool::tests::the_errors_match::case_1432 PASS [ 0.033s] ( 413/1760) iets fetch::spool::tests::spool_matches_the_tree_on_the_top_level433 PASS [ 0.014s] ( 414/1760) iets fetch::unpack::tests::member_names_are_made_relative_and_cannot_escape::case_1434 PASS [ 0.017s] ( 415/1760) iets fetch::spool::tests::the_errors_match::case_3435 PASS [ 0.020s] ( 416/1760) iets fetch::spool::tests::the_errors_match::case_2436 PASS [ 0.161s] ( 417/1760) iets eval::tests::pure_eval_answers_like_nix437 PASS [ 0.019s] ( 418/1760) iets fetch::spool::tests::the_scratch_file_never_follows_a_symlink438 PASS [ 0.024s] ( 419/1760) iets fetch::unpack::tests::a_repeated_member_keeps_the_last_copy439 PASS [ 0.026s] ( 420/1760) iets fetch::unpack::tests::an_unsupported_member_type_is_an_error440 PASS [ 0.017s] ( 421/1760) iets fetch::unpack::tests::member_names_are_made_relative_and_cannot_escape::case_3441 PASS [ 0.027s] ( 422/1760) iets fetch::unpack::tests::keeps_the_root_when_it_is_not_a_single_directory442 PASS [ 0.023s] ( 423/1760) iets fetch::unpack::tests::member_names_are_made_relative_and_cannot_escape::case_6443 PASS [ 0.024s] ( 424/1760) iets fetch::unpack::tests::member_names_are_made_relative_and_cannot_escape::case_4444 PASS [ 0.028s] ( 425/1760) iets fetch::unpack::tests::member_names_are_made_relative_and_cannot_escape::case_2445 PASS [ 0.023s] ( 426/1760) iets fetch::unpack::tests::member_names_are_made_relative_and_cannot_escape::case_5446 PASS [ 0.011s] ( 427/1760) iets flake::flakeref::tests::a_bad_ref_is_an_error::case_4_indirect_too_deep447 PASS [ 0.018s] ( 428/1760) iets flake::flakeref::tests::a_bad_ref_is_an_error::case_1_relative448 PASS [ 0.013s] ( 429/1760) iets flake::flakeref::tests::a_bad_ref_is_an_error::case_2_github_no_repo449 PASS [ 0.025s] ( 430/1760) iets fetch::unpack::tests::modes_symlinks_and_empty_dirs450 PASS [ 0.026s] ( 431/1760) iets fetch::unpack::tests::nar_hash_of_the_fixture451 PASS [ 0.026s] ( 432/1760) iets fetch::unpack::tests::strips_one_leading_component452 PASS [ 0.022s] ( 433/1760) iets flake::flakeref::tests::a_bad_ref_is_an_error::case_3_github_fragment453 PASS [ 0.018s] ( 434/1760) iets flake::flakeref::tests::attrs_that_cannot_be_a_ref454 PASS [ 0.018s] ( 435/1760) iets flake::flakeref::tests::an_unsupported_ref_says_so::case_4455 PASS [ 0.016s] ( 436/1760) iets flake::flakeref::tests::git_urls_are_fixed_like_nix::case_2456 PASS [ 0.020s] ( 437/1760) iets flake::flakeref::tests::an_unsupported_ref_says_so::case_1457 PASS [ 0.020s] ( 438/1760) iets flake::flakeref::tests::a_bad_ref_is_an_error::case_5_bad_escape458 PASS [ 0.020s] ( 439/1760) iets flake::flakeref::tests::a_file_url_is_a_local_path459 PASS [ 0.023s] ( 440/1760) iets flake::flakeref::tests::an_unsupported_ref_says_so::case_3460 PASS [ 0.027s] ( 441/1760) iets flake::flakeref::tests::an_unsupported_ref_says_so::case_2461 PASS [ 0.028s] ( 442/1760) iets flake::flakeref::tests::an_unsupported_ref_says_so::case_5462 PASS [ 0.024s] ( 443/1760) iets flake::flakeref::tests::git_urls_are_fixed_like_nix::case_3463 PASS [ 0.032s] ( 444/1760) iets flake::flakeref::tests::git_urls_are_fixed_like_nix::case_1464 PASS [ 0.019s] ( 445/1760) iets flake::flakeref::tests::git_urls_are_fixed_like_nix::case_4465 PASS [ 0.020s] ( 446/1760) iets flake::flakeref::tests::git_urls_nix_refuses_are_refused466 PASS [ 0.020s] ( 447/1760) iets flake::flakeref::tests::round_trips::case_02467 PASS [ 0.028s] ( 448/1760) iets flake::flakeref::tests::git_urls_are_fixed_like_nix::case_5468 PASS [ 0.028s] ( 449/1760) iets flake::flakeref::tests::parses_the_kept_schemes469 PASS [ 0.031s] ( 450/1760) iets flake::flakeref::tests::refuses_a_github_ref_named_twice470 PASS [ 0.032s] ( 451/1760) iets flake::flakeref::tests::git_urls_are_fixed_like_nix::case_6471 PASS [ 0.014s] ( 452/1760) iets flake::flakeref::tests::round_trips::case_07472 PASS [ 0.025s] ( 453/1760) iets flake::flakeref::tests::round_trips::case_03473 PASS [ 0.036s] ( 454/1760) iets flake::flakeref::tests::round_trips::case_01474 PASS [ 0.020s] ( 455/1760) iets flake::flakeref::tests::round_trips::case_06475 PASS [ 0.028s] ( 456/1760) iets flake::flakeref::tests::round_trips::case_04476 PASS [ 0.017s] ( 457/1760) iets flake::flakeref::tests::round_trips::case_08477 PASS [ 0.019s] ( 458/1760) iets flake::tests::a_pinned_checkout_is_its_revision478 PASS [ 0.026s] ( 459/1760) iets flake::flakeref::tests::round_trips::case_09479 PASS [ 0.026s] ( 460/1760) iets flake::flakeref::tests::round_trips::case_10480 PASS [ 0.012s] ( 461/1760) iets jobs::constituents::tests::fnmatch_basics::case_04481 PASS [ 0.025s] ( 462/1760) iets flake::flakeref::tests::to_string_from_attrs482 PASS [ 0.020s] ( 463/1760) iets jobs::constituents::tests::fnmatch_basics::case_02483 PASS [ 0.028s] ( 464/1760) iets flake::tests::refs_resolve_against_cwd_and_home484 PASS [ 0.034s] ( 465/1760) iets flake::tests::attr_paths485 PASS [ 0.020s] ( 466/1760) iets jobs::constituents::tests::fnmatch_basics::case_05486 PASS [ 0.029s] ( 467/1760) iets jobs::constituents::tests::fnmatch_basics::case_03487 PASS [ 0.022s] ( 468/1760) iets jobs::constituents::tests::fnmatch_basics::case_09488 PASS [ 0.023s] ( 469/1760) iets jobs::constituents::tests::fnmatch_basics::case_07489 PASS [ 0.063s] ( 470/1760) iets flake::flakeref::tests::round_trips::case_05490 PASS [ 0.024s] ( 471/1760) iets jobs::constituents::tests::fnmatch_basics::case_06491 PASS [ 0.041s] ( 472/1760) iets jobs::constituents::tests::fnmatch_basics::case_01492 PASS [ 0.030s] ( 473/1760) iets jobs::constituents::tests::fnmatch_basics::case_08493 PASS [ 0.023s] ( 474/1760) iets jobs::constituents::tests::fnmatch_basics::case_11494 PASS [ 0.018s] ( 475/1760) iets jobs::line::tests::error_line_round_trip495 PASS [ 0.020s] ( 476/1760) iets jobs::constituents::tests::fnmatch_basics::case_12496 PASS [ 0.032s] ( 477/1760) iets jobs::constituents::tests::fnmatch_basics::case_10497 PASS [ 0.021s] ( 478/1760) iets jobs::constituents::tests::topo_sort_orders_and_detects_cycles498 PASS [ 0.016s] ( 479/1760) iets jobs::line::tests::stats_survive_the_collector499 PASS [ 0.016s] ( 480/1760) iets lint::allow::tests::comment_names500 PASS [ 0.019s] ( 481/1760) iets jobs::line::tests::split_and_round_trip501 PASS [ 0.028s] ( 482/1760) iets jobs::tests::a_numeric_name_selects_an_attribute_under_a_set502 PASS [ 0.026s] ( 483/1760) iets lint::allow::tests::lines503 PASS [ 0.026s] ( 484/1760) iets lint::cases::a_project_file_may_not_set_nix_bin_dir504 PASS [ 0.045s] ( 485/1760) iets lint::cases::a_later_flag_wins_over_all_and_a_name_beats_a_later_all505 PASS [ 0.286s] ( 486/1760) iets fetch::http::tests::downloads_stop_at_the_size_limit506 PASS [ 0.048s] ( 487/1760) iets lint::cases::an_unknown_name_in_iets_lint_is_a_warning_and_the_rest_counts507 PASS [ 0.056s] ( 488/1760) iets lint::cases::a_family_selector_selects_its_members508 PASS [ 0.055s] ( 489/1760) iets lint::cases::one_warning_per_site509 PASS [ 0.028s] ( 490/1760) iets lint::cases::try_eval_does_not_catch_a_lint_error510 PASS [ 0.076s] ( 491/1760) iets lint::cases::an_unknown_name_in_iets_toml_is_a_warning_and_the_rest_counts511 PASS [ 0.082s] ( 492/1760) iets lint::cases::iets_lint_sets_a_level_and_a_flag_beats_it512 PASS [ 0.044s] ( 493/1760) iets lint::cli_cases::a_finding_at_error_has_the_span_and_no_edit513 PASS [ 0.078s] ( 494/1760) iets lint::cases::the_project_iets_toml_sets_a_level_and_a_name_beats_its_family514 PASS [ 0.017s] ( 495/1760) iets lint::cli_cases::an_unknown_lint_name_in_a_flag_is_a_usage_error515 PASS [ 0.051s] ( 496/1760) iets lint::cli_cases::a_finding_record_has_the_span_and_the_edit_on_a_cache_hit_too516 PASS [ 0.074s] ( 497/1760) iets lint::cases::the_user_iets_toml_sets_a_level_and_the_project_file_wins_over_it517 PASS [ 0.103s] ( 498/1760) iets lint::cases::scope_attributes_a_derivation_to_the_users_binding518 PASS [ 0.066s] ( 499/1760) iets lint::cli_cases::a_warning_is_replayed_on_a_cache_hit519 PASS [ 0.037s] ( 500/1760) iets lint::cli_cases::lint_list_shows_the_effective_levels_and_the_scope520 PASS [ 0.114s] ( 501/1760) iets lint::cases::scope_limits_a_lint_to_the_entry_directory_until_it_is_opened521 PASS [ 0.046s] ( 502/1760) iets lint::cli_cases::an_unknown_name_in_iets_lint_is_a_record522 PASS [ 0.077s] ( 503/1760) iets lint::cli_cases::an_allow_comment_is_part_of_the_cache_key_and_a_hit_replays_nothing523 PASS [ 0.063s] ( 504/1760) iets lint::cli_cases::the_scope_is_part_of_the_cache_key524 PASS [ 0.116s] ( 505/1760) iets lint::cli_cases::an_allow_table_travels_in_the_ir_cache_entry_and_a_load_stays_silent525 PASS [ 0.092s] ( 506/1760) iets lint::flake_cases::a_directory_under_the_root_is_dir_copy_flake_not_path_copy526 PASS [ 0.095s] ( 507/1760) iets lint::flake_cases::a_copy_under_the_root_or_an_input_is_not_a_recopy527 PASS [ 0.078s] ( 508/1760) iets lint::flake_cases::a_tree_meta_finding_is_a_record_with_a_span_on_a_cache_hit_too528 PASS [ 0.197s] ( 509/1760) iets lint::cases::allow_comments_silence_the_lines_they_cover529 PASS [ 0.016s] ( 510/1760) iets lint::tests::an_unknown_name_is_a_warning_in_a_file_and_an_error_in_a_flag530 PASS [ 0.025s] ( 511/1760) iets lint::site::tests::a_literal_lint_of_nix_has_an_edit531 PASS [ 0.016s] ( 512/1760) iets lint::tests::keys532 PASS [ 0.022s] ( 513/1760) iets lint::site::tests::the_span_is_the_innermost_node_of_the_kind_of_the_lint533 PASS [ 0.009s] ( 514/1760) iets lint::tests::specificity_inside_a_source_and_order_between_sources534 PASS [ 0.025s] ( 515/1760) iets lint::tests::names_are_unique_kebab_case535 PASS [ 0.023s] ( 516/1760) iets lint::tests::scope_and_inputs536 PASS [ 0.011s] ( 517/1760) iets log::tests::a_coloured_error_is_an_error_record537 PASS [ 0.102s] ( 518/1760) iets lint::flake_cases::the_level_of_tree_meta_comes_from_the_flag_the_env_and_the_user_file538 PASS [ 0.105s] ( 519/1760) iets lint::flake_cases::an_input_is_silent_until_the_scope_or_the_inputs_table_opens_it539 PASS [ 0.014s] ( 520/1760) iets lint::tests::toml_table540 PASS [ 0.021s] ( 521/1760) iets lint::tests::the_project_file_walk_stops_at_the_project_root541 PASS [ 0.026s] ( 522/1760) iets lint::tests::selectors_and_order542 PASS [ 0.011s] ( 523/1760) iets log::tests::a_fixed_hash_has_the_shape_of_a_finding_with_an_edit543 PASS [ 0.116s] ( 524/1760) iets lint::flake_cases::an_input_or_an_allowed_site_is_silent_and_the_scope_opens_the_input544 PASS [ 0.111s] ( 525/1760) iets lint::flake_cases::the_project_file_sets_tree_meta_per_tree545 PASS [ 0.014s] ( 526/1760) iets log::tests::a_half_line_waits_for_its_newline546 PASS [ 0.012s] ( 527/1760) iets log::tests::a_region_stays_under_the_output_that_scrolls_above_it547 PASS [ 0.017s] ( 528/1760) iets log::tests::a_forged_mismatch_is_dropped548 PASS [ 0.018s] ( 529/1760) iets log::tests::a_hash_mismatch_names_the_hash_it_got549 PASS [ 0.009s] ( 530/1760) iets log::tests::a_resize_redraws_the_region_once550 PASS [ 0.098s] ( 531/1760) iets lint::flake_cases::the_roots_metadata_in_a_derivation_is_reported_by_default551 PASS [ 0.020s] ( 532/1760) iets log::tests::a_pause_takes_the_view_down_for_a_prompt552 PASS [ 0.017s] ( 533/1760) iets log::tests::activity_records_are_nix_json_logger_records553 PASS [ 0.019s] ( 534/1760) iets log::tests::a_session_id_is_a_uuid_v7554 PASS [ 0.019s] ( 535/1760) iets log::tests::ansi_stripping555 PASS [ 0.032s] ( 536/1760) iets log::tests::a_mismatch_reason_keeps_both_hashes556 PASS [ 0.012s] ( 537/1760) iets log::tests::record_without_position557 PASS [ 0.021s] ( 538/1760) iets log::tests::escapes_are_filtered_the_way_nix_filters_them558 PASS [ 0.027s] ( 539/1760) iets log::tests::a_resolved_copy_reports_its_mismatch_as_a_line559 PASS [ 0.020s] ( 540/1760) iets log::tests::exit_status_flags_combine_like_nix560 PASS [ 0.019s] ( 541/1760) iets log::tests::lint_warning_is_a_level_1_record561 PASS [ 0.021s] ( 542/1760) iets log::tests::record_is_nix_log_ei_plus_code_and_hint562 PASS [ 0.014s] ( 543/1760) iets log::tests::text_shows_the_hint_of_an_unsupported_error563 PASS [ 0.018s] ( 544/1760) iets log::tests::the_status_line_goes_under_the_region564 PASS [ 0.016s] ( 545/1760) iets log::tests::without_a_terminal_output_is_plain565 PASS [ 0.016s] ( 546/1760) iets nixbin::tests::every_iets_build_is_skipped566 PASS [ 0.017s] ( 547/1760) iets nixbin::tests::farm_marker_is_found_through_two_hops567 PASS [ 0.025s] ( 548/1760) iets parallel::fiber::tests::migrates_between_threads568 PASS [ 0.023s] ( 549/1760) iets parallel::fiber::tests::reservation_is_capped_and_mmap_failure_is_an_error569 PASS [ 0.031s] ( 550/1760) iets parallel::deque::tests::lifo_owner_fifo_thief570 PASS [ 0.021s] ( 551/1760) iets parallel::fiber::tests::resume_yield_finish571 PASS [ 0.021s] ( 552/1760) iets parallel::interner::tests::empty_name_misses_the_cache_sentinel572 PASS [ 0.021s] ( 553/1760) iets parallel::interner::tests::intern_is_stable_and_shared573 PASS [ 0.010s] ( 554/1760) iets parallel::interner::tests::prefix_order_agrees_with_byte_order574 PASS [ 0.018s] ( 555/1760) iets parallel::sched::tests::a_task_survives_packing_past_the_old_24_bit_start::case_1575 PASS [ 0.020s] ( 556/1760) iets parallel::sched::tests::a_task_survives_packing_past_the_old_24_bit_start::case_2576 PASS [ 0.018s] ( 557/1760) iets parallel::sched::tests::main_parks_and_is_woken_by_helper577 PASS [ 0.015s] ( 558/1760) iets parallel::sched::tests::park_and_wake_across_workers578 PASS [ 0.023s] ( 559/1760) iets parallel::sched::tests::a_task_survives_packing_past_the_old_24_bit_start::case_3579 PASS [ 0.057s] ( 560/1760) iets parallel::fiber::tests::large_stack_use_and_release580 PASS [ 0.012s] ( 561/1760) iets print::tests::float_formatting_edge_cases::case_02581 PASS [ 0.041s] ( 562/1760) iets parallel::sched::tests::fan_out_from_main582 PASS [ 0.024s] ( 563/1760) iets print::tests::float_formatting_edge_cases::case_01583 PASS [ 0.017s] ( 564/1760) iets print::tests::float_formatting_edge_cases::case_04584 PASS [ 0.020s] ( 565/1760) iets print::tests::float_formatting_edge_cases::case_03585 PASS [ 0.014s] ( 566/1760) iets print::tests::float_formatting_edge_cases::case_05586 PASS [ 0.080s] ( 567/1760) iets parallel::fiber::tests::a_freed_stack_frees_its_guard_entry587 PASS [ 0.007s] ( 568/1760) iets print::tests::float_formatting_edge_cases::case_10588 PASS [ 0.040s] ( 569/1760) iets parallel::thunk::tests::deadlocked_fibers_are_cancelled589 PASS [ 0.018s] ( 570/1760) iets print::tests::float_formatting_edge_cases::case_06590 PASS [ 0.028s] ( 571/1760) iets print::tests::float_formatting_edge_cases::case_07591 PASS [ 0.023s] ( 572/1760) iets print::tests::float_formatting_edge_cases::case_11592 PASS [ 0.027s] ( 573/1760) iets print::tests::float_formatting_edge_cases::case_08593 PASS [ 0.015s] ( 574/1760) iets profile::tests::a_frame_keeps_its_call_site_and_its_name594 PASS [ 0.028s] ( 575/1760) iets print::tests::float_formatting_edge_cases::case_09595 PASS [ 0.022s] ( 576/1760) iets profile::tests::a_sample_is_taken_once_per_tick596 PASS [ 0.020s] ( 577/1760) iets profile::tests::an_unwind_returns_to_a_depth597 PASS [ 0.112s] ( 578/1760) iets parallel::interner::tests::concurrent_intern_agrees598 PASS [ 0.020s] ( 579/1760) iets profile::tests::a_weight_is_bytes_when_the_profile_asks_for_them599 PASS [ 0.027s] ( 580/1760) iets progress::tests::a_download_inside_a_copy_is_part_of_the_copy600 PASS [ 0.016s] ( 581/1760) iets progress::tests::a_transfer_that_does_not_move_says_so601 PASS [ 0.010s] ( 582/1760) iets progress::tests::several_of_a_kind_are_counted602 PASS [ 0.029s] ( 583/1760) iets progress::tests::a_hidden_board_draws_nothing603 PASS [ 0.029s] ( 584/1760) iets progress::tests::a_log_hears_of_a_task_after_first_and_then_every_heartbeat604 PASS [ 0.135s] ( 585/1760) iets parallel::deque::tests::concurrent_sum605 PASS [ 0.015s] ( 586/1760) iets project::tests::a_config_file_never_shrinks_the_root606 PASS [ 0.016s] ( 587/1760) iets progress::tests::store_hashes_are_left_out607 PASS [ 0.011s] ( 588/1760) iets project::tests::each_marker_is_a_root608 PASS [ 0.008s] ( 589/1760) iets provenance::tests::a_tree_copied_from_a_store_tree_resolves_to_the_local_one609 PASS [ 0.011s] ( 590/1760) iets provenance::tests::a_shared_position_is_left_off_the_started_line_only610 PASS [ 0.014s] ( 591/1760) iets project::tests::a_working_tree_wins_over_a_file_marker_below_it611 PASS [ 0.014s] ( 592/1760) iets provenance::tests::a_path_followed_by_a_colour_escape_still_matches612 PASS [ 0.061s] ( 593/1760) iets profile::tests::a_deep_stack_is_capped613 PASS [ 0.015s] ( 594/1760) iets project::tests::the_nearest_flake_wins_without_a_working_tree614 PASS [ 0.013s] ( 595/1760) iets provenance::tests::failed_line_names_the_attribute_and_the_position615 PASS [ 0.020s] ( 596/1760) iets provenance::tests::an_input_file_is_labelled_by_its_lock_node616 PASS [ 0.015s] ( 597/1760) iets provenance::tests::rewrite_leaves_unknown_text_alone617 PASS [ 0.017s] ( 598/1760) iets provenance::tests::locate_takes_the_longest_prefix618 PASS [ 0.013s] ( 599/1760) iets remote::grpc::backend::tests::a_cold_store_is_asked_the_rest_in_one_call619 PASS [ 0.014s] ( 600/1760) iets remote::grpc::backend::tests::a_built_input_stops_the_walk620 PASS [ 0.011s] ( 601/1760) iets remote::grpc::build::tests::a_self_reference_does_not_loop621 PASS [ 0.026s] ( 602/1760) iets provenance::tests::rewrite_replaces_every_known_path_in_a_line622 PASS [ 0.018s] ( 603/1760) iets remote::grpc::backend::tests::an_input_below_a_built_one_is_not_built623 PASS [ 0.011s] ( 604/1760) iets remote::grpc::build::tests::required_features_come_from_the_env_or_structured_attrs624 PASS [ 0.028s] ( 605/1760) iets provenance::tests::locate_without_a_match_is_none625 PASS [ 0.023s] ( 606/1760) iets remote::grpc::backend::tests::a_built_root_asks_nothing_below_it626 PASS [ 0.020s] ( 607/1760) iets remote::grpc::build::tests::a_local_upload_failure_beats_the_stream_ended_status627 PASS [ 0.026s] ( 608/1760) iets remote::grpc::build::tests::reschedules_back_off_past_a_dead_worker628 PASS [ 0.026s] ( 609/1760) iets remote::grpc::build::tests::the_timings_report_with_every_line629 PASS [ 0.019s] ( 610/1760) iets remote::grpc::drvwire::tests::basic_derivation_matches_the_cxx_field_order630 PASS [ 0.021s] ( 611/1760) iets remote::grpc::drvwire::tests::an_unresolvable_input_output_is_an_error631 PASS [ 0.024s] ( 612/1760) iets remote::grpc::drvwire::tests::path_info_round_trips632 PASS [ 0.017s] ( 613/1760) iets remote::grpc::health::tests::a_completed_build_clears_the_history633 PASS [ 0.028s] ( 614/1760) iets remote::grpc::drvwire::tests::build_result_round_trips_a_daemon_reply634 PASS [ 0.032s] ( 615/1760) iets remote::grpc::drvwire::tests::a_failure_keeps_its_message635 PASS [ 0.017s] ( 616/1760) iets remote::grpc::health::tests::an_unknown_address_is_usable636 PASS [ 0.018s] ( 617/1760) iets remote::grpc::health::tests::a_passed_cooldown_lets_one_caller_through637 PASS [ 0.016s] ( 618/1760) iets remote::grpc::health::tests::one_address_does_not_refuse_another638 PASS [ 0.015s] ( 619/1760) iets remote::grpc::health::tests::one_bounce_does_not_refuse_an_address639 PASS [ 0.040s] ( 620/1760) iets remote::grpc::build::tests::topo_sort_puts_references_first640 PASS [ 0.016s] ( 621/1760) iets remote::grpc::health::tests::the_cooldown_grows_and_stops_at_30s641 PASS [ 0.012s] ( 622/1760) iets remote::grpc::tests::a_token_needs_tls_and_unknown_parameters_are_errors642 PASS [ 0.009s] ( 623/1760) iets remote::grpc::tests::every_parameter_parses643 PASS [ 0.011s] ( 624/1760) iets remote::grpc::tests::insecure_is_a_bare_flag_or_a_boolean644 PASS [ 0.016s] ( 625/1760) iets remote::grpc::tests::defaults_match_the_cxx_settings645 PASS [ 0.009s] ( 626/1760) iets remote::plan::tests::a_cold_store_is_asked_the_rest_in_one_call646 PASS [ 0.024s] ( 627/1760) iets remote::grpc::health::tests::two_bounces_refuse_it647 PASS [ 0.015s] ( 628/1760) iets remote::grpc::tests::percent_escapes_decode_in_values648 PASS [ 0.016s] ( 629/1760) iets remote::grpc::tests::mtls_needs_both_halves649 PASS [ 0.013s] ( 630/1760) iets remote::plan::tests::an_answered_root_is_not_asked_again650 PASS [ 0.017s] ( 631/1760) iets remote::plan::tests::a_held_root_answers_for_its_closure651 PASS [ 0.020s] ( 632/1760) iets remote::plan::tests::a_held_input_answers_for_its_closure652 PASS [ 0.012s] ( 633/1760) iets remote::worker::counts_tests::a_repeated_update_claims_nothing653 PASS [ 0.019s] ( 634/1760) iets remote::plan::tests::hash_source_matches_nar_hash654 PASS [ 0.014s] ( 635/1760) iets remote::worker::tests::an_ssh_host_is_never_an_option::case_1655 PASS [ 0.016s] ( 636/1760) iets remote::worker::counts_tests::each_change_is_a_verdict_in_order656 PASS [ 0.021s] ( 637/1760) iets remote::plan::tests::memory_source_matches_dump_string657 PASS [ 0.012s] ( 638/1760) iets remote::worker::tests::an_ssh_host_is_never_an_option::case_2658 PASS [ 0.009s] ( 639/1760) iets remote::worker::tests::an_ssh_host_is_never_an_option::case_4659 PASS [ 0.019s] ( 640/1760) iets remote::worker::tests::a_status_over_a_byte_is_not_a_success660 PASS [ 0.016s] ( 641/1760) iets remote::worker::tests::an_ssh_host_is_never_an_option::case_3661 PASS [ 0.020s] ( 642/1760) iets remote::worker::tests::an_ssh_host_is_never_an_option::case_5662 PASS [ 0.018s] ( 643/1760) iets remote::worker::tests::nix_sshopts_split_like_a_shell663 PASS [ 0.020s] ( 644/1760) iets remote::worker::tests::an_ssh_host_that_is_an_option_says_so664 PASS [ 0.020s] ( 645/1760) iets remote::worker::tests::ssh_argv_puts_the_host_first665 PASS [ 0.018s] ( 646/1760) iets remote::worker::wire::tests::framed_sink_frames_and_terminates666 PASS [ 0.011s] ( 647/1760) iets remote::worker::wire::tests::strings_are_padded667 PASS [ 0.024s] ( 648/1760) iets remote::worker::tests::transport_from_url668 PASS [ 0.026s] ( 649/1760) iets remote::worker::wire::tests::replies_are_read_as_nix_reads_them669 PASS [ 0.017s] ( 650/1760) iets runtime::heap::tests::release_tombstones_every_chunk670 PASS [ 0.787s] ( 651/1760) iets fetch::http::tests::a_transient_status_is_retried671 PASS [ 0.016s] ( 652/1760) iets runtime::value::alloc_tests::a_static_slice_is_interned_without_a_copy672 PASS [ 0.035s] ( 653/1760) iets remote::worker::wire::tests::build_results_are_read_as_nix_reads_them673 PASS [ 0.023s] ( 654/1760) iets runtime::value::alloc_tests::a_list_too_long_to_address_has_no_size674 PASS [ 0.016s] ( 655/1760) iets runtime::value::layout::a_primop_pays_nothing_for_its_symbol675 PASS [ 0.028s] ( 656/1760) iets runtime::value::alloc_tests::a_speculated_thunk_is_forced_but_not_demanded676 PASS [ 0.027s] ( 657/1760) iets runtime::value::tests::union_lookup_agrees_with_iteration677 PASS [ 0.020s] ( 658/1760) iets session::tests::two_sessions_share_no_state678 PASS [ 0.021s] ( 659/1760) iets settings::tests::a_flag_carries_several_places_separated_by_a_semicolon679 PASS [ 0.025s] ( 660/1760) iets settings::tests::a_missing_file_is_skipped_and_the_defaults_hold680 PASS [ 0.024s] ( 661/1760) iets settings::tests::a_syntax_error_names_the_file_first681 PASS [ 0.036s] ( 662/1760) iets settings::tests::a_project_file_holds_lint_and_nothing_else682 PASS [ 0.026s] ( 663/1760) iets settings::tests::a_settings_file_may_hold_lint_and_the_other_sources_may_not683 PASS [ 0.023s] ( 664/1760) iets settings::tests::a_wrong_type_names_the_key_and_the_file::case_1684 PASS [ 0.023s] ( 665/1760) iets settings::tests::a_wrong_type_names_the_key_and_the_file::case_2685 PASS [ 0.056s] ( 666/1760) iets session::tests::a_value_used_after_release_is_loud686 PASS [ 0.066s] ( 667/1760) iets session::tests::a_parallel_run_releases_its_session687 PASS [ 0.015s] ( 668/1760) iets settings::tests::a_wrong_type_names_the_key_and_the_file::case_3688 PASS [ 0.017s] ( 669/1760) iets settings::tests::a_wrong_type_names_the_key_and_the_file::case_6689 PASS [ 0.020s] ( 670/1760) iets settings::tests::a_wrong_type_names_the_key_and_the_file::case_4690 PASS [ 0.020s] ( 671/1760) iets settings::tests::a_wrong_type_names_the_key_and_the_file::case_5691 PASS [ 0.012s] ( 672/1760) iets settings::tests::builder_reads_all_three_forms692 PASS [ 0.008s] ( 673/1760) iets settings::tests::the_flag_pairs_are_kept_for_a_second_iets693 PASS [ 0.024s] ( 674/1760) iets settings::tests::a_wrong_type_names_the_key_and_the_file::case_7694 PASS [ 0.022s] ( 675/1760) iets settings::tests::each_source_wins_over_the_one_before695 PASS [ 0.085s] ( 676/1760) iets session::tests::a_released_session_leaves_the_other_alone696 PASS [ 0.019s] ( 677/1760) iets settings::tests::the_file_is_the_users697 PASS [ 0.025s] ( 678/1760) iets settings::tests::source_map_adds_up_and_every_other_key_replaces698 PASS [ 0.020s] ( 679/1760) iets settings::tests::the_flag_leaves_the_argv699 PASS [ 0.024s] ( 680/1760) iets settings::tests::the_environment_wins_over_the_file700 PASS [ 0.018s] ( 681/1760) iets settings::tests::the_flag_value_is_toml_when_it_reads_as_toml701 PASS [ 0.011s] ( 682/1760) iets source::local::tests::only_a_content_addressed_store_path_names_its_content702 PASS [ 0.017s] ( 683/1760) iets settings::tests::the_user_file_turns_purity_off703 PASS [ 0.018s] ( 684/1760) iets source::local::tests::accepted_set_adds_parent_directories704 PASS [ 0.012s] ( 685/1760) iets source::lock::tests::declared_inputs_must_match_the_lock705 PASS [ 0.026s] ( 686/1760) iets settings::tests::unknown_key_names_the_file706 PASS [ 0.010s] ( 687/1760) iets source::remote::tests::a_leftover_is_not_a_valid_path707 PASS [ 0.022s] ( 688/1760) iets source::lock::tests::complete_lock_passes708 PASS [ 0.023s] ( 689/1760) iets source::local::tests::max_mtime_covers_root_and_children709 PASS [ 0.019s] ( 690/1760) iets source::lock::tests::empty_lock_has_no_inputs710 PASS [ 0.020s] ( 691/1760) iets source::remote::tests::access_tokens_match_the_longest_prefix711 PASS [ 0.024s] ( 692/1760) iets source::lock::tests::incomplete_locks_fail712 PASS [ 0.023s] ( 693/1760) iets source::remote::tests::download_urls_match_the_fetchers713 PASS [ 0.016s] ( 694/1760) iets source::remote::tests::only_the_archive_types_are_fetched_by_iets::case_2714 PASS [ 0.016s] ( 695/1760) iets source::remote::tests::only_the_archive_types_are_fetched_by_iets::case_3715 PASS [ 0.020s] ( 696/1760) iets source::remote::tests::only_the_archive_types_are_fetched_by_iets::case_1716 PASS [ 0.009s] ( 697/1760) iets source::remote::tests::only_the_archive_types_are_fetched_by_iets::case_5717 PASS [ 0.022s] ( 698/1760) iets source::remote::tests::nix_literal_escapes718 PASS [ 0.021s] ( 699/1760) iets source::remote::tests::only_the_archive_types_are_fetched_by_iets::case_4719 PASS [ 0.015s] ( 700/1760) iets source::remote::tests::only_the_archive_types_are_fetched_by_iets::case_6720 PASS [ 0.026s] ( 701/1760) iets source::remote::tests::only_the_archive_types_are_fetched_by_iets::case_8721 PASS [ 0.026s] ( 702/1760) iets source::remote::tests::only_the_archive_types_are_fetched_by_iets::case_7722 PASS [ 0.033s] ( 703/1760) iets source::scm::git::tests::a_directory_in_a_repository_is_found723 PASS [ 0.028s] ( 704/1760) iets source::scm::ledger::tests::a_name_resolves_to_a_revision_and_a_revision_has_a_tree724 PASS [ 0.030s] ( 705/1760) iets source::scm::ledger::tests::a_change_of_the_ledger_is_a_change_of_the_working_tree725 PASS [ 0.042s] ( 706/1760) iets source::scm::ledger::tests::an_untracked_file_is_the_error_of_nix726 PASS [ 0.018s] ( 707/1760) iets store::drv::tests::an_env_key_named_json_is_refused727 PASS [ 0.047s] ( 708/1760) iets source::scm::ledger::tests::a_directory_in_a_working_tree_is_found728 PASS [ 0.020s] ( 709/1760) iets source::tests::dates729 PASS [ 0.042s] ( 710/1760) iets source::scm::ledger::tests::the_count_is_lazy_and_kept_by_revision730 PASS [ 0.028s] ( 711/1760) iets source::scm::ledger::tests::the_metadata_has_the_mark_of_its_tree731 PASS [ 0.021s] ( 712/1760) iets store::drv::tests::a_dynamic_input_writes_the_versioned_aterm_and_parses_back732 PASS [ 0.017s] ( 713/1760) iets store::drv::tests::input_addressed_multi_output_from_scratch733 PASS [ 0.024s] ( 714/1760) iets store::drv::tests::fixed_output_from_scratch734 PASS [ 0.019s] ( 715/1760) iets store::drv::tests::masked_unparse_blanks_output_paths_and_env735 PASS [ 0.051s] ( 716/1760) iets source::scm::ledger::tests::the_tracked_files_and_the_metadata_are_the_tree736 PASS [ 0.020s] ( 717/1760) iets store::drv::tests::input_drvs_hash_modulo_from_scratch737 PASS [ 0.037s] ( 718/1760) iets store::drv::tests::fixtures_output_paths_recompute738 PASS [ 0.044s] ( 719/1760) iets store::drv::tests::fixtures_roundtrip_byte_exact739 PASS [ 0.029s] ( 720/1760) iets store::drv::tests::string_escapes_roundtrip740 PASS [ 0.026s] ( 721/1760) iets store::drvdiff::tests::an_input_source_an_added_input_drv_and_a_fixed_output_show_up741 PASS [ 0.029s] ( 722/1760) iets store::drvdiff::tests::a_changed_input_drv_is_paired_by_name_and_recursed_into742 PASS [ 0.031s] ( 723/1760) iets store::drvdiff::tests::env_name_shows_only_when_it_is_not_the_derivation_name743 PASS [ 0.020s] ( 724/1760) iets store::drvdiff::tests::json_names_what_differs744 PASS [ 0.060s] ( 725/1760) iets store::drv::tests::fixtures_drv_path_matches_store_path745 PASS [ 0.015s] ( 726/1760) iets store::hash::tests::base16::case_2_sha1746 PASS [ 0.020s] ( 727/1760) iets store::drvdiff::tests::the_same_derivation_is_empty747 PASS [ 0.021s] ( 728/1760) iets store::drvdiff::tests::the_local_fields_the_env_and_an_absent_value748 PASS [ 0.028s] ( 729/1760) iets store::drvdiff::tests::the_depth_limit_names_the_input_without_walking_it749 PASS [ 0.012s] ( 730/1760) iets store::hash::tests::base64_roundtrip750 PASS [ 0.016s] ( 731/1760) iets store::hash::tests::base16::case_3_empty_sha256751 PASS [ 0.031s] ( 732/1760) iets store::hash::tests::base16::case_1_sha256752 PASS [ 0.060s] ( 733/1760) iets store::drv::tests::the_escaped_tail_unparses_as_a_full_unparse753 PASS [ 0.016s] ( 734/1760) iets store::hash::tests::compress_hash_xors754 PASS [ 0.017s] ( 735/1760) iets store::hash::tests::nix32::case_2_sha1755 PASS [ 0.023s] ( 736/1760) iets store::hash::tests::nix32_roundtrip_and_reject756 PASS [ 0.026s] ( 737/1760) iets store::hash::tests::nix32::case_1_sha256757 PASS [ 0.026s] ( 738/1760) iets store::hash::tests::nix32::case_3_md5758 PASS [ 0.028s] ( 739/1760) iets store::hash::tests::parse_any_all_formats759 PASS [ 0.024s] ( 740/1760) iets store::hash::tests::sha512_nix32_base64760 PASS [ 0.022s] ( 741/1760) iets store::hash::tests::streaming_matches_oneshot761 PASS [ 0.029s] ( 742/1760) iets store::hash::tests::sha256_sri762 PASS [ 0.017s] ( 743/1760) iets store::nar::tests::directory_nar_hash_formats763 PASS [ 0.031s] ( 744/1760) iets store::json::tests::as_nix_writes_it764 PASS [ 0.031s] ( 745/1760) iets store::json::tests::deep_nesting765 PASS [ 0.029s] ( 746/1760) iets store::json::tests::what_nix_refuses766 PASS [ 0.034s] ( 747/1760) iets store::nar::tests::directory_nar767 PASS [ 0.027s] ( 748/1760) iets store::nar::tests::executable_file_nar768 PASS [ 0.018s] ( 749/1760) iets store::nar::tests::readers_refuse_what_nix_refuses::case_1_unsorted769 PASS [ 0.030s] ( 750/1760) iets store::nar::tests::directory_nar_with_an_executable770 PASS [ 0.025s] ( 751/1760) iets store::nar::tests::readers_refuse_what_nix_refuses::case_2_duplicate771 PASS [ 0.024s] ( 752/1760) iets store::nar::tests::readers_refuse_what_nix_refuses::case_3_dot_dot772 PASS [ 0.038s] ( 753/1760) iets store::nar::tests::filter_sees_types_and_paths773 PASS [ 0.018s] ( 754/1760) iets store::nar::tests::readers_refuse_what_nix_refuses::case_6_nul774 PASS [ 0.027s] ( 755/1760) iets store::nar::tests::readers_refuse_what_nix_refuses::case_5_empty_name775 PASS [ 0.021s] ( 756/1760) iets store::nar::tests::regular_file_nar776 PASS [ 0.015s] ( 757/1760) iets store::nar::tests::restore_rejects_garbage777 PASS [ 0.023s] ( 758/1760) iets store::nar::tests::readers_take_a_sorted_directory778 PASS [ 0.033s] ( 759/1760) iets store::nar::tests::readers_refuse_what_nix_refuses::case_4_slash779 PASS [ 0.020s] ( 760/1760) iets store::nar::tests::restore_roundtrip780 PASS [ 0.019s] ( 761/1760) iets store::path::tests::an_override_is_absolute_and_has_no_trailing_separator781 PASS [ 0.019s] ( 762/1760) iets store::path::tests::a_multibyte_char_across_the_hash_part_is_an_error782 PASS [ 0.024s] ( 763/1760) iets store::path::tests::check_name_rules::case_02783 PASS [ 0.034s] ( 764/1760) iets store::nar::tests::script_nar784 PASS [ 0.030s] ( 765/1760) iets store::path::tests::check_name_rules::case_03785 PASS [ 0.030s] ( 766/1760) iets store::path::tests::check_name_rules::case_01786 PASS [ 0.036s] ( 767/1760) iets store::nar::tests::symlink_nar787 PASS [ 0.022s] ( 768/1760) iets store::path::tests::check_name_rules::case_04788 PASS [ 0.027s] ( 769/1760) iets store::path::tests::check_name_rules::case_06789 PASS [ 0.022s] ( 770/1760) iets store::path::tests::check_name_rules::case_07790 PASS [ 0.029s] ( 771/1760) iets store::path::tests::check_name_rules::case_05791 PASS [ 0.019s] ( 772/1760) iets store::path::tests::check_name_rules::case_10792 PASS [ 0.021s] ( 773/1760) iets store::path::tests::check_name_rules::case_11793 PASS [ 0.028s] ( 774/1760) iets store::path::tests::check_name_rules::case_08794 PASS [ 0.020s] ( 775/1760) iets store::path::tests::check_name_rules::case_12795 PASS [ 0.029s] ( 776/1760) iets store::path::tests::check_name_rules::case_09796 PASS [ 0.019s] ( 777/1760) iets store::path::tests::fixed_flat_sha1797 PASS [ 0.021s] ( 778/1760) iets store::path::tests::fixed_output_path::case_1_flat_sha256798 PASS [ 0.024s] ( 779/1760) iets store::path::tests::filter_source799 PASS [ 0.014s] ( 780/1760) iets store::path::tests::path_copy_directory800 PASS [ 0.030s] ( 781/1760) iets store::path::tests::fixed_output_path::case_2_recursive_sha256801 PASS [ 0.031s] ( 782/1760) iets store::path::tests::output_names802 PASS [ 0.032s] ( 783/1760) iets store::path::tests::parse_and_accessors803 PASS [ 0.041s] ( 784/1760) iets store::path::tests::check_name_rules::case_13804 PASS [ 0.022s] ( 785/1760) iets store::path::tests::path_copy_file805 PASS [ 0.023s] ( 786/1760) iets store::path::tests::placeholder806 PASS [ 0.029s] ( 787/1760) iets store::path::tests::path_with_name807 PASS [ 0.019s] ( 788/1760) iets store::path::tests::to_file808 PASS [ 0.019s] ( 789/1760) iets syntax::symbol::tests::fx_bytes_sees_every_byte_and_its_place809 PASS [ 0.031s] ( 790/1760) iets store::path::tests::the_directory_is_found_as_a_string_and_as_a_path810 PASS [ 0.014s] ( 791/1760) iets syntax::tests::an_interpolated_name_is_static_when_nix_has_one_string_node811 PASS [ 0.029s] ( 792/1760) iets store::path::tests::to_file_with_reference812 PASS [ 0.027s] ( 793/1760) iets syntax::tests::allow_comments813 PASS [ 0.033s] ( 794/1760) iets syntax::tests::a_line_ends_at_cr_lf_and_lone_cr814 PASS [ 0.038s] ( 795/1760) iets store::path::tests::the_host_picks_the_store_directory815 PASS [ 0.027s] ( 796/1760) iets syntax::tests::comments_and_misc816 PASS [ 0.020s] ( 797/1760) iets syntax::tests::end_of_file_inside_a_path_is_at_its_last_token817 PASS [ 0.023s] ( 798/1760) iets syntax::tests::indented_string_stripping818 PASS [ 0.025s] ( 799/1760) iets syntax::tests::lambdas819 PASS [ 0.044s] ( 800/1760) iets syntax::tests::attrs_and_bindings820 PASS [ 0.026s] ( 801/1760) iets syntax::tests::lang_corpus::path_001_tests_lang_eval_fail_abort_nix821 PASS [ 0.015s] ( 802/1760) iets syntax::tests::lang_corpus::path_002_tests_lang_eval_fail_abs_path_fatal_nix822 PASS [ 0.027s] ( 803/1760) iets syntax::tests::json_gives_every_node_its_kind_and_span823 PASS [ 0.023s] ( 804/1760) iets syntax::tests::lang_corpus::path_003_tests_lang_eval_fail_addDrvOutputDependencies_empty_context_nix824 PASS [ 0.019s] ( 805/1760) iets syntax::tests::lang_corpus::path_004_tests_lang_eval_fail_addDrvOutputDependencies_multi_elem_context825 PASS [ 0.035s] ( 806/1760) iets syntax::tests::lang_corpus::path_005_tests_lang_eval_fail_addDrvOutputDependencies_wrong_element_kind826 PASS [ 0.026s] ( 807/1760) iets syntax::tests::lang_corpus::path_010_tests_lang_eval_fail_assert_equal_derivations_nix827 PASS [ 0.035s] ( 808/1760) iets syntax::tests::lang_corpus::path_006_tests_lang_eval_fail_addErrorContext_example_nix828 PASS [ 0.034s] ( 809/1760) iets syntax::tests::lang_corpus::path_007_tests_lang_eval_fail_assert_equal_attrs_names_2_nix829 PASS [ 0.036s] ( 810/1760) iets syntax::tests::lang_corpus::path_008_tests_lang_eval_fail_assert_equal_attrs_names_nix830 PASS [ 0.040s] ( 811/1760) iets syntax::tests::lang_corpus::path_011_tests_lang_eval_fail_assert_equal_floats_nix831 PASS [ 0.052s] ( 812/1760) iets syntax::tests::lang_corpus::path_009_tests_lang_eval_fail_assert_equal_derivations_extra_nix832 PASS [ 0.027s] ( 813/1760) iets syntax::tests::lang_corpus::path_012_tests_lang_eval_fail_assert_equal_function_direct_nix833 PASS [ 0.029s] ( 814/1760) iets syntax::tests::lang_corpus::path_014_tests_lang_eval_fail_assert_equal_ints_nix834 PASS [ 0.777s] ( 815/1760) iets parallel::thunk::tests::many_fibers_force_one_shared_graph835 PASS [ 0.017s] ( 816/1760) iets syntax::tests::lang_corpus::path_017_tests_lang_eval_fail_assert_equal_type_nested_nix836 PASS [ 0.036s] ( 817/1760) iets syntax::tests::lang_corpus::path_015_tests_lang_eval_fail_assert_equal_list_length_nix837 PASS [ 0.019s] ( 818/1760) iets syntax::tests::lang_corpus::path_018_tests_lang_eval_fail_assert_equal_type_nix838 PASS [ 0.037s] ( 819/1760) iets syntax::tests::lang_corpus::path_016_tests_lang_eval_fail_assert_equal_paths_nix839 PASS [ 0.047s] ( 820/1760) iets syntax::tests::lang_corpus::path_013_tests_lang_eval_fail_assert_equal_int_float_nix840 PASS [ 0.014s] ( 821/1760) iets syntax::tests::lang_corpus::path_021_tests_lang_eval_fail_attr_name_type_nix841 PASS [ 0.012s] ( 822/1760) iets syntax::tests::lang_corpus::path_022_tests_lang_eval_fail_attrset_merge_drops_later_rec_nix842 PASS [ 0.022s] ( 823/1760) iets syntax::tests::lang_corpus::path_019_tests_lang_eval_fail_assert_nested_bool_nix843 PASS [ 0.013s] ( 824/1760) iets syntax::tests::lang_corpus::path_024_tests_lang_eval_fail_bad_string_interpolation_2_nix844 PASS [ 0.027s] ( 825/1760) iets syntax::tests::lang_corpus::path_020_tests_lang_eval_fail_assert_nix845 PASS [ 0.027s] ( 826/1760) iets syntax::tests::lang_corpus::path_025_tests_lang_eval_fail_bad_string_interpolation_3_nix846 PASS [ 0.018s] ( 827/1760) iets syntax::tests::lang_corpus::path_026_tests_lang_eval_fail_bad_string_interpolation_4_nix847 PASS [ 0.033s] ( 828/1760) iets syntax::tests::lang_corpus::path_023_tests_lang_eval_fail_bad_string_interpolation_1_nix848 PASS [ 0.022s] ( 829/1760) iets syntax::tests::lang_corpus::path_027_tests_lang_eval_fail_blackhole_nix849 PASS [ 0.024s] ( 830/1760) iets syntax::tests::lang_corpus::path_029_tests_lang_eval_fail_deepseq_list_attr_nix850 PASS [ 0.026s] ( 831/1760) iets syntax::tests::lang_corpus::path_028_tests_lang_eval_fail_call_primop_nix851 PASS [ 0.028s] ( 832/1760) iets syntax::tests::lang_corpus::path_031_tests_lang_eval_fail_deepseq_nix852 PASS [ 0.018s] ( 833/1760) iets syntax::tests::lang_corpus::path_032_tests_lang_eval_fail_derivation_name_nix853 PASS [ 0.033s] ( 834/1760) iets syntax::tests::lang_corpus::path_030_tests_lang_eval_fail_deepseq_stack_overflow_nix854 PASS [ 1.414s] ( 835/1760) iets fetch::http::tests::a_decompression_bomb_is_refused855 PASS [ 0.021s] ( 836/1760) iets syntax::tests::lang_corpus::path_037_tests_lang_eval_fail_dynamic_attrs_inherit_2_nix856 PASS [ 0.026s] ( 837/1760) iets syntax::tests::lang_corpus::path_034_tests_lang_eval_fail_derivation_system_escape_nix857 PASS [ 0.025s] ( 838/1760) iets syntax::tests::lang_corpus::path_035_tests_lang_eval_fail_dup_dynamic_attrs_nix858 PASS [ 0.022s] ( 839/1760) iets syntax::tests::lang_corpus::path_036_tests_lang_eval_fail_duplicate_traces_nix859 PASS [ 0.034s] ( 840/1760) iets syntax::tests::lang_corpus::path_033_tests_lang_eval_fail_derivation_structuredAttrs_stack_overflow_n860 PASS [ 0.016s] ( 841/1760) iets syntax::tests::lang_corpus::path_039_tests_lang_eval_fail_dynamic_attrs_let_2_nix861 PASS [ 0.028s] ( 842/1760) iets syntax::tests::lang_corpus::path_042_tests_lang_eval_fail_elem_derivation_type_throws_nix862 PASS [ 0.040s] ( 843/1760) iets syntax::tests::lang_corpus::path_043_tests_lang_eval_fail_empty_formals_nix863 PASS [ 0.040s] ( 844/1760) iets syntax::tests::lang_corpus::path_047_tests_lang_eval_fail_eq_derivation_type_throws_nix864 PASS [ 0.042s] ( 845/1760) iets syntax::tests::lang_corpus::path_046_tests_lang_eval_fail_eol_3_nix865 PASS [ 0.066s] ( 846/1760) iets syntax::tests::lang_corpus::path_038_tests_lang_eval_fail_dynamic_attrs_inherit_nix866 PASS [ 0.058s] ( 847/1760) iets syntax::tests::lang_corpus::path_041_tests_lang_eval_fail_dynamic_attrs_let_nix867 PASS [ 0.033s] ( 848/1760) iets syntax::tests::lang_corpus::path_048_tests_lang_eval_fail_eq_slot_lessthan_nix868 PASS [ 0.061s] ( 849/1760) iets syntax::tests::lang_corpus::path_044_tests_lang_eval_fail_eol_1_nix869 PASS [ 0.023s] ( 850/1760) iets syntax::tests::lang_corpus::path_049_tests_lang_eval_fail_fetchTree_negative_nix870 PASS [ 0.063s] ( 851/1760) iets syntax::tests::lang_corpus::path_045_tests_lang_eval_fail_eol_2_nix871 PASS [ 0.079s] ( 852/1760) iets syntax::tests::lang_corpus::path_040_tests_lang_eval_fail_dynamic_attrs_let_3_nix872 PASS [ 0.026s] ( 853/1760) iets syntax::tests::lang_corpus::path_052_tests_lang_eval_fail_fetchurl_baseName_attrs_nix873 PASS [ 0.034s] ( 854/1760) iets syntax::tests::lang_corpus::path_051_tests_lang_eval_fail_fetchurl_baseName_attrs_name_nix874 PASS [ 0.039s] ( 855/1760) iets syntax::tests::lang_corpus::path_050_tests_lang_eval_fail_fetchTree_relative_path_nix875 PASS [ 0.020s] ( 856/1760) iets syntax::tests::lang_corpus::path_057_tests_lang_eval_fail_fromJSON_overflowing_nix876 PASS [ 0.023s] ( 857/1760) iets syntax::tests::lang_corpus::path_055_tests_lang_eval_fail_foldlStrict_strict_op_application_nix877 PASS [ 0.027s] ( 858/1760) iets syntax::tests::lang_corpus::path_053_tests_lang_eval_fail_fetchurl_baseName_nix878 PASS [ 0.022s] ( 859/1760) iets syntax::tests::lang_corpus::path_056_tests_lang_eval_fail_fromJSON_keyWithNullByte_nix879 PASS [ 0.027s] ( 860/1760) iets syntax::tests::lang_corpus::path_054_tests_lang_eval_fail_flake_ref_to_string_negative_integer_nix880 PASS [ 1.142s] ( 861/1760) iets lint::flake_cases::a_pre_existing_store_path_is_still_a_recopy881 PASS [ 0.032s] ( 862/1760) iets syntax::tests::lang_corpus::path_058_tests_lang_eval_fail_fromJSON_valueWithNullByte_nix882 PASS [ 0.022s] ( 863/1760) iets syntax::tests::lang_corpus::path_059_tests_lang_eval_fail_fromTOML_keyWithNullByte_nix883 PASS [ 0.022s] ( 864/1760) iets syntax::tests::lang_corpus::path_060_tests_lang_eval_fail_fromTOML_overflow_nix884 PASS [ 0.020s] ( 865/1760) iets syntax::tests::lang_corpus::path_061_tests_lang_eval_fail_fromTOML_timestamps_nix885 PASS [ 0.024s] ( 866/1760) iets syntax::tests::lang_corpus::path_062_tests_lang_eval_fail_fromTOML_underflow_nix886 PASS [ 0.032s] ( 867/1760) iets syntax::tests::lang_corpus::path_067_tests_lang_eval_fail_genericClosure_element_not_attrset_nix887 PASS [ 0.020s] ( 868/1760) iets syntax::tests::lang_corpus::path_068_tests_lang_eval_fail_genericClosure_keys_incompatible_types_nix888 PASS [ 0.018s] ( 869/1760) iets syntax::tests::lang_corpus::path_069_tests_lang_eval_fail_genericClosure_keys_uncomparable_nix889 PASS [ 0.033s] ( 870/1760) iets syntax::tests::lang_corpus::path_066_tests_lang_eval_fail_genericClosure_element_missing_key_nix890 PASS [ 0.018s] ( 871/1760) iets syntax::tests::lang_corpus::path_071_tests_lang_eval_fail_genericClosure_missing_startSet_nix891 PASS [ 0.019s] ( 872/1760) iets syntax::tests::lang_corpus::path_070_tests_lang_eval_fail_genericClosure_missing_operator_nix892 PASS [ 0.039s] ( 873/1760) iets syntax::tests::lang_corpus::path_064_tests_lang_eval_fail_functor_loop_nix893 PASS [ 0.023s] ( 874/1760) iets syntax::tests::lang_corpus::path_072_tests_lang_eval_fail_genericClosure_not_attrset_nix894 PASS [ 0.051s] ( 875/1760) iets syntax::tests::lang_corpus::path_065_tests_lang_eval_fail_genericClosure_deeply_nested_element_nix895 PASS [ 0.039s] ( 876/1760) iets syntax::tests::lang_corpus::path_073_tests_lang_eval_fail_genericClosure_operator_not_function_nix896 PASS [ 0.028s] ( 877/1760) iets syntax::tests::lang_corpus::path_080_tests_lang_eval_fail_infinite_recursion_lambda_nix897 PASS [ 0.076s] ( 878/1760) iets syntax::tests::lang_corpus::path_063_tests_lang_eval_fail_fromTOML_valueWithNullByte_nix898 PASS [ 0.041s] ( 879/1760) iets syntax::tests::lang_corpus::path_074_tests_lang_eval_fail_genericClosure_operator_not_list_nix899 PASS [ 0.039s] ( 880/1760) iets syntax::tests::lang_corpus::path_079_tests_lang_eval_fail_home_path_fatal_nix900 PASS [ 0.043s] ( 881/1760) iets syntax::tests::lang_corpus::path_077_tests_lang_eval_fail_getflake_relative_nix901 PASS [ 0.046s] ( 882/1760) iets syntax::tests::lang_corpus::path_075_tests_lang_eval_fail_genericClosure_startSet_not_list_nix902 PASS [ 0.047s] ( 883/1760) iets syntax::tests::lang_corpus::path_078_tests_lang_eval_fail_hashfile_missing_nix903 PASS [ 0.041s] ( 884/1760) iets syntax::tests::lang_corpus::path_081_tests_lang_eval_fail_json_attr_not_json_nix904 PASS [ 0.031s] ( 885/1760) iets syntax::tests::lang_corpus::path_084_tests_lang_eval_fail_missing_arg_import_nix905 PASS [ 0.025s] ( 886/1760) iets syntax::tests::lang_corpus::path_089_tests_lang_eval_fail_not_throws_nix906 PASS [ 0.035s] ( 887/1760) iets syntax::tests::lang_corpus::path_083_tests_lang_eval_fail_memoised_error_trace_not_mutated_nix907 PASS [ 0.044s] ( 888/1760) iets syntax::tests::lang_corpus::path_088_tests_lang_eval_fail_nonexist_path_nix908 PASS [ 0.047s] ( 889/1760) iets syntax::tests::lang_corpus::path_087_tests_lang_eval_fail_nested_list_items_nix909 PASS [ 0.015s] ( 890/1760) iets syntax::tests::lang_corpus::path_093_tests_lang_eval_fail_overflowing_sub_nix910 PASS [ 0.051s] ( 891/1760) iets syntax::tests::lang_corpus::path_086_tests_lang_eval_fail_mutual_recursion_nix911 PASS [ 0.095s] ( 892/1760) iets syntax::tests::lang_corpus::path_076_tests_lang_eval_fail_getflake_fragment_nix912 PASS [ 0.049s] ( 893/1760) iets syntax::tests::lang_corpus::path_090_tests_lang_eval_fail_overflowing_add_nix913 PASS [ 0.038s] ( 894/1760) iets syntax::tests::lang_corpus::path_092_tests_lang_eval_fail_overflowing_mul_nix914 PASS [ 0.022s] ( 895/1760) iets syntax::tests::lang_corpus::path_095_tests_lang_eval_fail_parse_flake_ref_relative_nix915 PASS [ 0.075s] ( 896/1760) iets syntax::tests::lang_corpus::path_085_tests_lang_eval_fail_missing_arg_nix916 PASS [ 0.027s] ( 897/1760) iets syntax::tests::lang_corpus::path_094_tests_lang_eval_fail_parse_flake_ref_fragment_nix917 PASS [ 0.077s] ( 898/1760) iets syntax::tests::lang_corpus::path_082_tests_lang_eval_fail_list_nix918 PASS [ 0.029s] ( 899/1760) iets syntax::tests::lang_corpus::path_096_tests_lang_eval_fail_path_slash_nix919 PASS [ 0.052s] ( 900/1760) iets syntax::tests::lang_corpus::path_091_tests_lang_eval_fail_overflowing_div_nix920 PASS [ 0.033s] ( 901/1760) iets syntax::tests::lang_corpus::path_097_tests_lang_eval_fail_pipe_operators_nix921 PASS [ 0.035s] ( 902/1760) iets syntax::tests::lang_corpus::path_098_tests_lang_eval_fail_readDir_nonexistent_1_nix922 PASS [ 0.026s] ( 903/1760) iets syntax::tests::lang_corpus::path_099_tests_lang_eval_fail_readDir_nonexistent_2_nix923 PASS [ 0.018s] ( 904/1760) iets syntax::tests::lang_corpus::path_103_tests_lang_eval_fail_remove_nix924 PASS [ 0.022s] ( 905/1760) iets syntax::tests::lang_corpus::path_102_tests_lang_eval_fail_recursion_nix925 PASS [ 0.035s] ( 906/1760) iets syntax::tests::lang_corpus::path_101_tests_lang_eval_fail_readDir_not_a_directory_2_nix926 PASS [ 0.031s] ( 907/1760) iets syntax::tests::lang_corpus::path_106_tests_lang_eval_fail_set_override_nix927 PASS [ 0.066s] ( 908/1760) iets syntax::tests::lang_corpus::path_104_tests_lang_eval_fail_scope_5_nix928 PASS [ 0.052s] ( 909/1760) iets syntax::tests::lang_corpus::path_108_tests_lang_eval_fail_short_path_literal_nix929 PASS [ 0.071s] ( 910/1760) iets syntax::tests::lang_corpus::path_100_tests_lang_eval_fail_readDir_not_a_directory_1_nix930 PASS [ 0.063s] ( 911/1760) iets syntax::tests::lang_corpus::path_105_tests_lang_eval_fail_seq_nix931 PASS [ 0.034s] ( 912/1760) iets syntax::tests::lang_corpus::path_112_tests_lang_eval_fail_substring_nix932 PASS [ 0.052s] ( 913/1760) iets syntax::tests::lang_corpus::path_109_tests_lang_eval_fail_sort_comparator_throws_nix933 PASS [ 0.029s] ( 914/1760) iets syntax::tests::lang_corpus::path_113_tests_lang_eval_fail_to_path_nix934 PASS [ 0.052s] ( 915/1760) iets syntax::tests::lang_corpus::path_111_tests_lang_eval_fail_string_nul_2_nix935 PASS [ 0.064s] ( 916/1760) iets syntax::tests::lang_corpus::path_107_tests_lang_eval_fail_set_nix936 PASS [ 0.056s] ( 917/1760) iets syntax::tests::lang_corpus::path_110_tests_lang_eval_fail_string_nul_1_nix937 PASS [ 0.025s] ( 918/1760) iets syntax::tests::lang_corpus::path_119_tests_lang_eval_fail_url_literal_nix938 PASS [ 0.028s] ( 919/1760) iets syntax::tests::lang_corpus::path_120_tests_lang_eval_fail_using_set_as_attr_name_nix939 PASS [ 0.024s] ( 920/1760) iets syntax::tests::lang_corpus::path_122_tests_lang_eval_okay_abs_path_warn_nix940 PASS [ 0.032s] ( 921/1760) iets syntax::tests::lang_corpus::path_118_tests_lang_eval_fail_undeclared_arg_nix941 PASS [ 0.028s] ( 922/1760) iets syntax::tests::lang_corpus::path_115_tests_lang_eval_fail_toJSON_stack_overflow_nix942 PASS [ 0.029s] ( 923/1760) iets syntax::tests::lang_corpus::path_116_tests_lang_eval_fail_toJSON_nix943 PASS [ 0.032s] ( 924/1760) iets syntax::tests::lang_corpus::path_123_tests_lang_eval_okay_any_all_nix944 PASS [ 0.033s] ( 925/1760) iets syntax::tests::lang_corpus::path_121_tests_lang_eval_okay_abs_path_default_nix945 PASS [ 0.037s] ( 926/1760) iets syntax::tests::lang_corpus::path_114_tests_lang_eval_fail_toJSON_non_utf_8_nix946 PASS [ 0.041s] ( 927/1760) iets syntax::tests::lang_corpus::path_117_tests_lang_eval_fail_undeclared_arg_import_nix947 PASS [ 0.018s] ( 928/1760) iets syntax::tests::lang_corpus::path_125_tests_lang_eval_okay_attrnames_nix948 PASS [ 0.025s] ( 929/1760) iets syntax::tests::lang_corpus::path_124_tests_lang_eval_okay_arithmetic_nix949 PASS [ 0.023s] ( 930/1760) iets syntax::tests::lang_corpus::path_126_tests_lang_eval_okay_attrs_nix950 PASS [ 0.015s] ( 931/1760) iets syntax::tests::lang_corpus::path_132_tests_lang_eval_okay_autoargs_nix951 PASS [ 0.036s] ( 932/1760) iets syntax::tests::lang_corpus::path_128_tests_lang_eval_okay_attrs3_nix952 PASS [ 0.032s] ( 933/1760) iets syntax::tests::lang_corpus::path_130_tests_lang_eval_okay_attrs5_nix953 PASS [ 0.023s] ( 934/1760) iets syntax::tests::lang_corpus::path_133_tests_lang_eval_okay_backslash_newline_1_nix954 PASS [ 0.047s] ( 935/1760) iets syntax::tests::lang_corpus::path_127_tests_lang_eval_okay_attrs2_nix955 PASS [ 0.024s] ( 936/1760) iets syntax::tests::lang_corpus::path_136_tests_lang_eval_okay_builtins_add_nix956 PASS [ 0.044s] ( 937/1760) iets syntax::tests::lang_corpus::path_129_tests_lang_eval_okay_attrs4_nix957 PASS [ 0.033s] ( 938/1760) iets syntax::tests::lang_corpus::path_134_tests_lang_eval_okay_backslash_newline_2_nix958 PASS [ 0.044s] ( 939/1760) iets syntax::tests::lang_corpus::path_131_tests_lang_eval_okay_attrs6_nix959 PASS [ 0.014s] ( 940/1760) iets syntax::tests::lang_corpus::path_138_tests_lang_eval_okay_builtins_nix960 PASS [ 0.021s] ( 941/1760) iets syntax::tests::lang_corpus::path_139_tests_lang_eval_okay_callable_attrs_nix961 PASS [ 0.023s] ( 942/1760) iets syntax::tests::lang_corpus::path_140_tests_lang_eval_okay_catattrs_nix962 PASS [ 0.015s] ( 943/1760) iets syntax::tests::lang_corpus::path_145_tests_lang_eval_okay_concatmap_nix963 PASS [ 0.050s] ( 944/1760) iets syntax::tests::lang_corpus::path_135_tests_lang_eval_okay_baseNameOf_nix964 PASS [ 0.021s] ( 945/1760) iets syntax::tests::lang_corpus::path_141_tests_lang_eval_okay_closure_nix965 PASS [ 0.020s] ( 946/1760) iets syntax::tests::lang_corpus::path_144_tests_lang_eval_okay_concat_nix966 PASS [ 0.022s] ( 947/1760) iets syntax::tests::lang_corpus::path_143_tests_lang_eval_okay_compare_operand_order_nix967 PASS [ 0.044s] ( 948/1760) iets syntax::tests::lang_corpus::path_137_tests_lang_eval_okay_builtins_dirOf_nix968 PASS [ 0.009s] ( 949/1760) iets syntax::tests::lang_corpus::path_148_tests_lang_eval_okay_context_nix969 PASS [ 0.029s] ( 950/1760) iets syntax::tests::lang_corpus::path_142_tests_lang_eval_okay_comments_nix970 PASS [ 0.017s] ( 951/1760) iets syntax::tests::lang_corpus::path_153_tests_lang_eval_okay_delayed_with_inherit_nix971 PASS [ 0.033s] ( 952/1760) iets syntax::tests::lang_corpus::path_146_tests_lang_eval_okay_concatstringssep_nix972 PASS [ 0.026s] ( 953/1760) iets syntax::tests::lang_corpus::path_147_tests_lang_eval_okay_context_introspection_nix973 PASS [ 0.024s] ( 954/1760) iets syntax::tests::lang_corpus::path_149_tests_lang_eval_okay_convertHash_nix974 PASS [ 0.024s] ( 955/1760) iets syntax::tests::lang_corpus::path_150_tests_lang_eval_okay_curpos_nix975 PASS [ 0.020s] ( 956/1760) iets syntax::tests::lang_corpus::path_155_tests_lang_eval_okay_deprecate_cursed_or_nix976 PASS [ 0.027s] ( 957/1760) iets syntax::tests::lang_corpus::path_151_tests_lang_eval_okay_curried_calls_nix977 PASS [ 0.008s] ( 958/1760) iets syntax::tests::lang_corpus::path_158_tests_lang_eval_okay_dotdotslash_path_fatal_nix978 PASS [ 0.024s] ( 959/1760) iets syntax::tests::lang_corpus::path_156_tests_lang_eval_okay_derivation_legacy_nix979 PASS [ 0.015s] ( 960/1760) iets syntax::tests::lang_corpus::path_157_tests_lang_eval_okay_dotdotslash_abs_fatal_nix980 PASS [ 0.034s] ( 961/1760) iets syntax::tests::lang_corpus::path_154_tests_lang_eval_okay_delayed_with_nix981 PASS [ 0.021s] ( 962/1760) iets syntax::tests::lang_corpus::path_159_tests_lang_eval_okay_dotslash_abs_fatal_nix982 PASS [ 0.020s] ( 963/1760) iets syntax::tests::lang_corpus::path_160_tests_lang_eval_okay_dotslash_path_fatal_nix983 PASS [ 0.023s] ( 964/1760) iets syntax::tests::lang_corpus::path_161_tests_lang_eval_okay_dynamic_attrs_2_nix984 PASS [ 0.021s] ( 965/1760) iets syntax::tests::lang_corpus::path_164_tests_lang_eval_okay_dynamic_attrs_nix985 PASS [ 0.013s] ( 966/1760) iets syntax::tests::lang_corpus::path_167_tests_lang_eval_okay_eq_derivations_nix986 PASS [ 0.016s] ( 967/1760) iets syntax::tests::lang_corpus::path_166_tests_lang_eval_okay_empty_args_nix987 PASS [ 0.026s] ( 968/1760) iets syntax::tests::lang_corpus::path_162_tests_lang_eval_okay_dynamic_attrs_3_nix988 PASS [ 0.049s] ( 969/1760) iets syntax::tests::lang_corpus::path_152_tests_lang_eval_okay_deepseq_nix989 PASS [ 0.012s] ( 970/1760) iets syntax::tests::lang_corpus::path_169_tests_lang_eval_okay_eq_slot_derivations_nix990 PASS [ 0.022s] ( 971/1760) iets syntax::tests::lang_corpus::path_165_tests_lang_eval_okay_elem_nix991 PASS [ 0.038s] ( 972/1760) iets syntax::tests::lang_corpus::path_163_tests_lang_eval_okay_dynamic_attrs_bare_nix992 PASS [ 0.033s] ( 973/1760) iets syntax::tests::lang_corpus::path_170_tests_lang_eval_okay_eq_slot_elem_nix993 PASS [ 0.039s] ( 974/1760) iets syntax::tests::lang_corpus::path_178_tests_lang_eval_okay_equal_function_list_distinct_similar_nix994 PASS [ 0.057s] ( 975/1760) iets syntax::tests::lang_corpus::path_171_tests_lang_eval_okay_eq_slot_identity_nix995 PASS [ 0.056s] ( 976/1760) iets syntax::tests::lang_corpus::path_174_tests_lang_eval_okay_equal_function_attrset_distinct_similar_nix996 PASS [ 0.068s] ( 977/1760) iets syntax::tests::lang_corpus::path_168_tests_lang_eval_okay_eq_slot_attrs_nix997 PASS [ 0.060s] ( 978/1760) iets syntax::tests::lang_corpus::path_176_tests_lang_eval_okay_equal_function_direct_distinct_similar_nix998 PASS [ 0.023s] ( 979/1760) iets syntax::tests::lang_corpus::path_180_tests_lang_eval_okay_filter_nix999 PASS [ 0.075s] ( 980/1760) iets syntax::tests::lang_corpus::path_175_tests_lang_eval_okay_equal_function_attrset_identical_nix1000 PASS [ 0.072s] ( 981/1760) iets syntax::tests::lang_corpus::path_177_tests_lang_eval_okay_equal_function_direct_identical_nix1001 PASS [ 0.077s] ( 982/1760) iets syntax::tests::lang_corpus::path_173_tests_lang_eval_okay_eq_nix1002 PASS [ 0.022s] ( 983/1760) iets syntax::tests::lang_corpus::path_181_tests_lang_eval_okay_flake_ref_round_trip_nix1003 PASS [ 0.078s] ( 984/1760) iets syntax::tests::lang_corpus::path_172_tests_lang_eval_okay_eq_slot_sort_nix1004 PASS [ 0.051s] ( 985/1760) iets syntax::tests::lang_corpus::path_179_tests_lang_eval_okay_equal_function_list_identical_nix1005 PASS [ 0.035s] ( 986/1760) iets syntax::tests::lang_corpus::path_182_tests_lang_eval_okay_flake_ref_to_string_schemes_nix1006 PASS [ 0.036s] ( 987/1760) iets syntax::tests::lang_corpus::path_184_tests_lang_eval_okay_flatten_nix1007 PASS [ 0.042s] ( 988/1760) iets syntax::tests::lang_corpus::path_185_tests_lang_eval_okay_float_range_nix1008 PASS [ 0.043s] ( 989/1760) iets syntax::tests::lang_corpus::path_189_tests_lang_eval_okay_foldlStrict_lazy_initial_accumulator_nix1009 PASS [ 0.043s] ( 990/1760) iets syntax::tests::lang_corpus::path_188_tests_lang_eval_okay_foldlStrict_lazy_elements_nix1010 PASS [ 0.021s] ( 991/1760) iets syntax::tests::lang_corpus::path_193_tests_lang_eval_okay_fromjson_deep_nix1011 PASS [ 0.045s] ( 992/1760) iets syntax::tests::lang_corpus::path_190_tests_lang_eval_okay_foldlStrict_nix1012 PASS [ 0.043s] ( 993/1760) iets syntax::tests::lang_corpus::path_191_tests_lang_eval_okay_fromTOML_timestamps_nix1013 PASS [ 0.049s] ( 994/1760) iets syntax::tests::lang_corpus::path_186_tests_lang_eval_okay_float_nix1014 PASS [ 0.068s] ( 995/1760) iets syntax::tests::lang_corpus::path_183_tests_lang_eval_okay_flake_ref_to_string_nix1015 PASS [ 0.040s] ( 996/1760) iets syntax::tests::lang_corpus::path_192_tests_lang_eval_okay_fromTOML_nix1016 PASS [ 0.012s] ( 997/1760) iets syntax::tests::lang_corpus::path_200_tests_lang_eval_okay_getattrpos_nix1017 PASS [ 0.030s] ( 998/1760) iets syntax::tests::lang_corpus::path_194_tests_lang_eval_okay_fromjson_escapes_nix1018 PASS [ 0.028s] ( 999/1760) iets syntax::tests::lang_corpus::path_195_tests_lang_eval_okay_fromjson_nix1019 PASS [ 0.021s] (1000/1760) iets syntax::tests::lang_corpus::path_201_tests_lang_eval_okay_getenv_nix1020 PASS [ 0.026s] (1001/1760) iets syntax::tests::lang_corpus::path_199_tests_lang_eval_okay_getattrpos_undefined_nix1021 PASS [ 0.024s] (1002/1760) iets syntax::tests::lang_corpus::path_202_tests_lang_eval_okay_getflake_nix1022 PASS [ 0.037s] (1003/1760) iets syntax::tests::lang_corpus::path_198_tests_lang_eval_okay_getattrpos_functionargs_nix1023 PASS [ 0.037s] (1004/1760) iets syntax::tests::lang_corpus::path_197_tests_lang_eval_okay_functor_args_nix1024 PASS [ 0.041s] (1005/1760) iets syntax::tests::lang_corpus::path_196_tests_lang_eval_okay_functionargs_nix1025 PASS [ 0.086s] (1006/1760) iets syntax::tests::lang_corpus::path_187_tests_lang_eval_okay_floor_ceil_nix1026 PASS [ 0.018s] (1007/1760) iets syntax::tests::lang_corpus::path_205_tests_lang_eval_okay_hashfile_stat_size_nix1027 PASS [ 0.031s] (1008/1760) iets syntax::tests::lang_corpus::path_203_tests_lang_eval_okay_groupBy_nix1028 PASS [ 0.011s] (1009/1760) iets syntax::tests::lang_corpus::path_209_tests_lang_eval_okay_home_path_warn_nix1029 PASS [ 0.022s] (1010/1760) iets syntax::tests::lang_corpus::path_207_tests_lang_eval_okay_hashstring_nix1030 PASS [ 0.012s] (1011/1760) iets syntax::tests::lang_corpus::path_210_tests_lang_eval_okay_if_nix1031 PASS [ 0.027s] (1012/1760) iets syntax::tests::lang_corpus::path_204_tests_lang_eval_okay_hash_blake3_nix1032 PASS [ 0.032s] (1013/1760) iets syntax::tests::lang_corpus::path_206_tests_lang_eval_okay_hashfile_nix1033 PASS [ 0.023s] (1014/1760) iets syntax::tests::lang_corpus::path_208_tests_lang_eval_okay_home_path_not_normalised_nix1034 PASS [ 0.020s] (1015/1760) iets syntax::tests::lang_corpus::path_213_tests_lang_eval_okay_import_nix1035 PASS [ 0.015s] (1016/1760) iets syntax::tests::lang_corpus::path_217_tests_lang_eval_okay_intersectAttrs_nix1036 PASS [ 0.026s] (1017/1760) iets syntax::tests::lang_corpus::path_212_tests_lang_eval_okay_import_tostring_nix1037 PASS [ 0.027s] (1018/1760) iets syntax::tests::lang_corpus::path_211_tests_lang_eval_okay_import_follows_symlink_nix1038 PASS [ 0.025s] (1019/1760) iets syntax::tests::lang_corpus::path_215_tests_lang_eval_okay_inherit_attr_pos_nix1039 PASS [ 0.034s] (1020/1760) iets syntax::tests::lang_corpus::path_214_tests_lang_eval_okay_ind_string_nix1040 PASS [ 0.016s] (1021/1760) iets syntax::tests::lang_corpus::path_223_tests_lang_eval_okay_map_nix1041 PASS [ 0.021s] (1022/1760) iets syntax::tests::lang_corpus::path_220_tests_lang_eval_okay_list_nix1042 PASS [ 0.023s] (1023/1760) iets syntax::tests::lang_corpus::path_219_tests_lang_eval_okay_let_nix1043 PASS [ 0.010s] (1024/1760) iets syntax::tests::lang_corpus::path_225_tests_lang_eval_okay_merge_dynamic_attrs_nix1044 PASS [ 0.030s] (1025/1760) iets syntax::tests::lang_corpus::path_222_tests_lang_eval_okay_logic_nix1045 PASS [ 0.048s] (1026/1760) iets syntax::tests::lang_corpus::path_216_tests_lang_eval_okay_inherit_from_nix1046 PASS [ 0.032s] (1027/1760) iets syntax::tests::lang_corpus::path_224_tests_lang_eval_okay_mapattrs_nix1047 PASS [ 0.045s] (1028/1760) iets syntax::tests::lang_corpus::path_218_tests_lang_eval_okay_json_attr_normalised_nix1048 PASS [ 0.050s] (1029/1760) iets syntax::tests::lang_corpus::path_221_tests_lang_eval_okay_listtoattrs_nix1049 PASS [ 0.031s] (1030/1760) iets syntax::tests::lang_corpus::path_229_tests_lang_eval_okay_null_dynamic_attrs_nix1050 PASS [ 0.041s] (1031/1760) iets syntax::tests::lang_corpus::path_233_tests_lang_eval_okay_parse_flake_ref_github_nix1051 PASS [ 0.058s] (1032/1760) iets syntax::tests::lang_corpus::path_228_tests_lang_eval_okay_new_let_nix1052 PASS [ 0.040s] (1033/1760) iets syntax::tests::lang_corpus::path_234_tests_lang_eval_okay_parse_flake_ref_indirect_nix1053 PASS [ 0.044s] (1034/1760) iets syntax::tests::lang_corpus::path_232_tests_lang_eval_okay_parse_flake_ref_git_nix1054 PASS [ 0.060s] (1035/1760) iets syntax::tests::lang_corpus::path_227_tests_lang_eval_okay_nested_with_nix1055 PASS [ 0.063s] (1036/1760) iets syntax::tests::lang_corpus::path_226_tests_lang_eval_okay_nan_to_string_nix1056 PASS [ 0.033s] (1037/1760) iets syntax::tests::lang_corpus::path_236_tests_lang_eval_okay_parse_flake_ref_tarball_nix1057 PASS [ 0.054s] (1038/1760) iets syntax::tests::lang_corpus::path_231_tests_lang_eval_okay_overrides_nix1058 PASS [ 0.069s] (1039/1760) iets syntax::tests::lang_corpus::path_230_tests_lang_eval_okay_overrides_thunks_nix1059 PASS [ 0.022s] (1040/1760) iets syntax::tests::lang_corpus::path_240_tests_lang_eval_okay_path_nix1060 PASS [ 0.023s] (1041/1760) iets syntax::tests::lang_corpus::path_241_tests_lang_eval_okay_pathexists_nix1061 PASS [ 0.030s] (1042/1760) iets syntax::tests::lang_corpus::path_237_tests_lang_eval_okay_parse_flake_ref_nix1062 PASS [ 0.027s] (1043/1760) iets syntax::tests::lang_corpus::path_243_tests_lang_eval_okay_print_nix1063 PASS [ 0.027s] (1044/1760) iets syntax::tests::lang_corpus::path_244_tests_lang_eval_okay_readDir_symlinked_directory_nix1064 PASS [ 0.037s] (1045/1760) iets syntax::tests::lang_corpus::path_239_tests_lang_eval_okay_path_string_interpolation_nix1065 PASS [ 0.063s] (1046/1760) iets syntax::tests::lang_corpus::path_235_tests_lang_eval_okay_parse_flake_ref_path_nix1066 PASS [ 0.038s] (1047/1760) iets syntax::tests::lang_corpus::path_238_tests_lang_eval_okay_partition_nix1067 PASS [ 0.033s] (1048/1760) iets syntax::tests::lang_corpus::path_242_tests_lang_eval_okay_patterns_nix1068 PASS [ 0.017s] (1049/1760) iets syntax::tests::lang_corpus::path_246_tests_lang_eval_okay_readFileType_nix1069 PASS [ 0.028s] (1050/1760) iets syntax::tests::lang_corpus::path_245_tests_lang_eval_okay_readDir_nix1070 PASS [ 0.017s] (1051/1760) iets syntax::tests::lang_corpus::path_247_tests_lang_eval_okay_readfile_context_nix1071 PASS [ 0.012s] (1052/1760) iets syntax::tests::lang_corpus::path_254_tests_lang_eval_okay_regression_20220125_nix1072 PASS [ 0.020s] (1053/1760) iets syntax::tests::lang_corpus::path_248_tests_lang_eval_okay_readfile_nix1073 PASS [ 0.015s] (1054/1760) iets syntax::tests::lang_corpus::path_251_tests_lang_eval_okay_regex_match2_nix1074 PASS [ 0.022s] (1055/1760) iets syntax::tests::lang_corpus::path_249_tests_lang_eval_okay_redefine_builtin_nix1075 PASS [ 0.020s] (1056/1760) iets syntax::tests::lang_corpus::path_250_tests_lang_eval_okay_regex_match_nix1076 PASS [ 0.014s] (1057/1760) iets syntax::tests::lang_corpus::path_257_tests_lang_eval_okay_repeated_empty_attrs_nix1077 PASS [ 0.018s] (1058/1760) iets syntax::tests::lang_corpus::path_255_tests_lang_eval_okay_regrettable_rec_attrset_merge_nix1078 PASS [ 0.019s] (1059/1760) iets syntax::tests::lang_corpus::path_256_tests_lang_eval_okay_remove_nix1079 PASS [ 0.013s] (1060/1760) iets syntax::tests::lang_corpus::path_258_tests_lang_eval_okay_repeated_empty_list_nix1080 PASS [ 0.027s] (1061/1760) iets syntax::tests::lang_corpus::path_253_tests_lang_eval_okay_regression_20220122_nix1081 PASS [ 0.033s] (1062/1760) iets syntax::tests::lang_corpus::path_252_tests_lang_eval_okay_regex_split_nix1082 PASS [ 0.018s] (1063/1760) iets syntax::tests::lang_corpus::path_260_tests_lang_eval_okay_scope_1_nix1083 PASS [ 0.021s] (1064/1760) iets syntax::tests::lang_corpus::path_259_tests_lang_eval_okay_replacestrings_nix1084 PASS [ 0.017s] (1065/1760) iets syntax::tests::lang_corpus::path_263_tests_lang_eval_okay_scope_4_nix1085 PASS [ 0.020s] (1066/1760) iets syntax::tests::lang_corpus::path_261_tests_lang_eval_okay_scope_2_nix1086 PASS [ 0.014s] (1067/1760) iets syntax::tests::lang_corpus::path_266_tests_lang_eval_okay_search_path_prefix_slash_nix1087 PASS [ 0.020s] (1068/1760) iets syntax::tests::lang_corpus::path_264_tests_lang_eval_okay_scope_6_nix1088 PASS [ 0.021s] (1069/1760) iets syntax::tests::lang_corpus::path_265_tests_lang_eval_okay_scope_7_nix1089 PASS [ 0.024s] (1070/1760) iets syntax::tests::lang_corpus::path_262_tests_lang_eval_okay_scope_3_nix1090 PASS [ 0.021s] (1071/1760) iets syntax::tests::lang_corpus::path_267_tests_lang_eval_okay_search_path_nix1091 PASS [ 0.015s] (1072/1760) iets syntax::tests::lang_corpus::path_268_tests_lang_eval_okay_seq_nix1092 PASS [ 0.013s] (1073/1760) iets syntax::tests::lang_corpus::path_270_tests_lang_eval_okay_short_path_variation_nix1093 PASS [ 0.011s] (1074/1760) iets syntax::tests::lang_corpus::path_271_tests_lang_eval_okay_sort_peeksort_nix1094 PASS [ 0.017s] (1075/1760) iets syntax::tests::lang_corpus::path_269_tests_lang_eval_okay_short_path_literal_warn_nix1095 PASS [ 0.009s] (1076/1760) iets syntax::tests::lang_corpus::path_275_tests_lang_eval_okay_strings_as_attrs_names_nix1096 PASS [ 0.022s] (1077/1760) iets syntax::tests::lang_corpus::path_276_tests_lang_eval_okay_substring_context_nix1097 PASS [ 0.025s] (1078/1760) iets syntax::tests::lang_corpus::path_274_tests_lang_eval_okay_string_nix1098 PASS [ 0.027s] (1079/1760) iets syntax::tests::lang_corpus::path_273_tests_lang_eval_okay_splitversion_nix1099 PASS [ 0.022s] (1080/1760) iets syntax::tests::lang_corpus::path_278_tests_lang_eval_okay_symlink_resolution_nix1100 PASS [ 0.021s] (1081/1760) iets syntax::tests::lang_corpus::path_280_tests_lang_eval_okay_toxml_nix1101 PASS [ 0.030s] (1082/1760) iets syntax::tests::lang_corpus::path_272_tests_lang_eval_okay_sort_nix1102 PASS [ 0.022s] (1083/1760) iets syntax::tests::lang_corpus::path_279_tests_lang_eval_okay_tojson_nix1103 PASS [ 0.018s] (1084/1760) iets syntax::tests::lang_corpus::path_282_tests_lang_eval_okay_tryeval_failed_thunk_reeval_nix1104 PASS [ 0.021s] (1085/1760) iets syntax::tests::lang_corpus::path_281_tests_lang_eval_okay_toxml2_nix1105 PASS [ 0.028s] (1086/1760) iets syntax::tests::lang_corpus::path_277_tests_lang_eval_okay_substring_nix1106 PASS [ 0.022s] (1087/1760) iets syntax::tests::lang_corpus::path_283_tests_lang_eval_okay_tryeval_nix1107 PASS [ 0.021s] (1088/1760) iets syntax::tests::lang_corpus::path_284_tests_lang_eval_okay_types_nix1108 PASS [ 0.022s] (1089/1760) iets syntax::tests::lang_corpus::path_287_tests_lang_eval_okay_url_literal_warn_nix1109 PASS [ 0.022s] (1090/1760) iets syntax::tests::lang_corpus::path_289_tests_lang_eval_okay_versions_nix1110 PASS [ 0.021s] (1091/1760) iets syntax::tests::lang_corpus::path_291_tests_lang_eval_okay_virtual_mem_nix1111 PASS [ 0.018s] (1092/1760) iets syntax::tests::lang_corpus::path_292_tests_lang_eval_okay_with_nix1112 PASS [ 0.029s] (1093/1760) iets syntax::tests::lang_corpus::path_290_tests_lang_eval_okay_virtual_copy_nix1113 PASS [ 0.038s] (1094/1760) iets syntax::tests::lang_corpus::path_286_tests_lang_eval_okay_url_literal_quoted_fatal_nix1114 PASS [ 0.050s] (1095/1760) iets syntax::tests::lang_corpus::path_285_tests_lang_eval_okay_url_literal_default_nix1115 PASS [ 0.028s] (1096/1760) iets syntax::tests::lang_corpus::path_294_tests_lang_imported_nix1116 PASS [ 0.028s] (1097/1760) iets syntax::tests::lang_corpus::path_295_tests_lang_imported2_nix1117 PASS [ 0.030s] (1098/1760) iets syntax::tests::lang_corpus::path_298_tests_lang_non_eval_trivial_lambda_formals_nix1118 PASS [ 0.032s] (1099/1760) iets syntax::tests::lang_corpus::path_296_tests_lang_infinite_nesting_nix1119 PASS [ 0.025s] (1100/1760) iets syntax::tests::lang_corpus::path_299_tests_lang_parse_fail_dup_attrs_1_nix1120 PASS [ 0.066s] (1101/1760) iets syntax::tests::lang_corpus::path_288_tests_lang_eval_okay_versions_int_range_nix1121 PASS [ 0.020s] (1102/1760) iets syntax::tests::lang_corpus::path_301_tests_lang_parse_fail_dup_attrs_3_nix1122 PASS [ 0.048s] (1103/1760) iets syntax::tests::lang_corpus::path_297_tests_lang_lib_nix1123 PASS [ 0.021s] (1104/1760) iets syntax::tests::lang_corpus::path_306_tests_lang_parse_fail_eof_pos_nix1124 PASS [ 0.028s] (1105/1760) iets syntax::tests::lang_corpus::path_302_tests_lang_parse_fail_dup_attrs_4_nix1125 PASS [ 0.039s] (1106/1760) iets syntax::tests::lang_corpus::path_300_tests_lang_parse_fail_dup_attrs_2_nix1126 PASS [ 0.024s] (1107/1760) iets syntax::tests::lang_corpus::path_304_tests_lang_parse_fail_dup_formals_nix1127 PASS [ 0.012s] (1108/1760) iets syntax::tests::lang_corpus::path_307_tests_lang_parse_fail_float_overflow_nix1128 PASS [ 0.031s] (1109/1760) iets syntax::tests::lang_corpus::path_303_tests_lang_parse_fail_dup_attrs_7_nix1129 PASS [ 0.027s] (1110/1760) iets syntax::tests::lang_corpus::path_305_tests_lang_parse_fail_eof_in_string_nix1130 PASS [ 0.062s] (1111/1760) iets syntax::tests::lang_corpus::path_293_tests_lang_eval_okay_zipAttrsWith_nix1131 PASS [ 0.008s] (1112/1760) iets syntax::tests::lang_corpus::path_312_tests_lang_parse_fail_path_empty_component_2_nix1132 PASS [ 0.023s] (1113/1760) iets syntax::tests::lang_corpus::path_308_tests_lang_parse_fail_float_subnormal_nix1133 PASS [ 0.024s] (1114/1760) iets syntax::tests::lang_corpus::path_309_tests_lang_parse_fail_float_underflow_nix1134 PASS [ 0.024s] (1115/1760) iets syntax::tests::lang_corpus::path_311_tests_lang_parse_fail_mixed_nested_attrs2_nix1135 PASS [ 0.034s] (1116/1760) iets syntax::tests::lang_corpus::path_313_tests_lang_parse_fail_path_empty_component_nix1136 PASS [ 0.035s] (1117/1760) iets syntax::tests::lang_corpus::path_314_tests_lang_parse_fail_patterns_1_nix1137 PASS [ 0.032s] (1118/1760) iets syntax::tests::lang_corpus::path_317_tests_lang_parse_fail_undef_var_nix1138 PASS [ 0.030s] (1119/1760) iets syntax::tests::lang_corpus::path_319_tests_lang_parse_fail_unexpected_assert_nix1139 PASS [ 0.044s] (1120/1760) iets syntax::tests::lang_corpus::path_316_tests_lang_parse_fail_undef_var_2_nix1140 PASS [ 0.048s] (1121/1760) iets syntax::tests::lang_corpus::path_310_tests_lang_parse_fail_mixed_nested_attrs1_nix1141 PASS [ 0.030s] (1122/1760) iets syntax::tests::lang_corpus::path_320_tests_lang_parse_fail_unexpected_concat_nix1142 PASS [ 0.028s] (1123/1760) iets syntax::tests::lang_corpus::path_321_tests_lang_parse_fail_unexpected_ellipsis_nix1143 PASS [ 0.033s] (1124/1760) iets syntax::tests::lang_corpus::path_324_tests_lang_parse_fail_unexpected_float_nix1144 PASS [ 0.038s] (1125/1760) iets syntax::tests::lang_corpus::path_322_tests_lang_parse_fail_unexpected_else_nix1145 PASS [ 0.069s] (1126/1760) iets syntax::tests::lang_corpus::path_315_tests_lang_parse_fail_regression_20060610_nix1146 PASS [ 0.037s] (1127/1760) iets syntax::tests::lang_corpus::path_323_tests_lang_parse_fail_unexpected_eq_nix1147 PASS [ 0.031s] (1128/1760) iets syntax::tests::lang_corpus::path_325_tests_lang_parse_fail_unexpected_geq_nix1148 PASS [ 0.028s] (1129/1760) iets syntax::tests::lang_corpus::path_327_tests_lang_parse_fail_unexpected_if_nix1149 PASS [ 0.069s] (1130/1760) iets syntax::tests::lang_corpus::path_318_tests_lang_parse_fail_unexpected_and_nix1150 PASS [ 0.031s] (1131/1760) iets syntax::tests::lang_corpus::path_328_tests_lang_parse_fail_unexpected_impl_nix1151 PASS [ 0.032s] (1132/1760) iets syntax::tests::lang_corpus::path_326_tests_lang_parse_fail_unexpected_hpath_nix1152 PASS [ 0.028s] (1133/1760) iets syntax::tests::lang_corpus::path_329_tests_lang_parse_fail_unexpected_in_nix1153 PASS [ 0.019s] (1134/1760) iets syntax::tests::lang_corpus::path_334_tests_lang_parse_fail_unexpected_let_nix1154 PASS [ 0.022s] (1135/1760) iets syntax::tests::lang_corpus::path_332_tests_lang_parse_fail_unexpected_int_nix1155 PASS [ 0.022s] (1136/1760) iets syntax::tests::lang_corpus::path_333_tests_lang_parse_fail_unexpected_leq_nix1156 PASS [ 0.019s] (1137/1760) iets syntax::tests::lang_corpus::path_336_tests_lang_parse_fail_unexpected_or_nix1157 PASS [ 0.015s] (1138/1760) iets syntax::tests::lang_corpus::path_339_tests_lang_parse_fail_unexpected_spath_nix1158 PASS [ 0.019s] (1139/1760) iets syntax::tests::lang_corpus::path_338_tests_lang_parse_fail_unexpected_rec_nix1159 PASS [ 0.035s] (1140/1760) iets syntax::tests::lang_corpus::path_331_tests_lang_parse_fail_unexpected_inherit_nix1160 PASS [ 0.015s] (1141/1760) iets syntax::tests::lang_corpus::path_340_tests_lang_parse_fail_unexpected_then_nix1161 PASS [ 0.029s] (1142/1760) iets syntax::tests::lang_corpus::path_337_tests_lang_parse_fail_unexpected_path_nix1162 PASS [ 0.034s] (1143/1760) iets syntax::tests::lang_corpus::path_335_tests_lang_parse_fail_unexpected_neq_nix1163 PASS [ 0.046s] (1144/1760) iets syntax::tests::lang_corpus::path_330_tests_lang_parse_fail_unexpected_ind_string_nix1164 PASS [ 0.020s] (1145/1760) iets syntax::tests::lang_corpus::path_342_tests_lang_parse_fail_unexpected_uri_nix1165 PASS [ 0.020s] (1146/1760) iets syntax::tests::lang_corpus::path_343_tests_lang_parse_fail_unexpected_with_nix1166 PASS [ 0.012s] (1147/1760) iets syntax::tests::lang_corpus::path_349_tests_lang_parse_okay_ind_string_nix1167 PASS [ 0.020s] (1148/1760) iets syntax::tests::lang_corpus::path_346_tests_lang_parse_okay_crlf_nix1168 PASS [ 0.029s] (1149/1760) iets syntax::tests::lang_corpus::path_344_tests_lang_parse_fail_utf8_nix1169 PASS [ 0.033s] (1150/1760) iets syntax::tests::lang_corpus::path_341_tests_lang_parse_fail_unexpected_update_nix1170 PASS [ 0.022s] (1151/1760) iets syntax::tests::lang_corpus::path_348_tests_lang_parse_okay_dup_attrs_6_nix1171 PASS [ 0.034s] (1152/1760) iets syntax::tests::lang_corpus::path_347_tests_lang_parse_okay_dup_attrs_5_nix1172 PASS [ 0.041s] (1153/1760) iets syntax::tests::lang_corpus::path_351_tests_lang_parse_okay_mixed_nested_attrs_1_nix1173 PASS [ 0.042s] (1154/1760) iets syntax::tests::lang_corpus::path_350_tests_lang_parse_okay_inherits_nix1174 PASS [ 0.030s] (1155/1760) iets syntax::tests::lang_corpus::path_356_tests_lang_parse_okay_subversion_nix1175 PASS [ 0.032s] (1156/1760) iets syntax::tests::lang_corpus::path_355_tests_lang_parse_okay_regression_751_nix1176 PASS [ 0.034s] (1157/1760) iets syntax::tests::lang_corpus::path_354_tests_lang_parse_okay_regression_20041027_nix1177 PASS [ 0.064s] (1158/1760) iets syntax::tests::lang_corpus::path_345_tests_lang_parse_okay_1_nix1178 PASS [ 0.043s] (1159/1760) iets syntax::tests::lang_corpus::path_353_tests_lang_parse_okay_mixed_nested_attrs_3_nix1179 PASS [ 0.035s] (1160/1760) iets syntax::tests::lang_corpus::path_357_tests_lang_parse_okay_url_nix1180 PASS [ 0.013s] (1161/1760) iets syntax::tests::nul_in_string_literals1181 PASS [ 0.017s] (1162/1760) iets syntax::tests::operator_precedence1182 PASS [ 0.023s] (1163/1760) iets syntax::tests::paths1183 PASS [ 0.026s] (1164/1760) iets syntax::tests::numbers1184 PASS [ 0.067s] (1165/1760) iets syntax::tests::lang_corpus::path_352_tests_lang_parse_okay_mixed_nested_attrs_2_nix1185 PASS [ 0.035s] (1166/1760) iets sys::winpath::tests::a_round_trip_is_stable::p_1_r__C_Usersx__1186 PASS [ 0.027s] (1167/1760) iets sys::winpath::tests::a_round_trip_is_stable::p_4_r__ab__1187 PASS [ 0.040s] (1168/1760) iets sys::winpath::tests::a_round_trip_is_stable::p_2_r__C___1188 PASS [ 0.055s] (1169/1760) iets syntax::tests::spans_cover_tokens1189 PASS [ 0.034s] (1170/1760) iets sys::winpath::tests::a_round_trip_is_stable::p_3_r__hostshareab__1190 PASS [ 0.077s] (1171/1760) iets syntax::tests::line_col_counts_bytes1191 PASS [ 0.057s] (1172/1760) iets syntax::tests::the_error_reported_is_the_one_nix_meets_first1192 PASS [ 0.056s] (1173/1760) iets sys::imp::tests::huge_free_counts_orders_nine_and_up1193 PASS [ 0.062s] (1174/1760) iets syntax::tests::string_escapes_and_interpolation1194 PASS [ 0.044s] (1175/1760) iets sys::winpath::tests::a_round_trip_is_stable::p_5_r____a__1195 PASS [ 0.012s] (1176/1760) iets sys::winpath::tests::the_evaluators_form_is_left_alone::p_3______1196 PASS [ 0.026s] (1177/1760) iets sys::winpath::tests::a_round_trip_is_stable::p_6_r___pipex__1197 PASS [ 0.026s] (1178/1760) iets sys::winpath::tests::dot_dot_stops_at_the_anchor1198 PASS [ 0.023s] (1179/1760) iets sys::winpath::tests::the_evaluators_form_is_left_alone::p_1____C__Users_x__1199 PASS [ 0.014s] (1180/1760) iets sys::winpath::tests::to_internal_form::case_04_drive_root1200 PASS [ 0.022s] (1181/1760) iets sys::winpath::tests::the_evaluators_form_is_left_alone::p_5____nonexistent__1201 PASS [ 0.029s] (1182/1760) iets sys::winpath::tests::the_evaluators_form_is_left_alone::p_2____UNC_host_share__1202 PASS [ 0.026s] (1183/1760) iets sys::winpath::tests::the_evaluators_form_is_left_alone::p_4___a_b__1203 PASS [ 0.025s] (1184/1760) iets sys::winpath::tests::to_internal_form::case_02_drive_slash1204 PASS [ 0.023s] (1185/1760) iets sys::winpath::tests::to_internal_form::case_03_drive_lowercase1205 PASS [ 0.032s] (1186/1760) iets sys::winpath::tests::to_internal_form::case_05_bare_drive1206 PASS [ 0.030s] (1187/1760) iets sys::winpath::tests::to_internal_form::case_06_drive_relative1207 PASS [ 0.027s] (1188/1760) iets sys::winpath::tests::to_internal_form::case_09_verbatim_share1208 PASS [ 0.026s] (1189/1760) iets sys::winpath::tests::to_internal_form::case_10_verbatim_share_lowercase1209 PASS [ 0.029s] (1190/1760) iets sys::winpath::tests::to_internal_form::case_08_share1210 PASS [ 0.024s] (1191/1760) iets sys::winpath::tests::to_internal_form::case_12_share_forward_slashes1211 PASS [ 0.026s] (1192/1760) iets sys::winpath::tests::to_internal_form::case_13_share_mixed_slashes1212 PASS [ 0.028s] (1193/1760) iets sys::winpath::tests::to_internal_form::case_18_rooted1213 PASS [ 0.027s] (1194/1760) iets sys::winpath::tests::to_internal_form::case_20_device1214 PASS [ 0.033s] (1195/1760) iets sys::winpath::tests::to_internal_form::case_19_not_a_drive1215 PASS [ 0.069s] (1196/1760) iets sys::winpath::tests::to_internal_form::case_07_mixed_separators1216 PASS [ 0.045s] (1197/1760) iets sys::winpath::tests::to_internal_form::case_14_relative_unc1217 PASS [ 0.037s] (1198/1760) iets sys::winpath::tests::to_internal_form::case_16_relative1218 PASS [ 0.051s] (1199/1760) iets sys::winpath::tests::to_internal_form::case_17_relative_up1219 PASS [ 0.022s] (1200/1760) iets sys::winpath::tests::to_internal_form::case_21_volume1220 PASS [ 0.099s] (1201/1760) iets sys::winpath::tests::to_internal_form::case_01_drive1221 PASS [ 0.056s] (1202/1760) iets sys::winpath::tests::to_internal_form::case_15_relative_unc_lowercase1222 PASS [ 0.034s] (1203/1760) iets sys::winpath::tests::to_native_form::case_03_drive_alone1223 PASS [ 0.040s] (1204/1760) iets sys::winpath::tests::to_native_form::case_01_drive1224 PASS [ 0.040s] (1205/1760) iets sys::winpath::tests::to_native_form::case_02_drive_root1225 PASS [ 0.029s] (1206/1760) iets sys::winpath::tests::to_native_form::case_07_rooted1226 PASS [ 0.056s] (1207/1760) iets sys::winpath::tests::to_native_form::case_06_relative1227 PASS [ 0.032s] (1208/1760) iets sys::winpath::tests::to_native_form::case_12_double_slash_drive1228 PASS [ 0.038s] (1209/1760) iets sys::winpath::tests::to_native_form::case_10_volume1229 PASS [ 0.134s] (1210/1760) iets sys::winpath::tests::to_internal_form::case_11_verbatim_drive1230 PASS [ 0.058s] (1211/1760) iets sys::winpath::tests::to_native_form::case_09_device1231 PASS [ 0.073s] (1212/1760) iets sys::winpath::tests::to_native_form::case_05_share1232 PASS [ 0.058s] (1213/1760) iets sys::winpath::tests::to_native_form::case_08_root1233 PASS [ 0.043s] (1214/1760) iets sys::winpath::tests::to_native_form::case_11_double_slash1234 PASS [ 0.083s] (1215/1760) iets sys::winpath::tests::to_native_form::case_04_bare_drive1235 PASS [ 0.016s] (1216/1760) iets trace::key::tests::relative_path_detection::case_21236 PASS [ 0.022s] (1217/1760) iets trace::key::tests::relative_path_detection::case_11237 PASS [ 0.021s] (1218/1760) iets trace::key::tests::relative_path_detection::case_41238 PASS [ 0.051s] (1219/1760) iets sys::winpath::tests::to_native_form::case_13_double_slash_unc1239 PASS [ 0.024s] (1220/1760) iets trace::key::tests::relative_path_detection::case_31240 PASS [ 0.030s] (1221/1760) iets trace::key::tests::relative_path_detection::case_51241 PASS [ 0.033s] (1222/1760) iets trace::store::tests::bytes_that_are_not_an_entry_are_bad_not_a_panic::case_11242 PASS [ 0.027s] (1223/1760) iets trace::store::tests::bytes_that_are_not_an_entry_are_bad_not_a_panic::case_21243 PASS [ 0.031s] (1224/1760) iets trace::store::tests::bytes_that_are_not_an_entry_are_bad_not_a_panic::case_41244 PASS [ 0.033s] (1225/1760) iets trace::store::tests::one_rename_publishes_every_part1245 PASS [ 0.046s] (1226/1760) iets trace::store::tests::bytes_that_are_not_an_entry_are_bad_not_a_panic::case_31246 PASS [ 0.046s] (1227/1760) iets trace::store::tests::bytes_that_are_not_an_entry_are_bad_not_a_panic::case_51247 PASS [ 0.072s] (1228/1760) iets trace::key::tests::key_is_order_and_value_sensitive1248 PASS [ 0.023s] (1229/1760) iets trace::tests::dedupe_keeps_conflicting_values1249 PASS [ 0.072s] (1230/1760) iets trace::key::tests::relative_path_detection::case_61250 PASS [ 0.019s] (1231/1760) iets trace::tests::dump_fingerprint_matches_the_separate_walk1251 PASS [ 0.075s] (1232/1760) iets trace::store::tests::a_discard_takes_only_the_generation_it_rejected1252 PASS [ 0.017s] (1233/1760) iets trace::tests::fingerprint_changes_with_content_size_and_seen_entries1253 PASS [ 0.072s] (1234/1760) iets trace::store::tests::a_reader_of_one_generation_never_sees_the_next1254 PASS [ 0.015s] (1235/1760) iets trace::validate::dir_hash_tests::dir_hash_agrees_with_dir_listing_hash1255 PASS [ 0.015s] (1236/1760) iets trace::validate::tests::file_touch_refreshes_edit_misses1256 PASS [ 0.021s] (1237/1760) iets trace::validate::tests::a_copy_in_place_that_keeps_the_stat_still_misses1257 PASS [ 0.025s] (1238/1760) iets trace::validate::tests::dir_stat_env_checks1258 PASS [ 0.037s] (1239/1760) iets trace::tests::only_a_named_query_is_an_observation1259 PASS [ 0.047s] (1240/1760) iets trace::validate::tests::a_resolved_path_validates_as_the_same1260 PASS [ 0.036s] (1241/1760) iets trace::watch::tests::only_the_paths_an_mtime_can_speak_for1261 PASS [ 0.030s] (1242/1760) iets trace::wire::tests::readset_roundtrip1262 PASS [ 0.035s] (1243/1760) iets trace::wire::tests::drvs_sources_roots_roundtrip1263 PASS [ 0.041s] (1244/1760) iets treestore::pack::tests::a_pack_reads_back_what_was_written1264 PASS [ 0.060s] (1245/1760) iets trace::validate::tests::what_a_native_path_records_validates1265 PASS [ 0.043s] (1246/1760) iets treestore::pack::tests::an_empty_writer_leaves_no_file1266 PASS [ 0.024s] (1247/1760) iets treestore::tests::a_staged_directory_goes_when_it_is_dropped1267 PASS [ 0.060s] (1248/1760) iets treestore::pack::tests::a_reader_sees_a_pack_written_after_it_listed1268 PASS [ 0.048s] (1249/1760) iets treestore::pack::tests::a_set_finds_objects_across_packs_and_drops_a_broken_one1269 PASS [ 0.055s] (1250/1760) iets treestore::pack::tests::collect_removes_dead_packs_and_compacts_mostly_dead_ones1270 PASS [ 0.055s] (1251/1760) iets treestore::tests::a_flat_file_is_named_by_the_hash_of_its_bytes1271 PASS [ 0.052s] (1252/1760) iets treestore::tests::a_tree_is_named_by_its_nar_hash::case_31272 PASS [ 0.051s] (1253/1760) iets treestore::tests::a_tree_is_named_by_its_nar_hash::case_41273 PASS [ 0.088s] (1254/1760) iets treestore::tests::a_put_after_a_collection_brings_its_own_objects1274 PASS [ 0.066s] (1255/1760) iets treestore::tests::a_tree_is_named_by_its_nar_hash::case_11275 PASS [ 0.066s] (1256/1760) iets treestore::tests::a_tree_is_named_by_its_nar_hash::case_21276 PASS [ 0.019s] (1257/1760) iets::aterm_crosscheck bytes_that_are_not_utf8_roundtrip1277 PASS [ 0.020s] (1258/1760) iets::aterm_crosscheck fixed_output_inputs_hide_their_provenance1278 PASS [ 0.086s] (1259/1760) iets treestore::tests::a_stored_input_reads_back_and_a_wrong_hash_is_refused1279 PASS [ 0.030s] (1260/1760) iets::aterm_crosscheck harmonia_cases_roundtrip::case_3_escapes1280 PASS [ 0.045s] (1261/1760) iets::aterm_crosscheck fixed_output_path_is_recomputed_not_trusted1281 PASS [ 0.032s] (1262/1760) iets::aterm_crosscheck harmonia_cases_roundtrip::case_2_recursive_hash1282 PASS [ 0.046s] (1263/1760) iets::aterm_crosscheck floating_ca_defers_itself_and_downstream1283 PASS [ 0.043s] (1264/1760) iets::aterm_crosscheck harmonia_cases_roundtrip::case_1_plain1284 PASS [ 0.009s] (1265/1760) iets::aterm_crosscheck malformed_aterm_is_an_error1285 PASS [ 0.010s] (1266/1760) iets::aterm_crosscheck harmonia_cases_roundtrip::case_4_gnused1286 PASS [ 0.016s] (1267/1760) iets::aterm_crosscheck harmonia_cases_roundtrip::case_5_fixed_output1287 PASS [ 0.121s] (1268/1760) iets treestore::tests::collect_keeps_what_an_entry_names1288 PASS [ 0.087s] (1269/1760) iets treestore::tests::two_inputs_share_their_common_files1289 PASS [ 0.214s] (1270/1760) iets treestore::pack::tests::a_changed_index_byte_is_not_a_pack1290 PASS [ 0.028s] (1271/1760) iets::aterm_crosscheck upstream_bad_drvs_are_rejected1291 PASS [ 0.036s] (1272/1760) iets::aterm_crosscheck masked_and_unmasked_hashes_differ_once_filled1292 PASS [ 0.025s] (1273/1760) iets::aterm_crosscheck upstream_drvs_roundtrip_byte_exact1293 PASS [ 0.036s] (1274/1760) iets::aterm_crosscheck upstream_bench_drvs_parse_and_reprint_stably::case_1_hello1294 PASS [ 0.028s] (1275/1760) iets::aterm_crosscheck upstream_input_addressed_paths_recompute::case_1_defaults1295 PASS [ 0.009s] (1276/1760) iets::aterm_crosscheck upstream_invariants_fill_in_deferred::case_1_empty_env_var1296 PASS [ 0.036s] (1277/1760) iets::aterm_crosscheck upstream_bench_drvs_parse_and_reprint_stably::case_2_firefox1297 PASS [ 0.018s] (1278/1760) iets::aterm_crosscheck upstream_input_addressed_paths_recompute::case_2_structured_attrs_defaults1298 PASS [ 0.025s] (1279/1760) iets::cache_hygiene an_entry_that_is_not_a_plain_file_is_refused1299 PASS [ 0.277s] (1280/1760) iets trace::validate::tests::the_lowest_failing_observation_is_the_one_reported1300 PASS [ 0.050s] (1281/1760) iets::aterm_crosscheck upstream_invariants_input_addressed_kept_or_rejected1301 PASS [ 0.055s] (1282/1760) iets::aterm_crosscheck upstream_invariants_fill_in_deferred::case_2_no_env_var1302 PASS [ 0.015s] (1283/1760) iets::cache_hygiene input_touch_child1303 PASS [ 0.068s] (1284/1760) iets::aterm_crosscheck upstream_invariants_ca_floating_dependency1304 PASS [ 0.060s] (1285/1760) iets::cache_hygiene an_input_observation_marks_its_entry_as_used1305 PASS [ 0.068s] (1286/1760) iets::cache_hygiene a_changed_byte_or_a_copied_entry_is_a_miss1306 PASS [ 0.068s] (1287/1760) iets::cache_hygiene a_corrupt_entry_is_dropped_and_a_corrupt_store_is_wiped1307 PASS [ 0.049s] (1288/1760) iets::cache_hygiene unix_only::a_link_or_a_fifo_is_not_an_entry1308 PASS [ 0.046s] (1289/1760) iets::cache_hygiene unix_only::an_entry_that_does_not_open_is_a_miss_and_stays1309 PASS [ 0.061s] (1290/1760) iets::cache_hygiene unix_only::a_cache_is_private_to_its_owner1310 PASS [ 0.114s] (1291/1760) iets::cache_hygiene cache_gc_removes_entries_past_the_ttl1311 PASS [ 0.553s] (1292/1760) iets trace::tests::dedupe_of_many_repeats_is_linear1312 PASS [ 0.237s] (1293/1760) iets::cache_semantics a_lint_warning_is_replayed_on_a_hit1313 PASS [ 2.623s] (1294/1760) iets runtime::value::alloc_tests::a_full_string_table_records_no_more_but_still_shares1314 PASS [ 0.414s] (1295/1760) iets::cache_semantics a_copy_in_place_misses1315 PASS [ 0.465s] (1296/1760) iets::cache_semantics a_hit_prints_paths_and_positions_the_same1316 PASS [ 0.589s] (1297/1760) iets::cache_hygiene concurrent_readers_and_writers_never_see_a_torn_entry1317 PASS [ 0.418s] (1298/1760) iets::cache_semantics the_cache_dir_keeps_what_it_did_not_make1318 PASS [ 4.836s] (1299/1760) iets api::run::tests::helper_fibers_read_the_ir_cache1319 PASS [ 0.682s] (1300/1760) iets::cache_semantics a_pure_run_never_reads_an_impure_entry1320 PASS [ 0.579s] (1301/1760) iets::cache_semantics the_file_argument_keeps_one_entry1321 PASS [ 0.864s] (1302/1760) iets::cache_semantics search_uses_the_cache1322 PASS [ 1.098s] (1303/1760) iets::cache_semantics a_flake_keeps_one_entry1323 PASS [ 0.801s] (1304/1760) iets::cache_semantics uncacheable_runs_write_nothing1324 PASS [ 0.798s] (1305/1760) iets::classic_build dry_run_and_json_log_path1325 PASS [ 0.474s] (1306/1760) iets::classic_eval eval_jobs_summary1326 PASS [ 1.653s] (1307/1760) iets::cache_semantics flags_that_turn_the_cache_off1327 PASS [ 1.147s] (1308/1760) iets::classic_build the_builder_setting1328 PASS [ 1.593s] (1309/1760) iets::classic_build activity_records1329 PASS [ 4.952s] (1310/1760) iets lint::fixtures::every_lint_fires_on_its_fixture_only_when_asked1330 PASS [ 1.844s] (1311/1760) iets::classic_build the_roots_a_build_keeps1331 PASS [ 1.326s] (1312/1760) iets::classic_eval internal_json_errors1332 PASS [ 2.239s] (1313/1760) iets::classic_eval ignored_flags_and_settings1333 PASS [ 3.540s] (1314/1760) iets::cache_semantics hits_and_misses1334 PASS [ 6.279s] (1315/1760) iets runtime::value::tests::union_iteration_merges_like_a_fold1335 PASS [ 3.467s] (1316/1760) iets::classic_build failures1336 PASS [ 1.836s] (1317/1760) iets::classic_eval nix_search1337 PASS [ 2.992s] (1318/1760) iets::classic_eval auto_call_a_function_file1338 PASS [ 0.308s] (1319/1760) iets::classic_fallback a_full_stdout1339 PASS [ 3.658s] (1320/1760) iets::classic_build out_links_and_roots1340 PASS [ 0.733s] (1321/1760) iets::classic_eval the_builtins_names1341 PASS [ 2.916s] (1322/1760) iets::classic_eval nix_eval_of_a_flake1342 PASS [ 9.114s] (1323/1760) iets api::concurrent_eval::concurrent_eval_sums_arena_use_over_workers1343 PASS [ 0.012s] (1324/1760) iets::cli a_bad_command_line_names_the_problem::case_01_unknown1344 PASS [ 0.029s] (1325/1760) iets::cli a_bad_command_line_names_the_problem::case_02_typo1345 PASS [ 0.017s] (1326/1760) iets::cli a_bad_command_line_names_the_problem::case_03_typo_with_args1346 PASS [ 0.034s] (1327/1760) iets::cli a_bad_command_line_names_the_problem::case_04_classic_typo1347 PASS [ 0.030s] (1328/1760) iets::cli a_bad_command_line_names_the_problem::case_05_flag_typo1348 PASS [ 0.036s] (1329/1760) iets::cli a_bad_command_line_names_the_problem::case_06_zero_workers1349 PASS [ 0.036s] (1330/1760) iets::cli a_bad_command_line_names_the_problem::case_07_no_expr1350 PASS [ 0.035s] (1331/1760) iets::cli a_bad_command_line_names_the_problem::case_08_expr_and_file1351 PASS [ 0.026s] (1332/1760) iets::cli a_bad_command_line_names_the_problem::case_09_build_nothing1352 PASS [ 1.136s] (1333/1760) iets::classic_fallback fallbacks1353 PASS [ 0.033s] (1334/1760) iets::cli a_bad_command_line_names_the_problem::case_10_build_flag1354 PASS [ 0.900s] (1335/1760) iets::classic_shell nix_fmt1355 PASS [ 0.046s] (1336/1760) iets::cli a_bad_command_line_names_the_problem::case_11_subcommand_typo1356 PASS [ 0.060s] (1337/1760) iets::cli a_bad_config_stops_only_what_reads_a_setting1357 PASS [ 0.034s] (1338/1760) iets::cli a_full_stdout_is_an_error::case_1_version1358 PASS [ 0.026s] (1339/1760) iets::cli a_full_stdout_is_an_error::case_2_parse1359 PASS [ 0.047s] (1340/1760) iets::cli a_full_stdout_is_an_error::case_3_help1360 PASS [ 0.031s] (1341/1760) iets::cli a_full_stdout_is_an_error::case_4_lint_list1361 PASS [ 0.199s] (1342/1760) iets::cli a_flake_fragment_completes_to_the_outputs_attribute_names1362 PASS [ 0.055s] (1343/1760) iets::cli an_unsupported_construct_has_its_own_exit_code::case_1_unsupported1363 PASS [ 0.064s] (1344/1760) iets::cli an_unsupported_construct_has_its_own_exit_code::case_2_other1364 PASS [ 1.214s] (1345/1760) iets::classic_shell nix_develop1365 PASS [ 0.058s] (1346/1760) iets::cli build_evaluates_every_installable1366 PASS [ 0.112s] (1347/1760) iets::cli build_cache_ignores_installable_order1367 PASS [ 0.166s] (1348/1760) iets::cli budget::a_completion_that_evaluates_stops_at_its_budget1368 PASS [ 0.055s] (1349/1760) iets::cli current_system_is_the_hosts1369 PASS [ 0.429s] (1350/1760) iets::cli a_flake_fragment_selects_as_nix_does1370 PASS [ 1.581s] (1351/1760) iets::classic_fallback fetchers1371 PASS [ 0.057s] (1352/1760) iets::cli eval_json_forces_without_strict1372 PASS [ 0.151s] (1353/1760) iets::cli completion_asks_the_binary_and_ignores_settings1373 PASS [ 0.044s] (1354/1760) iets::cli eval_says_what_it_does_not_support1374 FAIL [ 0.072s] (1355/1760) iets::cli eval_prints_every_attr1375 stdout ---13761377 running 1 test1378 test eval_prints_every_attr ... FAILED13791380 failures:13811382 failures:1383 eval_prints_every_attr13841385 test result: FAILED. 0 passed; 1 failed; 0 ignored; 0 measured; 33 filtered out; finished in 0.06s1386 1387 stderr ---13881389 thread 'eval_prints_every_attr' (13008) panicked at tests/cli.rs:484:5:1390 assertion `left == right` failed1391 left: []1392 right: [49, 10]1393 note: run with `RUST_BACKTRACE=1` environment variable to display a backtrace13941395 Cancelling due to test failure: 15 tests still running1396 PASS [ 0.161s] (1356/1760) iets::cli dash_a_completes_the_attribute_names_under_its_root1397 PASS [ 0.057s] (1357/1760) iets::cli eval_says_which_flake_refs_it_does_not_support::case_1_registry1398 PASS [ 0.048s] (1358/1760) iets::cli eval_says_which_flake_refs_it_does_not_support::case_2_github1399 PASS [ 2.332s] (1359/1760) iets::classic_eval symlinks_below_a_copied_path1400 PASS [ 0.272s] (1360/1760) iets::cli dash_f_names_the_file_in_the_native_namespace1401 PASS [ 1.624s] (1361/1760) iets::classic_shell nix_shell1402 PASS [ 1.304s] (1362/1760) iets::classic_shell nix_shell_roots1403 PASS [ 4.238s] (1363/1760) iets::classic_eval pure_eval_and_nix_conf1404 PASS [ 6.794s] (1364/1760) iets::classic_cache the_tracing_cache1405 PASS [ 3.732s] (1365/1760) iets::classic_fallback fetch_git1406 PASS [ 6.622s] (1366/1760) iets::classic_eval nix_derivation_show1407 PASS [ 9.038s] (1367/1760) iets::classic_build settings_reach_the_daemon1408 PASS [ 11.852s] (1368/1760) iets::classic_eval nix_instantiate1409 PASS [ 19.796s] (1369/1760) iets syntax::tests::deep_nesting_ends_with_an_error1410 SLOW [> 60.000s] (---------) iets::classic_eval nix_search_nixpkgs1411 PASS [ 106.387s] (1370/1760) iets::classic_eval nix_search_nixpkgs1412------------1413 Summary [ 160.530s] 1370/1760 tests run: 1369 passed (1 slow), 1 failed, 6 skipped1414 FAIL [ 0.072s] (1355/1760) iets::cli eval_prints_every_attr1415warning: 390/1760 tests were not run due to test failure (run with --no-fail-fast to run all tests, or run with --max-fail)1416error: test run failed