iets-test-0.1.0
checks.x86_64-linux.test
· build #6
· raw
unpackPhase
1unpacking source archive /nix/store/pr68m9cimi230yjkhgxfwjmnadnbn99p-source2source root is source3Executing cargoSetupPostUnpackHook4Finished cargoSetupPostUnpackHookpatchPhase
5Executing cargoSetupPostPatchHook6Validating consistency between /build/source/Cargo.lock and /build/cargo-vendor-dir/Cargo.lock7Finished cargoSetupPostPatchHookbuildPhase
8Executing cargoBuildHook9cargoBuildHook flags: -j 48 --target x86_64-unknown-linux-gnu --offline --profile release10 Compiling libc v0.2.18911 Compiling proc-macro2 v1.0.10712 Compiling quote v1.0.4713 Compiling unicode-ident v1.0.2414 Compiling find-msvc-tools v0.1.1215 Compiling shlex v2.0.116 Compiling cfg-if v1.0.417 Compiling version_check v0.9.518 Compiling regex-syntax v0.8.1119 Compiling bytes v1.12.120 Compiling anyhow v1.0.10421 Compiling pin-project-lite v0.2.1722 Compiling memchr v2.8.323 Compiling either v1.18.024 Compiling typenum v1.20.125 Compiling futures-core v0.3.3426 Compiling once_cell v1.21.427 Compiling fnv v1.0.728 Compiling semver v1.0.2829 Compiling itoa v1.0.1830 Compiling zeroize v1.9.031 Compiling hashbrown v0.17.132 Compiling equivalent v1.0.233 Compiling slab v0.4.1234 Compiling bitflags v2.13.235 Compiling futures-sink v0.3.3436 Compiling lazy_static v1.5.037 Compiling getrandom v0.4.338 Compiling beef v0.5.239 Compiling httparse v1.10.140 Compiling rustix v1.1.541 Compiling prettyplease v0.2.3742 Compiling pulldown-cmark v0.13.443 Compiling unicase v2.9.044 Compiling thiserror v2.0.2045 Compiling linux-raw-sys v0.12.146 Compiling serde_core v1.0.22947 Compiling atomic-waker v1.1.248 Compiling pkg-config v0.3.3449 Compiling futures-task v0.3.3450 Compiling foldhash v0.1.551 Compiling untrusted v0.9.052 Compiling try-lock v0.2.553 Compiling unicode-width v0.1.1454 Compiling fastrand v2.5.055 Compiling futures-channel v0.3.3456 Compiling httpdate v1.0.357 Compiling rustls v0.23.4558 Compiling tower-service v0.3.359 Compiling fixedbitset v0.5.760 Compiling smallvec v1.16.161 Compiling subtle v2.6.162 Compiling heck v0.5.063 Compiling log v0.4.3464 Compiling hashbrown v0.15.565 Compiling want v0.3.166 Compiling multimap v0.10.167 Compiling cpufeatures v0.3.168 Compiling const-oid v0.10.269 Compiling tracing-core v0.1.3670 Compiling cpufeatures v0.2.1771 Compiling zstd-safe v7.3.072 Compiling crc32fast v1.5.273 Compiling tower-layer v0.3.374 Compiling sync_wrapper v1.0.275 Compiling zmij v1.0.2376 Compiling winnow v1.0.477 Compiling base64 v0.22.178 Compiling percent-encoding v2.3.279 Compiling cty v0.2.280 Compiling serde_json v1.0.15181 Compiling adler2 v2.0.182 Compiling itertools v0.14.083 Compiling simd-adler32 v0.3.1084 Compiling rustc_version v0.4.185 Compiling openssl-probe v0.2.186 Compiling constant_time_eq v0.4.287 Compiling futures-util v0.3.3488 Compiling libbz2-rs-sys v0.2.589 Compiling toml_parser v1.1.3+spec-1.1.090 Compiling toml_writer v1.1.2+spec-1.1.091 Compiling arrayvec v0.7.892 Compiling lz4_flex v0.11.693 Compiling rustls-pki-types v1.15.194 Compiling miniz_oxide v0.9.195 Compiling indexmap v2.14.296 Compiling generic-array v0.14.797 Compiling rustls-native-certs v0.8.498 Compiling webpki-roots v1.0.999 Compiling bzip2 v0.6.1100 Compiling aho-corasick v1.1.5101 Compiling logos-codegen v0.15.1102 Compiling flate2 v1.1.10103 Compiling http v1.5.0104 Compiling syn v2.0.119105 Compiling syn v3.0.5106 Compiling socket2 v0.6.5107 Compiling mio v1.2.3108 Compiling getrandom v0.2.17109 Compiling filetime v0.2.29110 Compiling regex-automata v0.4.18111 Compiling tar v0.4.46112 Compiling crypto-common v0.1.7113 Compiling block-buffer v0.10.4114 Compiling pulldown-cmark-to-cmark v22.0.1115 Compiling digest v0.10.7116 Compiling jobserver v0.1.35117 Compiling hybrid-array v0.4.15118 Compiling sha2 v0.10.9119 Compiling petgraph v0.8.3120 Compiling cc v1.4.5121 Compiling http-body v1.1.0122 Compiling http-body-util v0.1.5123 Compiling serde_spanned v1.1.1124 Compiling toml_datetime v1.1.1+spec-1.1.0125 Compiling block-buffer v0.12.1126 Compiling crypto-common v0.2.2127 Compiling toml v1.1.6+spec-1.1.0128 Compiling sha1 v0.10.7129 Compiling md-5 v0.10.6130 Compiling digest v0.11.3131 Compiling sha2 v0.11.0132 Compiling tempfile v3.27.0133 Compiling lzma-rust2 v0.16.5134 Compiling ring v0.17.14135 Compiling zstd-sys v2.1.0+zstd.1.5.7136 Compiling libmimalloc-sys v0.1.49137 Compiling blake3 v1.8.7138 Compiling tokio-macros v2.7.2139 Compiling thiserror-impl v2.0.20140 Compiling async-trait v0.1.92141 Compiling regex v1.13.1142 Compiling tokio v1.53.1143 Compiling logos-codegen v0.16.1144 Compiling tonic-build v0.14.6145 Compiling prost-derive v0.14.4146 Compiling tracing-attributes v0.1.31147 Compiling miette-derive v7.6.0148 Compiling pin-project-internal v1.1.13149 Compiling logos-derive v0.15.1150 Compiling logos-derive v0.16.1151 Compiling miette v7.6.0152 Compiling pin-project v1.1.13153 Compiling tracing v0.1.44154 Compiling logos v0.15.1155 Compiling logos v0.16.1156 Compiling prost v0.14.4157 Compiling prost-types v0.14.4158 Compiling tokio-util v0.7.19159 Compiling tokio-stream v0.1.19160 Compiling mimalloc v0.1.52161 Compiling protox-parse v0.9.0162 Compiling prost-reflect v0.16.5163 Compiling prost-build v0.14.4164 Compiling h2 v0.4.19165 Compiling tower v0.5.3166 Compiling tonic-prost-build v0.14.6167 Compiling rustls-webpki v0.103.15168 Compiling protox v0.9.1169 Compiling iets v0.1.0 (/build/source)170 Compiling hyper v1.11.1171 Compiling hyper-util v0.1.20172 Compiling tokio-rustls v0.26.5173 Compiling hyper-timeout v0.5.2174 Compiling tonic v0.14.6175 Compiling zstd v0.13.3176 Compiling tonic-prost v0.14.6177 Finished `release` profile [optimized + debuginfo] target(s) in 4m 13s178Executing cargoInstallPostBuildHook179Finished cargoInstallPostBuildHook180Finished cargoBuildHook181buildPhase completed in 4 minutes 14 secondscheckPhase
182Executing cargoCheckHook183cargoCheckHook flags: -j 48 --profile release --target x86_64-unknown-linux-gnu --offline --184 Compiling cfg-if v1.0.4185 Compiling bytes v1.12.1186 Compiling pin-project-lite v0.2.17187 Compiling typenum v1.20.1188 Compiling futures-core v0.3.34189 Compiling once_cell v1.21.4190 Compiling itoa v1.0.18191 Compiling hashbrown v0.17.1192 Compiling zeroize v1.9.0193 Compiling slab v0.4.12194 Compiling futures-sink v0.3.34195 Compiling equivalent v1.0.2196 Compiling libc v0.2.189197 Compiling fnv v1.0.7198 Compiling untrusted v0.9.0199 Compiling atomic-waker v1.1.2200 Compiling futures-task v0.3.34201 Compiling try-lock v0.2.5202 Compiling httparse v1.10.1203 Compiling httpdate v1.0.3204 Compiling smallvec v1.16.1205 Compiling tower-service v0.3.3206 Compiling serde_core v1.0.229207 Compiling subtle v2.6.1208 Compiling log v0.4.34209 Compiling cpufeatures v0.3.1210 Compiling tower-layer v0.3.3211 Compiling const-oid v0.10.2212 Compiling sync_wrapper v1.0.2213 Compiling adler2 v2.0.1214 Compiling winnow v1.0.4215 Compiling cty v0.2.2216 Compiling base64 v0.22.1217 Compiling simd-adler32 v0.3.10218 Compiling percent-encoding v2.3.2219 Compiling cpufeatures v0.2.17220 Compiling crc32fast v1.5.2221 Compiling zmij v1.0.23222 Compiling constant_time_eq v0.4.2223 Compiling openssl-probe v0.2.1224 Compiling pin-project v1.1.13225 Compiling zstd-sys v2.1.0+zstd.1.5.7226 Compiling memchr v2.8.3227 Compiling libbz2-rs-sys v0.2.5228 Compiling arrayvec v0.7.8229 Compiling toml_writer v1.1.2+spec-1.1.0230 Compiling lz4_flex v0.11.6231 Compiling want v0.3.1232 Compiling libmimalloc-sys v0.1.49233 Compiling futures-channel v0.3.34234 Compiling mimalloc v0.1.52235 Compiling zstd-safe v7.3.0236 Compiling rustls-pki-types v1.15.1237 Compiling futures-util v0.3.34238 Compiling miniz_oxide v0.9.1239 Compiling tracing-core v0.1.36240 Compiling zstd v0.13.3241 Compiling blake3 v1.8.7242 Compiling toml_parser v1.1.3+spec-1.1.0243 Compiling tracing v0.1.44244 Compiling rustls-native-certs v0.8.4245 Compiling webpki-roots v1.0.9246 Compiling bzip2 v0.6.1247 Compiling flate2 v1.1.10248 Compiling http v1.5.0249 Compiling prost v0.14.4250 Compiling indexmap v2.14.2251 Compiling generic-array v0.14.7252 Compiling hybrid-array v0.4.15253 Compiling mio v1.2.3254 Compiling socket2 v0.6.5255 Compiling getrandom v0.2.17256 Compiling filetime v0.2.29257 Compiling ring v0.17.14258 Compiling tar v0.4.46259 Compiling block-buffer v0.10.4260 Compiling crypto-common v0.1.7261 Compiling tokio v1.53.1262 Compiling http-body v1.1.0263 Compiling crypto-common v0.2.2264 Compiling block-buffer v0.12.1265 Compiling digest v0.10.7266 Compiling http-body-util v0.1.5267 Compiling sha1 v0.10.7268 Compiling md-5 v0.10.6269 Compiling sha2 v0.10.9270 Compiling toml_datetime v1.1.1+spec-1.1.0271 Compiling serde_spanned v1.1.1272 Compiling serde_json v1.0.151273 Compiling digest v0.11.3274 Compiling toml v1.1.6+spec-1.1.0275 Compiling sha2 v0.11.0276 Compiling rustls-webpki v0.103.15277 Compiling lzma-rust2 v0.16.5278 Compiling rustls v0.23.45279 Compiling tokio-util v0.7.19280 Compiling tokio-stream v0.1.19281 Compiling h2 v0.4.19282 Compiling tower v0.5.3283 Compiling tokio-rustls v0.26.5284 Compiling hyper v1.11.1285 Compiling hyper-util v0.1.20286 Compiling hyper-timeout v0.5.2287 Compiling tonic v0.14.6288 Compiling tonic-prost v0.14.6289 Compiling iets v0.1.0 (/build/source)290 Finished `release` profile [optimized + debuginfo] target(s) in 3m 29s291 Running unittests src/lib.rs (target/x86_64-unknown-linux-gnu/release/deps/iets-7621b6296c916421)292293running 453 tests294test api::installable::tests::the_name_a_program_takes_from_a_derivation_name ... ok295test api::installable::tests::default_and_fragment_attr_paths ... ok296test api::drvshow::tests::pretty_matches_serde_json ... ok297test api::drvshow::tests::a_fixed_output_shows_its_content_address_and_no_path ... ok298test api::drvshow::tests::inputs_and_structured_attrs ... ok299test api::drvshow::tests::a_multi_output_derivation ... ok300test api::drvshow::tests::floats_take_nlohmanns_form ... ok301test api::drvshow::tests::a_non_canonical_structured_attrs_text_is_renormalised ... ok302test api::fetch::tests::the_fake_hash_moves_the_output_and_the_drv ... ok303test api::fetch::tests::only_a_fixed_output_drv_can_be_prefetched ... ok304test build::backend::tests::base_names_drop_the_store_dir ... ok305test argv::tests::every_byte_round_trips ... ok306test build::backend::tests::output_specs ... ok307test build::event::tests::durations ... ok308test build::executor::tests::a_declared_system_filters ... ok309test build::executor::tests::a_feature_the_place_lacks_rules_it_out ... ok310test build::backend::tests::the_timings_report_with_every_line ... ok311test api::value::tests::attrs_by_name_and_index ... ok312test api::value::tests::lists ... ok313test build::executor::tests::a_refusal_names_every_place_and_what_it_declared ... ok314test api::value::tests::wrong_type_is_an_error ... ok315test api::value::tests::apply_is_lazy ... ok316test api::value::tests::thunk_reads_as_thunk ... ok317test api::value::tests::construction ... ok318test api::value::tests::force_deep_forces_the_whole_tree ... ok319test build::executor::tests::an_unsupported_url_says_what_is_expected ... ok320test build::executor::tests::no_place_at_all_is_a_usage_error ... ok321test build::executor::tests::one_place_declaring_nothing_takes_everything ... ok322test api::value::tests::missing_attribute ... ok323test api::value::tests::calling_a_function ... ok324test build::executor::tests::the_first_place_that_takes_it_wins ... ok325test api::value::tests::strings_and_context ... ok326test api::run::tests::a_fiber_template_carries_the_configuration ... ok327test build::fixhash::tests::a_longer_hash_is_not_a_match ... ok328test build::fixhash::tests::two_matches_are_left_alone ... ok329test build::fanout::tests::at_most_limit_builds_run_at_once ... ok330test build::fanout::tests::a_failed_dependency_blocks_its_dependants ... ok331test build::fanout::tests::dependencies_run_first ... ok332test build::fixhash::tests::one_match_is_rewritten_in_its_own_spelling ... ok333test build::render::tests::drv_paths_of_a_failure_message ... ok334test build::render::tests::a_failure_after_the_activity_ended_never_claims_a_success ... ok335test build::render::tests::a_build_log_never_reports_a_mismatch ... ok336test build::render::tests::ci_folds_a_success_and_never_a_failure ... ok337test build::render::tests::an_unfolded_success_ends_with_its_verdict ... ok338test build::render::tests::a_daemon_failure_message_decides_the_verdict ... ok339test build::render::tests::a_stalled_build_that_fails_still_shows_its_cause ... ok340test build::render::tests::an_owned_build_is_verdicted_once_by_its_op ... ok341test build::render::tests::logs_of_two_builds_do_not_interleave ... ok342test build::render::tests::tty_keeps_successful_logs_off_the_screen ... ok343test builtins::text::regex::tests::regex_bench ... ignored344test build::tests::targets_become_jobs ... ok345test builtins::derivation::tests::the_two_placeholders_are_not_the_same ... ok346test builtins::text::fromtoml::tests::new_escapes_are_refused ... ok347test builtins::derivation::tests::a_dynamic_output_renders_the_placeholder_nix_renders ... ok348test build::render::tests::heartbeat_names_running_builds ... ok349test builtins::text::fromtoml::tests::inline_tables_stay_on_one_line ... ok350test builtins::text::regex::tests::names ... ok351test builtins::store_hooks::tests::a_relative_path_inside_an_entry_joins_once ... ok352test cachefs::tests::a_stamp_in_the_future_is_due ... ok353test build::tests::hash_stripping ... ok354test cli::plumbing::tests::a_url_is_the_positional_fetch_takes_itself ... ok355test cachefs::tests::a_directory_that_is_not_ours_is_refused_untouched ... ok356test cachefs::tests::a_touch_inside_the_interval_writes_nothing ... ok357test cachefs::tests::an_empty_directory_is_ours_to_take ... ok358test cachefs::tests::a_store_without_a_version_file_is_wiped_once ... ok359test cachefs::tests::an_input_store_of_the_spool_layout_is_wiped ... ok360test cachefs::tests::a_lock_that_cannot_be_opened_is_not_a_busy_lock ... ok361test cli::render::tests::sizes_render_as_nix_renders_them ... ok362test cli::build::tests::a_path_on_stdout_is_silent ... ok363test cli::search::tests::merged_highlights ... ok364test cli::build::tests::no_build_result_is_named ... ok365test cli::build::tests::a_success_with_no_output_path_is_named ... ok366test cli::build::tests::an_out_flag_that_matches_nothing_is_named ... ok367test cli::build::tests::a_failed_build_reports_itself ... ok368test cli::classic::shell::tests::sh_var_names ... ok369test cli::diff::tests::a_name_ends_at_the_first_dash_before_a_digit ... ok370test cachefs::tests::sweep_ages_a_root_by_its_link_not_by_what_it_names ... ok371test cli::classic::shell::tests::outputs_become_placeholders ... ok372test cli::plumbing::tests::a_file_url_needs_one_slash_not_three ... ok373test cachefs::tests::sweep_walks_the_shards_of_the_ir_cache ... ok374test cachefs::tests::a_wipe_keeps_what_iets_did_not_create ... ok375test cli::build::tests::no_outcome_at_all_is_named ... ok376test cachefs::tests::a_wipe_of_the_ir_cache_walks_its_shards ... ok377test api::value::tests::scalars ... ok378test cachefs::tests::a_sweep_runs_once_per_interval ... ok379test cachefs::tests::sweep_drops_old_entries_and_keeps_young_ones ... ok380test cachefs::tests::the_writer_lock_excludes_one_holder_at_a_time ... ok381test cli::search::tests::drv_names ... ok382test cli::help::tests::messages ... ok383test cli::search::tests::index_round_trip ... ok384test cli::render::text::tests::a_long_value_shows_the_lines_that_differ ... ok385test cli::help::tests::help_fits_80_columns ... ok386test cachefs::tests::garbled_stamp_wipes_the_store ... ok387test config::tests::bad_typed_values_error_where_they_are_set ... ok388test config::tests::bool_spellings ... ok389test config::tests::max_jobs_auto_is_the_cpu_count ... ok390test config::tests::missing_include_errors_and_bang_include_does_not ... ok391test cli::classic::tests::a_flag_with_no_effect_is_noted_and_one_that_holds_is_not ... ok392test cli::classic::shell::tests::declares_for_every_bash_shaped_value ... ok393test config::tests::an_alias_is_its_setting ... ok394test builtins::store_hooks::tests::virtual_tree_reads_go_to_the_local_files ... ok395test config::tests::a_classic_name_leaves_an_unimplemented_setting_to_nix ... ok396test cli::help::tests::a_mistyped_command_is_suggested ... ok397test config::tests::a_setting_with_no_effect_is_noted ... ok398test config::tests::basic_syntax ... ok399test config::tests::overrides_win_over_files ... ok400test cli::help::tests::suggestions_come_from_the_help ... ok401test build::tests::a_target_with_no_verdict_fails ... ok402test config::tests::user_conf_files_are_in_precedence_order ... ok403test config::tests::include_chain ... ok404test config::tests::unknown_settings_are_kept ... ok405test devenv::tests::env_derivation_matches_nix ... ignored, needs the devShell input .drv closure in /nix/store406test config::tests::typed_getters_and_defaults ... ok407test cachefs::tests::version_mismatch_wipes_the_store ... ok408test config::tests::syntax_errors ... ok409test config::tests::option_nix_path_replaces_nix_path_and_extra_adds ... ok410test cli::docs::tests::topics_resolve_bare_and_qualified ... ok411test config::tests::extra_appends_to_list_settings_only ... ok412test builtins::text::regex::tests::size_limit ... ok413test build::tests::a_fan_out_backend_keeps_the_cap_and_the_log_blocks ... ok414test devenv::tests::non_bash_builder_is_refused ... ok415test devenv::tests::shell_escaping ... ok416test config::tests::the_setting_tables_name_nix_settings ... ok417test fetch::http::tests::magic_bytes ... ok418test fetch::http::tests::file_urls_name_a_local_path ... ok419test cachefs::tests::a_wait_lock_waits_for_its_holder ... ok420test config::tests::the_daemon_gets_the_store_settings_set_outside_the_system_file ... ok421test devenv::tests::rewrites_apply_in_map_order_to_every_occurrence ... ok422test devenv::tests::cached_result_roundtrip ... ok423test fetch::http::tests::redirects_resolve ... ok424test devenv::tests::output_checks_are_erased_only_when_present ... ok425test cli::docs::tests::every_embedded_page_has_a_heading ... ok426test fetch::http::tests::urls_split ... ok427test devenv::tests::get_env_sh_store_path_matches_nix ... ok428test cli::docs::tests::the_topic_list_fits_80_columns ... ok429test fetch::http::tests::redirects_keep_credentials_only_on_the_same_origin ... ok430test compile::cache::tests::a_changed_byte_of_a_stored_entry_is_a_miss ... ok431test fetch::roots::tests::an_empty_nix_ssl_cert_file_hides_ssl_cert_file ... ok432test fetch::roots::tests::nix_ssl_cert_file_wins_over_ssl_cert_file_and_the_platform ... ok433test fetch::roots::tests::no_bundle_anywhere_gives_the_compiled_in_set ... ok434test devenv::tests::json_roundtrip_and_bash_forms ... ok435test devenv::tests::rc_script_rewrites_outputs_and_writes_attrs ... ok436test fetch::roots::tests::a_named_file_that_is_missing_or_empty_is_an_error ... ok437test compile::cache::tests::a_malformed_entry_is_a_miss_and_never_a_crash ... ok438test fetch::roots::tests::the_platform_store_wins_over_the_compiled_in_set ... ok439test compile::cache::tests::nesting_past_the_cap_misses ... ok440test fetch::spool::tests::the_scratch_file_never_follows_a_symlink ... ok441test fetch::http::tests::trailing_bytes_and_a_second_layer ... ok442test fetch::unpack::tests::member_names_are_made_relative_and_cannot_escape ... ok443test fetch::spool::tests::a_sparse_member_counts_against_the_size_limit ... ok444test fetch::http::tests::downloads_stop_at_the_size_limit ... ok445test fetch::unpack::tests::an_unsupported_member_type_is_an_error ... ok446test fetch::spool::tests::an_empty_archive_is_an_empty_directory ... ok447test fetch::spool::tests::the_errors_match ... ok448test fetch::unpack::tests::nar_hash_of_the_fixture ... ok449test fetch::spool::tests::spool_matches_the_tree_on_the_top_level ... ok450test fetch::spool::tests::nar_hash_of_the_fixture ... ok451test fetch::unpack::tests::a_repeated_member_keeps_the_last_copy ... ok452test fetch::unpack::tests::strips_one_leading_component ... ok453test fetch::spool::tests::a_hard_link_never_replaces_a_member ... ok454test eval::tests::a_second_pseudo_file_keeps_its_own_positions ... ok455test fetch::spool::tests::a_stored_tree_dumps_the_spools_nar ... ok456test fetch::spool::tests::a_changed_index_byte_is_a_miss ... ok457test eval::tests::an_invalid_regex_fails_before_the_string_is_forced ... ok458test fetch::unpack::tests::keeps_the_root_when_it_is_not_a_single_directory ... ok459test fetch::spool::tests::spool_matches_the_tree ... ok460test eval::tests::derivation_wrapper_exists ... ok461test flake::fetch::tests::nix_sees_no_mark ... ok462test flake::fetch::tests::the_mark_follows_the_string_like_store_context ... ok463test fetch::unpack::tests::modes_symlinks_and_empty_dirs ... ok464test eval::tests::update_forces_the_right_operand_first ... ok465test fetch::spool::tests::archives_the_git_sink_accepts ... ok466test flake::fetch::tests::an_entry_of_the_compiled_file_cache_keeps_the_site ... ok467test flake::tests::attr_paths ... ok468test jobs::constituents::tests::fnmatch_basics ... ok469test jobs::line::tests::error_line_round_trip ... ok470test lint::allow::tests::comment_names ... ok471test lint::allow::tests::lines ... ok472test builtins::text::regex::tests::long_inputs_do_not_recurse ... ok473test fetch::spool::tests::pax_sparse_members_are_expanded ... ok474test jobs::constituents::tests::topo_sort_orders_and_detects_cycles ... ok475test jobs::line::tests::split_and_round_trip ... ok476test flake::tests::refs_resolve_against_cwd_and_home ... ok477test flake::flakeref::tests::errors_and_unsupported ... ok478test flake::flakeref::tests::to_string_from_attrs ... ok479test flake::flakeref::tests::round_trips ... ok480test lint::tests::the_project_file_walk_stops_at_the_project_root ... ok481test log::tests::a_session_id_is_a_uuid_v7 ... ok482test log::tests::a_forged_mismatch_is_dropped ... ok483test lint::tests::names_are_unique_kebab_case ... ok484test lint::tests::keys ... ok485test lint::tests::selectors_and_order ... ok486test log::tests::a_fixed_hash_has_the_shape_of_a_finding_with_an_edit ... ok487test log::tests::a_coloured_error_is_an_error_record ... ok488test log::tests::a_resolved_copy_reports_its_mismatch_as_a_line ... ok489test log::tests::a_mismatch_reason_keeps_both_hashes ... ok490test lint::tests::scope_and_inputs ... ok491test eval::tests::arithmetic_and_strings ... ok492test eval::tests::nix_eq_forces_what_the_shortcut_skips ... ok493test lint::site::tests::a_literal_lint_of_nix_has_an_edit ... ok494test log::tests::record_without_position ... ok495test lint::site::tests::the_span_is_the_innermost_node_of_the_kind_of_the_lint ... ok496test log::tests::activity_records_are_nix_json_logger_records ... ok497test log::tests::a_hash_mismatch_names_the_hash_it_got ... ok498test compile::cache::tests::a_changed_byte_never_makes_the_evaluator_read_past_its_env ... ok499test log::tests::ansi_stripping ... ok500test log::tests::exit_status_flags_combine_like_nix ... ok501test log::tests::escapes_are_filtered_the_way_nix_filters_them ... ok502test log::tests::lint_warning_is_a_level_1_record ... ok503test log::tests::record_is_nix_log_ei_plus_code_and_hint ... ok504test flake::flakeref::tests::parses_the_kept_schemes ... ok505test parallel::deque::tests::lifo_owner_fifo_thief ... ok506test lint::tests::an_unknown_name_is_a_warning_in_a_file_and_an_error_in_a_flag ... ok507test lint::tests::specificity_inside_a_source_and_order_between_sources ... ok508test lint::tests::toml_table ... ok509test eval::tests::equality ... ok510test parallel::sched::tests::a_task_survives_packing_past_the_old_24_bit_start ... ok511test jobs::tests::a_numeric_name_selects_an_attribute_under_a_set ... ok512test nixbin::tests::farm_marker_is_found_through_two_hops ... ok513test nixbin::tests::every_iets_build_is_skipped ... ok514test eval::tests::laziness_and_recursion ... ok515test parallel::interner::tests::empty_name_misses_the_cache_sentinel ... ok516test profile::tests::an_unwind_returns_to_a_depth ... ok517test progress::tests::several_of_a_kind_are_counted ... ok518test parallel::interner::tests::intern_is_stable_and_shared ... ok519test parallel::fiber::tests::resume_yield_finish ... ok520test print::tests::float_formatting_edge_cases ... ok521test progress::tests::a_download_inside_a_copy_is_part_of_the_copy ... ok522test parallel::fiber::tests::reservation_is_capped_and_mmap_failure_is_an_error ... ok523test profile::tests::a_frame_keeps_its_call_site_and_its_name ... ok524test profile::tests::a_sample_is_taken_once_per_tick ... ok525test profile::tests::a_weight_is_bytes_when_the_profile_asks_for_them ... ok526test project::tests::each_marker_is_a_root ... ok527test eval::tests::try_eval_and_errors ... ok528test progress::tests::a_log_hears_of_a_task_after_first_and_then_every_heartbeat ... ok529test project::tests::a_config_file_never_shrinks_the_root ... ok530test project::tests::a_working_tree_wins_over_a_file_marker_below_it ... ok531test fetch::http::tests::a_stalled_download_fails ... ok532test provenance::tests::a_tree_copied_from_a_store_tree_resolves_to_the_local_one ... ok533test provenance::tests::rewrite_replaces_every_known_path_in_a_line ... ok534test provenance::tests::rewrite_leaves_unknown_text_alone ... ok535test parallel::fiber::tests::migrates_between_threads ... ok536test project::tests::the_nearest_flake_wins_without_a_working_tree ... ok537test progress::tests::store_hashes_are_left_out ... ok538test provenance::tests::a_path_followed_by_a_colour_escape_still_matches ... ok539test eval::tests::printing ... ok540test provenance::tests::locate_takes_the_longest_prefix ... ok541test eval::tests::derivation_keeps_env_and_args_that_are_not_utf8 ... ok542test provenance::tests::locate_without_a_match_is_none ... ok543test eval::tests::from_json_and_toml_reject_null_bytes ... ok544test provenance::tests::failed_line_names_the_attribute_and_the_position ... ok545test remote::grpc::build::tests::a_self_reference_does_not_loop ... ok546test parallel::deque::tests::concurrent_sum ... ok547test remote::grpc::build::tests::a_local_upload_failure_beats_the_stream_ended_status ... ok548test remote::grpc::build::tests::required_features_come_from_the_env_or_structured_attrs ... ok549test parallel::sched::tests::fan_out_from_main ... ok550test flake::fetch::tests::the_first_read_of_a_tree_gives_its_finding ... ok551test remote::grpc::tests::percent_escapes_decode_in_values ... ok552test remote::grpc::build::tests::reschedules_back_off_past_a_dead_worker ... ok553test remote::grpc::build::tests::the_timings_report_with_every_line ... ok554test remote::grpc::build::tests::topo_sort_puts_references_first ... ok555test remote::grpc::health::tests::one_address_does_not_refuse_another ... ok556test remote::grpc::tests::a_token_needs_tls_and_unknown_parameters_are_errors ... ok557test parallel::thunk::tests::deadlocked_fibers_are_cancelled ... ok558test remote::grpc::tests::defaults_match_the_cxx_settings ... ok559test remote::grpc::tests::mtls_needs_both_halves ... ok560test remote::grpc::tests::insecure_is_a_bare_flag_or_a_boolean ... ok561test parallel::sched::tests::main_parks_and_is_woken_by_helper ... ok562test remote::grpc::health::tests::an_unknown_address_is_usable ... ok563test remote::grpc::health::tests::a_completed_build_clears_the_history ... ok564test remote::grpc::drvwire::tests::an_unresolvable_input_output_is_an_error ... ok565test remote::grpc::health::tests::a_passed_cooldown_lets_one_caller_through ... ok566test remote::grpc::tests::every_parameter_parses ... ok567test remote::grpc::drvwire::tests::build_result_round_trips_a_daemon_reply ... ok568test remote::worker::tests::nix_sshopts_split_like_a_shell ... ok569test remote::worker::tests::an_ssh_host_is_never_an_option ... ok570test remote::worker::tests::a_status_over_a_byte_is_not_a_success ... ok571test remote::worker::tests::ssh_argv_puts_the_host_first ... ok572test remote::plan::tests::memory_source_matches_dump_string ... ok573test remote::grpc::drvwire::tests::a_failure_keeps_its_message ... ok574test parallel::sched::tests::park_and_wake_across_workers ... ok575test parallel::interner::tests::concurrent_intern_agrees ... ok576test runtime::value::alloc_tests::a_speculated_thunk_is_forced_but_not_demanded ... ok577test remote::grpc::health::tests::one_bounce_does_not_refuse_an_address ... ok578test remote::grpc::health::tests::the_cooldown_grows_and_stops_at_30s ... ok579test remote::worker::wire::tests::framed_sink_frames_and_terminates ... ok580test remote::plan::tests::hash_source_matches_nar_hash ... ok581test remote::worker::wire::tests::replies_are_read_as_nix_reads_them ... ok582test remote::worker::wire::tests::strings_are_padded ... ok583test runtime::value::alloc_tests::a_list_too_long_to_address_has_no_size ... ok584test remote::grpc::drvwire::tests::path_info_round_trips ... ok585test remote::worker::tests::transport_from_url ... ok586test remote::worker::wire::tests::build_results_are_read_as_nix_reads_them ... ok587test settings::tests::a_settings_file_may_hold_lint_and_the_other_sources_may_not ... ok588test remote::grpc::health::tests::two_bounces_refuse_it ... ok589test settings::tests::the_file_is_the_users ... ok590test runtime::value::layout::a_primop_pays_nothing_for_its_symbol ... ok591test eval::tests::scoping ... ok592test session::tests::two_sessions_share_no_state ... ok593test settings::tests::the_environment_wins_over_the_file ... ok594test settings::tests::a_project_file_holds_lint_and_nothing_else ... ok595test settings::tests::each_source_wins_over_the_one_before ... ok596test settings::tests::a_missing_file_is_skipped_and_the_defaults_hold ... ok597test remote::grpc::drvwire::tests::basic_derivation_matches_the_cxx_field_order ... ok598test settings::tests::source_map_adds_up_and_every_other_key_replaces ... ok599test settings::tests::a_flag_carries_several_places_separated_by_a_semicolon ... ok600test settings::tests::a_wrong_type_names_the_key_and_the_file ... ok601test runtime::value::tests::union_lookup_agrees_with_iteration ... ok602test settings::tests::the_flag_pairs_are_kept_for_a_second_iets ... ok603test settings::tests::builder_reads_all_three_forms ... ok604test settings::tests::the_flag_value_is_toml_when_it_reads_as_toml ... ok605test settings::tests::unknown_key_names_the_file ... ok606test settings::tests::the_user_file_turns_purity_off ... ok607test settings::tests::the_flag_leaves_the_argv ... ok608test parallel::fiber::tests::large_stack_use_and_release ... ok609test source::local::tests::max_mtime_covers_root_and_children ... ok610test progress::tests::a_transfer_that_does_not_move_says_so ... FAILED611test fetch::http::tests::credentials_in_the_url_are_sent_and_never_printed ... FAILED612test fetch::http::tests::a_transient_status_is_retried ... FAILED613test fetch::http::tests::credentials_stay_on_the_first_origin ... FAILED614test source::local::tests::accepted_set_adds_parent_directories ... ok615test eval::tests::attrs_and_lists ... ok616test source::remote::tests::substitution_costs_less_than_the_subprocess ... ignored617test store::drv::tests::fixtures_output_paths_recompute_from_store ... ignored, needs the input .drv closures in /nix/store618test source::lock::tests::incomplete_locks_fail ... ok619test source::remote::tests::nix_literal_escapes ... ok620test flake::fetch::tests::a_read_of_the_count_is_one_finding_for_each_tree ... ok621test source::scm::git::tests::a_directory_in_a_repository_is_found ... ok622test source::scm::ledger::tests::a_directory_in_a_working_tree_is_found ... ok623test store::drv::tests::masked_unparse_blanks_output_paths_and_env ... ok624test store::drv::tests::input_addressed_multi_output_from_scratch ... ok625test store::drv::tests::string_escapes_roundtrip ... ok626test store::hash::tests::sha256_sri ... ok627test store::hash::tests::streaming_matches_oneshot ... ok628test store::hash::tests::base64_roundtrip ... ok629test store::drvdiff::tests::the_local_fields_the_env_and_an_absent_value ... ok630test store::drvdiff::tests::the_same_derivation_is_empty ... ok631test store::hash::tests::empty_sha256 ... ok632test source::local::tests::only_a_content_addressed_store_path_names_its_content ... ok633test store::hash::tests::sha1_nix32 ... ok634test store::drv::tests::an_env_key_named_json_is_refused ... ok635test store::drvdiff::tests::json_names_what_differs ... ok636test source::remote::tests::access_tokens_match_the_longest_prefix ... ok637test store::hash::tests::nix32_roundtrip_and_reject ... ok638test source::remote::tests::only_the_archive_types_are_fetched_by_iets ... ok639test store::drv::tests::input_drvs_hash_modulo_from_scratch ... ok640test source::tests::dates ... ok641test store::drvdiff::tests::an_input_source_an_added_input_drv_and_a_fixed_output_show_up ... ok642test store::hash::tests::sha512_nix32_base64 ... ok643test source::lock::tests::complete_lock_passes ... ok644test store::drvdiff::tests::a_changed_input_drv_is_paired_by_name_and_recursed_into ... ok645test store::hash::tests::parse_any_all_formats ... ok646test store::drvdiff::tests::the_depth_limit_names_the_input_without_walking_it ... ok647test store::drvdiff::tests::env_name_shows_only_when_it_is_not_the_derivation_name ... ok648test store::drv::tests::fixed_output_from_scratch ... ok649test store::nar::tests::executable_file_nar ... ok650test store::nar::tests::filter_sees_types_and_paths ... ok651test store::nar::tests::directory_nar ... ok652test store::nar::tests::directory_nar_hash_formats ... ok653test store::hash::tests::sha256_nix32 ... ok654test store::hash::tests::md5_nix32 ... ok655test source::remote::tests::download_urls_match_the_fetchers ... ok656test store::hash::tests::compress_hash_xors ... ok657test store::path::tests::output_names ... ok658test store::path::tests::fixed_recursive_sha256 ... ok659test store::path::tests::placeholder ... ok660test store::nar::tests::regular_file_nar ... ok661test store::nar::tests::readers_refuse_what_nix_refuses ... ok662test flake::fetch::tests::the_tree_decides_the_level ... ok663test store::drv::tests::a_dynamic_input_writes_the_versioned_aterm_and_parses_back ... ok664test store::path::tests::fixed_flat_sha256 ... ok665test store::path::tests::fixed_flat_sha1 ... ok666test syntax::tests::differential_strings_against_nix ... ignored, needs nix on PATH and takes a few seconds667test source::scm::ledger::tests::an_untracked_file_is_the_error_of_nix ... ok668test store::path::tests::a_multibyte_char_across_the_hash_part_is_an_error ... ok669test store::path::tests::check_name_rules ... ok670test store::path::tests::parse_and_accessors ... ok671test store::nar::tests::restore_rejects_garbage ... ok672test store::nar::tests::symlink_nar ... ok673test store::path::tests::filter_source ... ok674test store::path::tests::path_with_name ... ok675test store::path::tests::path_copy_file ... ok676test store::path::tests::path_copy_directory ... ok677test store::nar::tests::restore_roundtrip ... ok678test store::path::tests::to_file_with_reference ... ok679test store::path::tests::to_file ... ok680test syntax::tests::line_col_counts_bytes ... ok681test profile::tests::a_deep_stack_is_capped ... ok682test store::drv::tests::fixtures_roundtrip_byte_exact ... ok683test store::drv::tests::fixtures_output_paths_recompute ... ok684test flake::fetch::tests::a_read_that_is_not_a_selection_has_no_site ... ok685test syntax::tests::a_line_ends_at_cr_lf_and_lone_cr ... ok686test source::scm::ledger::tests::the_metadata_has_the_mark_of_its_tree ... ok687test trace::key::tests::key_is_order_and_value_sensitive ... ok688test trace::key::tests::relative_path_detection ... ok689test syntax::tests::spans_cover_tokens ... ok690test syntax::tests::indented_string_stripping ... ok691test trace::store::tests::bytes_that_are_not_an_entry_are_bad_not_a_panic ... ok692test syntax::tests::json_gives_every_node_its_kind_and_span ... ok693test trace::validate::dir_hash_tests::dir_hash_agrees_with_dir_listing_hash ... ok694test eval::tests::reading_a_derivation_output_is_unsupported ... ok695test store::drv::tests::fixtures_drv_path_matches_store_path ... ok696test syntax::tests::end_of_file_inside_a_path_is_at_its_last_token ... ok697test trace::tests::fingerprint_changes_with_content_size_and_seen_entries ... ok698test trace::store::tests::a_reader_of_one_generation_never_sees_the_next ... ok699test trace::wire::tests::readset_roundtrip ... ok700test trace::store::tests::one_rename_publishes_every_part ... ok701test trace::tests::dump_fingerprint_matches_the_separate_walk ... ok702test source::scm::ledger::tests::a_change_of_the_ledger_is_a_change_of_the_working_tree ... ok703test trace::tests::dedupe_keeps_conflicting_values ... ok704test syntax::tests::an_interpolated_name_is_static_when_nix_has_one_string_node ... ok705test trace::watch::tests::only_the_paths_an_mtime_can_speak_for ... ok706test treestore::pack::tests::a_reader_sees_a_pack_written_after_it_listed ... ok707test treestore::pack::tests::a_pack_reads_back_what_was_written ... ok708test treestore::pack::tests::an_empty_writer_leaves_no_file ... ok709test trace::validate::tests::file_touch_refreshes_edit_misses ... ok710test treestore::tests::a_staged_directory_goes_when_it_is_dropped ... ok711test treestore::pack::tests::a_set_finds_objects_across_packs_and_drops_a_broken_one ... ok712test treestore::pack::tests::a_changed_index_byte_is_not_a_pack ... ok713test syntax::tests::string_escapes_and_interpolation ... ok714test syntax::tests::allow_comments ... ok715test trace::validate::tests::a_copy_in_place_that_keeps_the_stat_still_misses ... ok716test trace::tests::only_a_named_query_is_an_observation ... ok717test syntax::tests::lambdas ... ok718test syntax::tests::nul_in_string_literals ... ok719test source::scm::ledger::tests::the_tracked_files_and_the_metadata_are_the_tree ... ok720test treestore::tests::a_tree_is_named_by_its_nar_hash ... ok721test syntax::tests::numbers ... ok722test source::scm::ledger::tests::the_count_is_lazy_and_kept_by_revision ... ok723test treestore::pack::tests::collect_removes_dead_packs_and_compacts_mostly_dead_ones ... ok724test syntax::tests::attrs_and_bindings ... ok725test syntax::tests::comments_and_misc ... ok726test fetch::http::tests::a_decompression_bomb_is_refused ... ok727test trace::validate::tests::dir_stat_env_checks ... ok728test syntax::tests::the_error_reported_is_the_one_nix_meets_first ... ok729test trace::wire::tests::drvs_sources_roots_roundtrip ... ok730test trace::tests::dedupe_of_many_repeats_is_linear ... ok731test syntax::tests::paths ... ok732test treestore::tests::a_put_after_a_collection_brings_its_own_objects ... ok733test treestore::tests::collect_keeps_what_an_entry_names ... ok734test treestore::tests::a_stored_input_reads_back_and_a_wrong_hash_is_refused ... ok735test treestore::tests::two_inputs_share_their_common_files ... ok736test syntax::tests::operator_precedence ... ok737test flake::fetch::tests::the_name_on_a_value_that_is_not_a_tree_is_silent ... ok738test syntax::tests::deep_nesting_ends_with_an_error ... ok739test api::run::tests::helper_fibers_read_the_ir_cache ... ok740test flake::fetch::tests::a_selection_of_the_count_is_the_site ... ok741test api::run::tests::the_counters_cover_the_helper_fibers has been running for over 60 seconds742test eval::tests::pure_eval_answers_like_nix has been running for over 60 seconds743test api::run::tests::the_counters_cover_the_helper_fibers ... ok744test syntax::tests::lang_corpus ... ok745test eval::tests::pure_eval_answers_like_nix ... ok746test parallel::thunk::tests::many_fibers_force_one_shared_graph ... ok747test runtime::value::tests::union_iteration_merges_like_a_fold has been running for over 60 seconds748test trace::validate::tests::the_lowest_failing_observation_is_the_one_reported has been running for over 60 seconds749test trace::validate::tests::the_lowest_failing_observation_is_the_one_reported ... ok750test runtime::value::tests::union_iteration_merges_like_a_fold ... ok751752failures:753754---- progress::tests::a_transfer_that_does_not_move_says_so stdout ----755756thread 'progress::tests::a_transfer_that_does_not_move_says_so' (4868) panicked at src/progress.rs:444:9:757assertion `left == right` failed758 left: "⏵ downloading 'u', 2.0 KiB (46s, no data for 46s)"759 right: "⏵ downloading 'u', 2.0 KiB (45s, no data for 45s)"760761---- fetch::http::tests::credentials_in_the_url_are_sent_and_never_printed stdout ----762763thread 'fetch::http::tests::credentials_in_the_url_are_sent_and_never_printed' (4753) panicked at src/fetch/http.rs:986:57:764called `Result::unwrap()` on an `Err` value: Usage("cannot fetch 'http://user:***@127.0.0.1:35937/x': no response (stalled-download-timeout)")765766---- fetch::http::tests::a_transient_status_is_retried stdout ----767768thread 'fetch::http::tests::a_transient_status_is_retried' (4752) panicked at src/fetch/http.rs:1014:57:769called `Result::unwrap()` on an `Err` value: Usage("cannot fetch 'http://127.0.0.1:46257/': no response (stalled-download-timeout)")770note: run with `RUST_BACKTRACE=1` environment variable to display a backtrace771772---- fetch::http::tests::credentials_stay_on_the_first_origin stdout ----773774thread 'fetch::http::tests::credentials_stay_on_the_first_origin' (4754) panicked at src/fetch/http.rs:889:59:775called `Result::unwrap()` on an `Err` value: Usage("cannot fetch 'http://127.0.0.1:45387/': no response (stalled-download-timeout)")776777778failures:779 fetch::http::tests::a_transient_status_is_retried780 fetch::http::tests::credentials_in_the_url_are_sent_and_never_printed781 fetch::http::tests::credentials_stay_on_the_first_origin782 progress::tests::a_transfer_that_does_not_move_says_so783784test result: FAILED. 444 passed; 4 failed; 5 ignored; 0 measured; 0 filtered out; finished in 143.85s785786error: test failed, to rerun pass `--lib`