setup
checks.x86_64-linux.test
· build #6
· raw
1this derivation will be built:2 /nix/store/32v4lc1lnpyj249jdwy9dpk5c46s7f8f-iets-test-0.1.0.drv3error: Cannot build '/nix/store/32v4lc1lnpyj249jdwy9dpk5c46s7f8f-iets-test-0.1.0.drv'.4 Reason: builder failed with exit code 101.5 Output paths:6 /nix/store/jm366y0lg0ws5n2k7rvxc2a28xcdkh35-iets-test-0.1.07 Last 25 log lines:8 >9 > thread 'fetch::http::tests::credentials_in_the_url_are_sent_and_never_printed' (4753) panicked at src/fetch/http.rs:986:57:10 > called `Result::unwrap()` on an `Err` value: Usage("cannot fetch 'http://user:***@127.0.0.1:35937/x': no response (stalled-download-timeout)")11 >12 > ---- fetch::http::tests::a_transient_status_is_retried stdout ----13 >14 > thread 'fetch::http::tests::a_transient_status_is_retried' (4752) panicked at src/fetch/http.rs:1014:57:15 > called `Result::unwrap()` on an `Err` value: Usage("cannot fetch 'http://127.0.0.1:46257/': no response (stalled-download-timeout)")16 > note: run with `RUST_BACKTRACE=1` environment variable to display a backtrace17 >18 > ---- fetch::http::tests::credentials_stay_on_the_first_origin stdout ----19 >20 > thread 'fetch::http::tests::credentials_stay_on_the_first_origin' (4754) panicked at src/fetch/http.rs:889:59:21 > called `Result::unwrap()` on an `Err` value: Usage("cannot fetch 'http://127.0.0.1:45387/': no response (stalled-download-timeout)")22 >23 >24 > failures:25 > fetch::http::tests::a_transient_status_is_retried26 > fetch::http::tests::credentials_in_the_url_are_sent_and_never_printed27 > fetch::http::tests::credentials_stay_on_the_first_origin28 > progress::tests::a_transfer_that_does_not_move_says_so29 >30 > test result: FAILED. 444 passed; 4 failed; 5 ignored; 0 measured; 0 filtered out; finished in 143.85s31 >32 > error: test failed, to rerun pass `--lib`33 For full logs, run:34 nix log /nix/store/32v4lc1lnpyj249jdwy9dpk5c46s7f8f-iets-test-0.1.0.drv