failed attributes
| status |
attribute |
duration |
| failed |
checks.aarch64-linux.clippy
|
19m 13s |
iets-clippy-0.2.0:
error[E0425]: cannot find function `iets` in module `hermetic`
--> tests/cli.rs:232:35
|
232 | let mut c = hermetic::iets( …
iets-clippy-0.2.0:
error[E0425]: cannot find function `iets` in module `hermetic`
--> tests/cli.rs:232:35
|
232 | let mut c = hermetic::iets();
| ^^^^ not found in `hermetic`
For more information about this error, try `rustc --explain E0425`.
error: could not compile `iets` (test "cli") due to 1 previous error
warning: build failed, waiting for other jobs to finish...
|
| failed |
checks.aarch64-linux.conformance
|
2m 4s |
… and 1 more failed derivation
… and 1 more failed derivation
|
| failed |
checks.aarch64-linux.doctest
|
2m 8s |
… and 1 more failed derivation
… and 1 more failed derivation
|
| failed |
checks.aarch64-linux.fuzz-drv
|
12m 19s |
… and 1 more failed derivation
… and 1 more failed derivation
|
| failed |
checks.aarch64-linux.fuzz-eval
|
23m 33s |
… and 1 more failed derivation
… and 1 more failed derivation
|
| failed |
checks.aarch64-linux.fuzz-nar
|
12m 9s |
… and 1 more failed derivation
… and 1 more failed derivation
|
| failed |
checks.aarch64-linux.fuzz-parse
|
10m 35s |
… and 1 more failed derivation
… and 1 more failed derivation
|
| failed |
checks.aarch64-linux.fuzz-wire
|
10m 14s |
… and 1 more failed derivation
… and 1 more failed derivation
|
| failed |
checks.aarch64-linux.nixpkgs-eval
|
6m 21s |
… and 1 more failed derivation
… and 1 more failed derivation
|
| failed |
checks.aarch64-linux.test
|
4m 59s |
iets-nextest-0.2.0:
--> tests/cli.rs:232:35
|
232 | let mut c = hermetic::iets();
| ^^^^ not found in ` …
iets-nextest-0.2.0:
--> tests/cli.rs:232:35
|
232 | let mut c = hermetic::iets();
| ^^^^ not found in `hermetic`
For more information about this error, try `rustc --explain E0425`.
error: could not compile `iets` (test "cli") due to 1 previous error
warning: build failed, waiting for other jobs to finish...
error: command `/nix/store/4xg2np6a2m3ff0camgca44rb5h8g71nl-cargo-1.98.1/bin/cargo '--color=auto' test --no-run --message-format json-render-diagnostics --profile dev` exited with code 101
|
| failed |
checks.x86_64-linux.clippy
|
41s |
iets-clippy-0.2.0:
error[E0425]: cannot find function `iets` in module `hermetic`
--> tests/cli.rs:232:35
|
232 | let mut c = hermetic::iets( …
iets-clippy-0.2.0:
error[E0425]: cannot find function `iets` in module `hermetic`
--> tests/cli.rs:232:35
|
232 | let mut c = hermetic::iets();
| ^^^^ not found in `hermetic`
For more information about this error, try `rustc --explain E0425`.
error: could not compile `iets` (test "cli") due to 1 previous error
warning: build failed, waiting for other jobs to finish...
|
| failed |
checks.x86_64-linux.nixpkgs-eval
|
11m 20s |
iets-nextest-0.2.0:
--> tests/cli.rs:232:35
|
232 | let mut c = hermetic::iets();
| ^^^^ not found in ` …
iets-nextest-0.2.0:
--> tests/cli.rs:232:35
|
232 | let mut c = hermetic::iets();
| ^^^^ not found in `hermetic`
For more information about this error, try `rustc --explain E0425`.
error: could not compile `iets` (test "cli") due to 1 previous error
warning: build failed, waiting for other jobs to finish...
error: command `/nix/store/gmgfpzc0w2pgby0lmq9r88m39albiyfw-cargo-1.98.1/bin/cargo '--color=auto' test --no-run --message-format json-render-diagnostics --profile release` exited with code 101
|
| failed |
checks.x86_64-linux.test
|
2m 34s |
iets-nextest-0.2.0:
--> tests/cli.rs:232:35
|
232 | let mut c = hermetic::iets();
| ^^^^ not found in ` …
iets-nextest-0.2.0:
--> tests/cli.rs:232:35
|
232 | let mut c = hermetic::iets();
| ^^^^ not found in `hermetic`
For more information about this error, try `rustc --explain E0425`.
error: could not compile `iets` (test "cli") due to 1 previous error
warning: build failed, waiting for other jobs to finish...
error: command `/nix/store/gmgfpzc0w2pgby0lmq9r88m39albiyfw-cargo-1.98.1/bin/cargo '--color=auto' test --no-run --message-format json-render-diagnostics --profile dev` exited with code 101
|