nixbot

builds

numtide/iets build #583 failed

branch main · PR #231 · commit 45400d1cbd · · took 14m 23s · eval 13s

eval warnings 2 kinds · 2 occurrences
  • warn setting 'accept-flake-config' is ignored: iets never applies a flake's nixConfig, so a flake that sets extra-substituters or allow-import-from-derivation there runs without them; put the settings in nix.conf ×1
  • warn setting 'plugin-files' is ignored: iets loads no plugins ×1

4 failed
failed attributes
status attribute duration
failed checks.aarch64-linux.clippy 42s
iets-clippy-0.2.0: error[E0425]: cannot find function `iets` in module `hermetic` --> tests/cli.rs:236:35 | 236 | let mut c = hermetic::iets( …
iets-clippy-0.2.0:
error[E0425]: cannot find function `iets` in module `hermetic`
   --> tests/cli.rs:236:35
    |
236 |             let mut c = hermetic::iets();
    |                                   ^^^^ not found in `hermetic`
For more information about this error, try `rustc --explain E0425`.
error: could not compile `iets` (test "cli") due to 1 previous error
warning: build failed, waiting for other jobs to finish...
failed checks.aarch64-linux.test 3m 0s
iets-nextest-0.2.0: --> tests/cli.rs:236:35 | 236 | let mut c = hermetic::iets(); | ^^^^ not found in ` …
iets-nextest-0.2.0:
   --> tests/cli.rs:236:35
    |
236 |             let mut c = hermetic::iets();
    |                                   ^^^^ not found in `hermetic`
For more information about this error, try `rustc --explain E0425`.
error: could not compile `iets` (test "cli") due to 1 previous error
warning: build failed, waiting for other jobs to finish...
error: command `/nix/store/4xg2np6a2m3ff0camgca44rb5h8g71nl-cargo-1.98.1/bin/cargo '--color=auto' test --no-run --message-format json-render-diagnostics --profile dev` exited with code 101
failed checks.x86_64-linux.clippy 1m 1s
iets-clippy-0.2.0: error[E0425]: cannot find function `iets` in module `hermetic` --> tests/cli.rs:236:35 | 236 | let mut c = hermetic::iets( …
iets-clippy-0.2.0:
error[E0425]: cannot find function `iets` in module `hermetic`
   --> tests/cli.rs:236:35
    |
236 |             let mut c = hermetic::iets();
    |                                   ^^^^ not found in `hermetic`
For more information about this error, try `rustc --explain E0425`.
error: could not compile `iets` (test "cli") due to 1 previous error
warning: build failed, waiting for other jobs to finish...
failed checks.x86_64-linux.test 2m 52s
iets-nextest-0.2.0: --> tests/cli.rs:236:35 | 236 | let mut c = hermetic::iets(); | ^^^^ not found in ` …
iets-nextest-0.2.0:
   --> tests/cli.rs:236:35
    |
236 |             let mut c = hermetic::iets();
    |                                   ^^^^ not found in `hermetic`
For more information about this error, try `rustc --explain E0425`.
error: could not compile `iets` (test "cli") due to 1 previous error
warning: build failed, waiting for other jobs to finish...
error: command `/nix/store/gmgfpzc0w2pgby0lmq9r88m39albiyfw-cargo-1.98.1/bin/cargo '--color=auto' test --no-run --message-format json-render-diagnostics --profile dev` exited with code 101
3 cancelled
cancelled attributes
status attribute duration
loading…
27 succeeded
succeeded attributes
status attribute duration
loading…
3 already built
skipped attributes
status attribute duration
loading…