nixbot

builds

failed iets-nextest-0.1.0 checks.x86_64-linux.test · build #542 · raw

1bld1: building cy0mpn91xcndgh4wma7xj27wwdngwqkn-iets-nextest-0.1.0.drv
unpackPhase
2unpacking source archive /nix/store/sjwpc8shc0aqwsdfjf6qhg7bqrz3q336-source3source root is source
patchPhase
4Executing configureCargoCommonVars5decompressing cargo artifacts from /nix/store/vx05h82p0xs8h00xhb8hkkz89gwymrk2-iets-deps-0.1.0/target.tar.zst to target
configurePhase
6will append /build/source/.cargo-home/config.toml with contents of /nix/store/jg86zllj9qviys82h6gvd85qkaq5v7l1-vendor-cargo-deps/config.toml7default configurePhase, nothing to do
buildPhase
8+++ command cargo --version9cargo 1.98.0 (797e8a9bc 2026-08-05)10+++ command cargo nextest --version11cargo-nextest 0.9.14612release: 0.9.14613host: x86_64-unknown-linux-gnu
checkPhase
14+++ command cargo nextest run --cargo-profile dev15 Compiling iets v0.1.0 (/build/source)16 Finished `dev` profile [unoptimized + debuginfo] target(s) in 37.63s17------------18 Nextest run ID 6cfbbbbd-2d67-4ee0-a088-80d722fc50b2 with nextest profile: default19 Starting 1042 tests across 32 binaries (6 tests skipped)20 PASS [ 0.008s] ( 1/1042) iets api::installable::tests::the_name_a_program_takes_from_a_derivation_name21 PASS [ 0.009s] ( 2/1042) iets api::installable::tests::default_and_fragment_attr_paths22 PASS [ 0.009s] ( 3/1042) iets build::backend::tests::the_timings_report_with_every_line23 PASS [ 0.009s] ( 4/1042) iets build::event::tests::durations24 PASS [ 0.009s] ( 5/1042) iets build::executor::tests::one_place_declaring_nothing_takes_everything25 PASS [ 0.010s] ( 6/1042) iets api::drvshow::tests::pretty_matches_serde_json26 PASS [ 0.010s] ( 7/1042) iets api::drvshow::tests::inputs_and_structured_attrs27 PASS [ 0.010s] ( 8/1042) iets build::executor::tests::no_place_at_all_is_a_usage_error28 PASS [ 0.011s] ( 9/1042) iets build::executor::tests::an_unsupported_url_says_what_is_expected29 PASS [ 0.011s] ( 10/1042) iets api::fetch::tests::the_fake_hash_moves_the_output_and_the_drv30 PASS [ 0.011s] ( 11/1042) iets api::drvshow::tests::a_non_canonical_structured_attrs_text_is_renormalised31 PASS [ 0.011s] ( 12/1042) iets api::fetch::tests::only_a_fixed_output_drv_can_be_prefetched32 PASS [ 0.012s] ( 13/1042) iets api::drvshow::tests::floats_take_nlohmanns_form33 PASS [ 0.011s] ( 14/1042) iets build::backend::tests::output_specs34 PASS [ 0.011s] ( 15/1042) iets build::executor::tests::the_first_place_that_takes_it_wins35 PASS [ 0.013s] ( 16/1042) iets api::drvshow::tests::a_fixed_output_shows_its_content_address_and_no_path36 PASS [ 0.013s] ( 17/1042) iets api::drvshow::tests::a_multi_output_derivation37 PASS [ 0.015s] ( 18/1042) iets build::backend::tests::base_names_drop_the_store_dir38 PASS [ 0.008s] ( 19/1042) iets build::render::tests::a_stalled_build_that_fails_still_shows_its_cause39 PASS [ 0.008s] ( 20/1042) iets build::render::tests::an_owned_build_is_verdicted_once_by_its_op40 PASS [ 0.019s] ( 21/1042) iets build::executor::tests::a_feature_the_place_lacks_rules_it_out41 PASS [ 0.011s] ( 22/1042) iets build::render::tests::a_build_log_never_reports_a_mismatch42 PASS [ 0.010s] ( 23/1042) iets build::render::tests::ci_folds_a_success_and_never_a_failure43 PASS [ 0.011s] ( 24/1042) iets build::fanout::tests::a_failed_dependency_blocks_its_dependants44 PASS [ 0.011s] ( 25/1042) iets build::render::tests::a_long_attribute_keeps_its_ends45 PASS [ 0.011s] ( 26/1042) iets build::render::tests::a_failure_shows_a_short_extract46 PASS [ 0.009s] ( 27/1042) iets build::render::tests::logs_of_two_builds_do_not_interleave47 PASS [ 0.011s] ( 28/1042) iets build::tests::targets_become_jobs48 PASS [ 0.026s] ( 29/1042) iets build::executor::tests::a_declared_system_filters49 PASS [ 0.018s] ( 30/1042) iets build::fixhash::tests::a_longer_hash_is_not_a_match50 PASS [ 0.018s] ( 31/1042) iets build::render::tests::a_build_the_backend_saw_succeed_is_verdicted_at_once51 PASS [ 0.015s] ( 32/1042) iets build::render::tests::one_build_needs_no_summary52 PASS [ 0.014s] ( 33/1042) iets build::render::tests::the_live_region_spins_and_counts53 PASS [ 0.026s] ( 34/1042) iets build::executor::tests::a_refusal_names_every_place_and_what_it_declared54 PASS [ 0.017s] ( 35/1042) iets build::render::tests::an_unfolded_success_ends_with_its_verdict55 PASS [ 0.018s] ( 36/1042) iets build::fixhash::tests::two_matches_are_left_alone56 PASS [ 0.016s] ( 37/1042) iets build::render::tests::heartbeat_names_running_builds57 PASS [ 0.018s] ( 38/1042) iets build::render::tests::a_failure_after_the_activity_ended_never_claims_a_success58 PASS [ 0.017s] ( 39/1042) iets build::fixhash::tests::one_match_is_rewritten_in_its_own_spelling59 PASS [ 0.015s] ( 40/1042) iets build::render::tests::tty_keeps_successful_logs_off_the_screen60 PASS [ 0.026s] ( 41/1042) iets argv::tests::every_byte_round_trips61 PASS [ 0.013s] ( 42/1042) iets build::tests::hash_stripping62 PASS [ 0.016s] ( 43/1042) iets build::render::tests::drv_paths_of_a_failure_message63 PASS [ 0.018s] ( 44/1042) iets build::render::tests::a_daemon_failure_message_decides_the_verdict64 PASS [ 0.022s] ( 45/1042) iets build::fanout::tests::dependencies_run_first65 PASS [ 0.013s] ( 46/1042) iets builtins::derivation::tests::a_dynamic_output_renders_the_placeholder_nix_renders66 PASS [ 0.018s] ( 47/1042) iets build::render::tests::the_summary_follows_more_than_one_build67 PASS [ 0.016s] ( 48/1042) iets builtins::derivation::tests::the_two_placeholders_are_not_the_same68 PASS [ 0.027s] ( 49/1042) iets build::render::tests::the_status_line_takes_the_colours_of_the_rows_above69 PASS [ 0.012s] ( 50/1042) iets builtins::text::fromtoml::tests::new_escapes_are_refused70 PASS [ 0.026s] ( 51/1042) iets build::tests::a_target_with_no_verdict_fails71 PASS [ 0.012s] ( 52/1042) iets cachefs::tests::a_touch_inside_the_interval_writes_nothing72 PASS [ 0.006s] ( 53/1042) iets builtins::text::fromtoml::tests::inline_tables_stay_on_one_line73 PASS [ 0.011s] ( 54/1042) iets builtins::text::regex::tests::size_limit74 PASS [ 0.011s] ( 55/1042) iets cachefs::tests::a_wait_lock_waits_for_its_holder75 PASS [ 0.010s] ( 56/1042) iets cachefs::tests::a_wipe_of_the_ir_cache_walks_its_shards76 PASS [ 0.011s] ( 57/1042) iets builtins::fetch_git::tests::only_a_plain_rev_or_ref_is_read_by_iets77 PASS [ 0.014s] ( 58/1042) iets builtins::fetch_git::tests::a_working_tree_is_a_file_url_of_an_absolute_path78 PASS [ 0.011s] ( 59/1042) iets cachefs::tests::a_directory_that_is_not_ours_is_refused_untouched79 PASS [ 0.019s] ( 60/1042) iets builtins::text::regex::tests::names80 PASS [ 0.017s] ( 61/1042) iets cachefs::tests::a_sweep_runs_once_per_interval81 PASS [ 0.011s] ( 62/1042) iets cachefs::tests::sweep_walks_the_shards_of_the_ir_cache82 PASS [ 0.012s] ( 63/1042) iets cachefs::tests::an_empty_directory_is_ours_to_take83 PASS [ 0.018s] ( 64/1042) iets cachefs::tests::a_stamp_in_the_future_is_due84 PASS [ 0.018s] ( 65/1042) iets builtins::store_hooks::tests::a_relative_path_inside_an_entry_joins_once85 PASS [ 0.015s] ( 66/1042) iets cachefs::tests::an_input_store_of_the_spool_layout_is_wiped86 PASS [ 0.015s] ( 67/1042) iets cli::build::tests::a_path_on_stdout_is_silent87 PASS [ 0.016s] ( 68/1042) iets cachefs::tests::sweep_ages_a_root_by_its_link_not_by_what_it_names88 PASS [ 0.020s] ( 69/1042) iets cachefs::tests::sweep_drops_old_entries_and_keeps_young_ones89 PASS [ 0.019s] ( 70/1042) iets cachefs::tests::version_mismatch_wipes_the_store90 PASS [ 0.013s] ( 71/1042) iets cli::build::tests::an_out_flag_that_matches_nothing_is_named91 PASS [ 0.025s] ( 72/1042) iets cachefs::tests::a_wipe_keeps_what_iets_did_not_create92 PASS [ 0.020s] ( 73/1042) iets cli::build::tests::a_failed_build_reports_itself93 PASS [ 0.012s] ( 74/1042) iets cli::build::tests::no_build_result_is_named94 PASS [ 0.012s] ( 75/1042) iets cli::build::tests::out_links_are_named_as_nix_build_names_them95 PASS [ 0.008s] ( 76/1042) iets cli::classic::shell::tests::sh_var_names96 PASS [ 0.013s] ( 77/1042) iets cli::classic::nix::tests::eval_takes_print_build_logs97 PASS [ 0.026s] ( 78/1042) iets cachefs::tests::garbled_stamp_wipes_the_store98 PASS [ 0.023s] ( 79/1042) iets cli::build::tests::a_success_with_no_output_path_is_named99 PASS [ 0.017s] ( 80/1042) iets cli::build::tests::installables_are_sorted_without_repeats100 PASS [ 0.033s] ( 81/1042) iets cachefs::tests::a_store_without_a_version_file_is_wiped_once101 PASS [ 0.011s] ( 82/1042) iets cli::classic::shell::tests::declares_for_every_bash_shaped_value102 PASS [ 0.056s] ( 83/1042) iets build::tests::a_fan_out_backend_keeps_the_cap_and_the_log_blocks103 PASS [ 0.016s] ( 84/1042) iets cli::build::tests::no_outcome_at_all_is_named104 PASS [ 0.010s] ( 85/1042) iets cli::complete::tests::a_positional_is_left_to_the_shell105 PASS [ 0.012s] ( 86/1042) iets cli::classic::shell::tests::outputs_become_placeholders106 PASS [ 0.010s] ( 87/1042) iets cli::complete::tests::commands_complete_with_their_summary107 PASS [ 0.018s] ( 88/1042) iets cli::classic::nix::tests::flake_registry_is_the_setting108 PASS [ 0.015s] ( 89/1042) iets cli::classic::tests::a_flag_with_no_effect_is_noted_and_one_that_holds_is_not109 PASS [ 0.014s] ( 90/1042) iets cli::complete::tests::a_flag_value_completes_by_its_placeholder110 PASS [ 0.016s] ( 91/1042) iets cli::plumbing::tests::a_url_is_the_positional_fetch_takes_itself111 PASS [ 0.079s] ( 92/1042) iets build::fanout::tests::at_most_limit_builds_run_at_once112 PASS [ 0.020s] ( 93/1042) iets cli::docs::tests::the_topic_list_fits_80_columns113 PASS [ 0.018s] ( 94/1042) iets cli::plumbing::tests::a_file_url_needs_one_slash_not_three114 PASS [ 0.022s] ( 95/1042) iets cli::help::tests::help_fits_80_columns115 PASS [ 0.022s] ( 96/1042) iets cli::help::tests::a_mistyped_command_is_suggested116 PASS [ 0.025s] ( 97/1042) iets cli::complete::tests::subcommands_and_topics117 PASS [ 0.023s] ( 98/1042) iets cli::render::text::tests::a_long_value_shows_the_lines_that_differ118 PASS [ 0.029s] ( 99/1042) iets cli::diff::tests::a_name_ends_at_the_first_dash_before_a_digit119 PASS [ 0.027s] ( 100/1042) iets cli::help::tests::messages120 PASS [ 0.008s] ( 101/1042) iets cli::search::tests::drv_names121 PASS [ 0.034s] ( 102/1042) iets cli::complete::tests::every_script_asks_the_binary122 PASS [ 0.031s] ( 103/1042) iets cli::docs::tests::topics_resolve_bare_and_qualified123 PASS [ 0.030s] ( 104/1042) iets cli::help::tests::suggestions_come_from_the_help124 PASS [ 0.033s] ( 105/1042) iets cli::complete::tests::flags_complete_after_a_dash125 PASS [ 0.038s] ( 106/1042) iets cli::render::tests::sizes_render_as_nix_renders_them126 PASS [ 0.043s] ( 107/1042) iets cli::docs::tests::every_embedded_page_has_a_heading127 PASS [ 0.026s] ( 108/1042) iets cli::search::tests::index_round_trip128 PASS [ 0.025s] ( 109/1042) iets config::tests::bool_spellings129 PASS [ 0.031s] ( 110/1042) iets config::tests::an_alias_is_its_setting130 PASS [ 0.038s] ( 111/1042) iets cli::search::tests::merged_highlights131 PASS [ 0.031s] ( 112/1042) iets config::tests::a_setting_with_no_effect_is_noted132 PASS [ 0.018s] ( 113/1042) iets config::tests::max_jobs_auto_is_the_cpu_count133 PASS [ 0.014s] ( 114/1042) iets config::tests::option_nix_path_replaces_nix_path_and_extra_adds134 PASS [ 0.017s] ( 115/1042) iets config::tests::missing_include_errors_and_bang_include_does_not135 PASS [ 0.027s] ( 116/1042) iets config::tests::extra_appends_to_list_settings_only136 PASS [ 0.056s] ( 117/1042) iets cli::run::tests::a_usage_error_is_an_exit_code_and_a_message137 PASS [ 0.033s] ( 118/1042) iets config::tests::bad_typed_values_error_where_they_are_set138 PASS [ 0.031s] ( 119/1042) iets config::tests::a_classic_name_leaves_an_unimplemented_setting_to_nix139 PASS [ 0.095s] ( 120/1042) iets cachefs::tests::a_lock_that_cannot_be_opened_is_not_a_busy_lock140 PASS [ 0.032s] ( 121/1042) iets config::tests::include_chain141 PASS [ 0.032s] ( 122/1042) iets config::tests::basic_syntax142 PASS [ 0.009s] ( 123/1042) iets config::tests::overrides_win_over_files143 PASS [ 0.098s] ( 124/1042) iets cachefs::tests::the_writer_lock_excludes_one_holder_at_a_time144 PASS [ 0.017s] ( 125/1042) iets devenv::tests::json_roundtrip_and_bash_forms145 PASS [ 0.018s] ( 126/1042) iets devenv::tests::get_env_sh_store_path_matches_nix146 PASS [ 0.010s] ( 127/1042) iets config::tests::the_daemon_gets_the_store_settings_set_outside_the_system_file147 PASS [ 0.019s] ( 128/1042) iets config::tests::syntax_errors148 PASS [ 0.023s] ( 129/1042) iets config::tests::typed_getters_and_defaults149 PASS [ 0.021s] ( 130/1042) iets devenv::tests::non_bash_builder_is_refused150 PASS [ 0.022s] ( 131/1042) iets config::tests::user_conf_files_are_in_precedence_order151 PASS [ 0.023s] ( 132/1042) iets config::tests::unknown_settings_are_kept152 PASS [ 0.028s] ( 133/1042) iets config::tests::the_setting_tables_name_nix_settings153 PASS [ 0.010s] ( 134/1042) iets display::tests::colour_and_width154 PASS [ 0.012s] ( 135/1042) iets display::tests::growth_does_not_eat_output155 PASS [ 0.032s] ( 136/1042) iets devenv::tests::shell_escaping156 PASS [ 0.036s] ( 137/1042) iets devenv::tests::cached_result_roundtrip157 PASS [ 0.035s] ( 138/1042) iets devenv::tests::output_checks_are_erased_only_when_present158 PASS [ 0.034s] ( 139/1042) iets devenv::tests::rewrites_apply_in_map_order_to_every_occurrence159 PASS [ 0.018s] ( 140/1042) iets display::tests::a_resize_burst_never_erases160 PASS [ 0.039s] ( 141/1042) iets devenv::tests::rc_script_rewrites_outputs_and_writes_attrs161 PASS [ 0.020s] ( 142/1042) iets display::tests::a_resize_keeps_one_region162 PASS [ 0.019s] ( 143/1042) iets display::tests::output_scrolls_and_the_region_stays_at_the_bottom163 PASS [ 0.020s] ( 144/1042) iets display::tests::a_region_taller_than_the_screen_is_clamped164 PASS [ 0.026s] ( 145/1042) iets display::tests::a_full_width_line_keeps_its_last_column165 PASS [ 0.034s] ( 146/1042) iets display::tests::a_region_that_grows_and_shrinks_loses_no_output166 PASS [ 0.037s] ( 147/1042) iets display::tests::a_frame_is_one_synchronized_write167 PASS [ 0.026s] ( 148/1042) iets display::tests::the_region_keeps_its_rows_until_a_smaller_size_lasts168 PASS [ 0.031s] ( 149/1042) iets display::tests::the_region_comes_down_on_close169 PASS [ 0.032s] ( 150/1042) iets display::tests::output_starts_at_the_origin170 PASS [ 0.036s] ( 151/1042) iets display::tests::wrapped_output_does_not_corrupt_the_region171 PASS [ 0.291s] ( 152/1042) iets builtins::text::regex::tests::long_inputs_do_not_recurse172 PASS [ 0.639s] ( 153/1042) iets eval::tests::a_function_select_is_a_fresh_slot_when_its_subject_is_forced173 PASS [ 0.929s] ( 154/1042) iets api::value::tests::thunk_reads_as_thunk174 PASS [ 0.855s] ( 155/1042) iets compile::cache::tests::nesting_past_the_cap_misses175 PASS [ 0.947s] ( 156/1042) iets api::value::tests::attrs_by_name_and_index176 PASS [ 0.954s] ( 157/1042) iets api::value::tests::force_deep_forces_the_whole_tree177 PASS [ 0.936s] ( 158/1042) iets builtins::fetch::tests::the_mark_follows_the_string_like_store_context178 PASS [ 1.121s] ( 159/1042) iets api::value::tests::apply_is_lazy179 PASS [ 0.957s] ( 160/1042) iets eval::tests::a_second_pseudo_file_keeps_its_own_positions180 PASS [ 1.207s] ( 161/1042) iets builtins::store_hooks::tests::virtual_tree_reads_go_to_the_local_files181 PASS [ 0.018s] ( 162/1042) iets fetch::http::tests::credentials_in_the_url_are_sent_and_never_printed182 PASS [ 1.269s] ( 163/1042) iets api::value::tests::lists183 PASS [ 1.097s] ( 164/1042) iets eval::tests::fetch_mercurial_names_a_way_out184 PASS [ 0.008s] ( 165/1042) iets fetch::http::tests::file_urls_name_a_local_path185 PASS [ 0.030s] ( 166/1042) iets fetch::http::tests::credentials_stay_on_the_first_origin186 PASS [ 0.010s] ( 167/1042) iets fetch::http::tests::magic_bytes187 PASS [ 0.009s] ( 168/1042) iets fetch::http::tests::redirects_keep_credentials_only_on_the_same_origin188 PASS [ 0.014s] ( 169/1042) iets fetch::http::tests::redirects_resolve189 PASS [ 0.016s] ( 170/1042) iets fetch::http::tests::trailing_bytes_and_a_second_layer190 PASS [ 0.006s] ( 171/1042) iets fetch::http::tests::urls_split191 PASS [ 0.013s] ( 172/1042) iets fetch::roots::tests::an_empty_nix_ssl_cert_file_hides_ssl_cert_file192 PASS [ 0.019s] ( 173/1042) iets fetch::roots::tests::a_named_file_that_is_missing_or_empty_is_an_error193 PASS [ 0.013s] ( 174/1042) iets fetch::roots::tests::nix_ssl_cert_file_wins_over_ssl_cert_file_and_the_platform194 PASS [ 0.012s] ( 175/1042) iets fetch::roots::tests::no_bundle_anywhere_gives_the_compiled_in_set195 PASS [ 1.327s] ( 176/1042) iets builtins::fetch::tests::an_entry_of_the_compiled_file_cache_keeps_the_site196 PASS [ 0.013s] ( 177/1042) iets fetch::roots::tests::the_platform_store_wins_over_the_compiled_in_set197 PASS [ 0.007s] ( 178/1042) iets fetch::spool::tests::a_sparse_member_counts_against_the_size_limit198 PASS [ 1.342s] ( 179/1042) iets builtins::fetch::tests::nix_sees_no_mark199 PASS [ 0.023s] ( 180/1042) iets fetch::spool::tests::a_changed_index_byte_is_a_miss200 PASS [ 1.376s] ( 181/1042) iets api::run::tests::a_fiber_template_carries_the_configuration201 PASS [ 0.015s] ( 182/1042) iets fetch::spool::tests::an_empty_archive_is_an_empty_directory202 PASS [ 0.110s] ( 183/1042) iets fetch::http::tests::downloads_stop_at_the_size_limit203 PASS [ 0.023s] ( 184/1042) iets fetch::spool::tests::a_stored_tree_dumps_the_spools_nar204 PASS [ 0.033s] ( 185/1042) iets fetch::spool::tests::archives_the_git_sink_accepts205 PASS [ 0.027s] ( 186/1042) iets fetch::spool::tests::pax_sparse_members_are_expanded206 PASS [ 0.030s] ( 187/1042) iets fetch::spool::tests::nar_hash_of_the_fixture207 PASS [ 0.023s] ( 188/1042) iets fetch::spool::tests::spool_matches_the_tree_on_the_top_level208 PASS [ 0.015s] ( 189/1042) iets fetch::spool::tests::the_scratch_file_never_follows_a_symlink209 PASS [ 0.020s] ( 190/1042) iets fetch::spool::tests::the_errors_match210 PASS [ 0.019s] ( 191/1042) iets fetch::unpack::tests::a_repeated_member_keeps_the_last_copy211 PASS [ 0.022s] ( 192/1042) iets fetch::unpack::tests::an_unsupported_member_type_is_an_error212 PASS [ 0.020s] ( 193/1042) iets fetch::unpack::tests::member_names_are_made_relative_and_cannot_escape213 PASS [ 0.021s] ( 194/1042) iets fetch::unpack::tests::keeps_the_root_when_it_is_not_a_single_directory214 PASS [ 0.016s] ( 195/1042) iets fetch::unpack::tests::nar_hash_of_the_fixture215 PASS [ 0.010s] ( 196/1042) iets flake::flakeref::tests::errors_and_unsupported216 PASS [ 0.013s] ( 197/1042) iets flake::flakeref::tests::git_urls_are_fixed_like_nix217 PASS [ 0.017s] ( 198/1042) iets fetch::unpack::tests::strips_one_leading_component218 PASS [ 0.009s] ( 199/1042) iets flake::flakeref::tests::parses_the_kept_schemes219 PASS [ 0.021s] ( 200/1042) iets flake::flakeref::tests::refuses_a_github_ref_named_twice220 PASS [ 0.021s] ( 201/1042) iets flake::flakeref::tests::round_trips221 PASS [ 0.020s] ( 202/1042) iets flake::flakeref::tests::to_string_from_attrs222 PASS [ 0.011s] ( 203/1042) iets flake::tests::a_pinned_checkout_is_its_revision223 PASS [ 0.014s] ( 204/1042) iets flake::tests::refs_resolve_against_cwd_and_home224 PASS [ 0.019s] ( 205/1042) iets flake::tests::attr_paths225 PASS [ 0.158s] ( 206/1042) iets fetch::spool::tests::a_hard_link_never_replaces_a_member226 PASS [ 0.008s] ( 207/1042) iets jobs::line::tests::split_and_round_trip227 PASS [ 0.020s] ( 208/1042) iets jobs::constituents::tests::topo_sort_orders_and_detects_cycles228 PASS [ 0.029s] ( 209/1042) iets jobs::line::tests::error_line_round_trip229 PASS [ 1.530s] ( 210/1042) iets api::value::tests::missing_attribute230 PASS [ 0.016s] ( 211/1042) iets jobs::line::tests::stats_survive_the_collector231 PASS [ 0.041s] ( 212/1042) iets jobs::constituents::tests::fnmatch_basics232 PASS [ 1.535s] ( 213/1042) iets api::value::tests::construction233 PASS [ 0.011s] ( 214/1042) iets lint::allow::tests::comment_names234 PASS [ 0.008s] ( 215/1042) iets lint::allow::tests::lines235 PASS [ 0.013s] ( 216/1042) iets lint::cases::a_project_file_may_not_set_nix_bin_dir236 PASS [ 1.554s] ( 217/1042) iets api::value::tests::calling_a_function237 PASS [ 0.179s] ( 218/1042) iets fetch::spool::tests::spool_matches_the_tree238 PASS [ 0.134s] ( 219/1042) iets fetch::unpack::tests::modes_symlinks_and_empty_dirs239 PASS [ 1.561s] ( 220/1042) iets api::value::tests::wrong_type_is_an_error240 PASS [ 1.494s] ( 221/1042) iets compile::cache::tests::a_malformed_entry_is_a_miss_and_never_a_crash241 PASS [ 1.438s] ( 222/1042) iets eval::tests::an_invalid_regex_fails_before_the_string_is_forced242 PASS [ 0.795s] ( 223/1042) iets fetch::http::tests::a_transient_status_is_retried243 PASS [ 1.781s] ( 224/1042) iets eval::tests::derivation_wrapper_exists244 PASS [ 1.970s] ( 225/1042) iets compile::cache::tests::a_changed_byte_of_a_stored_entry_is_a_miss245 PASS [ 1.028s] ( 226/1042) iets fetch::http::tests::a_stalled_download_fails246 PASS [ 1.441s] ( 227/1042) iets fetch::http::tests::a_decompression_bomb_is_refused247 PASS [ 2.274s] ( 228/1042) iets eval::tests::from_json_and_toml_reject_null_bytes248 PASS [ 2.393s] ( 229/1042) iets cli::run::tests::eval_prints_its_value249 PASS [ 0.015s] ( 230/1042) iets lint::cli_cases::an_unknown_lint_name_in_a_flag_is_a_usage_error250 PASS [ 1.068s] ( 231/1042) iets lint::cases::an_unknown_name_in_iets_lint_is_a_warning_and_the_rest_counts251 PASS [ 2.439s] ( 232/1042) iets eval::tests::derivation_keeps_env_and_args_that_are_not_utf8252 PASS [ 0.019s] ( 233/1042) iets lint::cli_cases::lint_list_shows_the_effective_levels_and_the_scope253 PASS [ 1.116s] ( 234/1042) iets jobs::tests::a_numeric_name_selects_an_attribute_under_a_set254 PASS [ 1.231s] ( 235/1042) iets lint::cases::one_warning_per_site255 PASS [ 2.725s] ( 236/1042) iets cli::run::tests::the_hosts_environment_reaches_the_lint_configuration256 PASS [ 2.806s] ( 237/1042) iets eval::tests::arithmetic_and_strings257 PASS [ 3.165s] ( 238/1042) iets api::run::tests::the_counters_cover_the_helper_fibers258 PASS [ 2.264s] ( 239/1042) iets eval::tests::sets_compare_in_the_symbol_order_of_nix259 PASS [ 1.700s] ( 240/1042) iets lint::cases::an_unknown_name_in_iets_toml_is_a_warning_and_the_rest_counts260 PASS [ 3.252s] ( 241/1042) iets compile::cache::tests::a_changed_byte_never_makes_the_evaluator_read_past_its_env261 PASS [ 1.851s] ( 242/1042) iets lint::cases::a_later_flag_wins_over_all_and_a_name_beats_a_later_all262 PASS [ 2.560s] ( 243/1042) iets eval::tests::update_forces_the_right_operand_first263 PASS [ 3.525s] ( 244/1042) iets api::value::tests::strings_and_context264 PASS [ 1.994s] ( 245/1042) iets lint::cases::a_family_selector_selects_its_members265 PASS [ 0.015s] ( 246/1042) iets lint::site::tests::a_literal_lint_of_nix_has_an_edit266 PASS [ 0.009s] ( 247/1042) iets lint::tests::an_unknown_name_is_a_warning_in_a_file_and_an_error_in_a_flag267 PASS [ 0.011s] ( 248/1042) iets lint::tests::keys268 PASS [ 0.007s] ( 249/1042) iets lint::tests::names_are_unique_kebab_case269 PASS [ 0.008s] ( 250/1042) iets lint::tests::scope_and_inputs270 PASS [ 0.008s] ( 251/1042) iets lint::tests::selectors_and_order271 PASS [ 0.006s] ( 252/1042) iets lint::tests::specificity_inside_a_source_and_order_between_sources272 PASS [ 3.372s] ( 253/1042) iets eval::tests::fetchurl_needs_a_sha256_in_every_mode273 PASS [ 0.006s] ( 254/1042) iets lint::tests::toml_table274 PASS [ 0.012s] ( 255/1042) iets lint::tests::the_project_file_walk_stops_at_the_project_root275 PASS [ 0.006s] ( 256/1042) iets log::tests::a_fixed_hash_has_the_shape_of_a_finding_with_an_edit276 PASS [ 0.007s] ( 257/1042) iets log::tests::a_forged_mismatch_is_dropped277 PASS [ 0.007s] ( 258/1042) iets log::tests::a_half_line_waits_for_its_newline278 PASS [ 0.049s] ( 259/1042) iets lint::site::tests::the_span_is_the_innermost_node_of_the_kind_of_the_lint279 PASS [ 0.018s] ( 260/1042) iets log::tests::a_coloured_error_is_an_error_record280 PASS [ 0.017s] ( 261/1042) iets log::tests::a_hash_mismatch_names_the_hash_it_got281 PASS [ 0.015s] ( 262/1042) iets log::tests::a_mismatch_reason_keeps_both_hashes282 PASS [ 0.014s] ( 263/1042) iets log::tests::a_pause_takes_the_view_down_for_a_prompt283 PASS [ 0.014s] ( 264/1042) iets log::tests::a_region_stays_under_the_output_that_scrolls_above_it284 PASS [ 0.014s] ( 265/1042) iets log::tests::a_resolved_copy_reports_its_mismatch_as_a_line285 PASS [ 0.014s] ( 266/1042) iets log::tests::activity_records_are_nix_json_logger_records286 PASS [ 0.016s] ( 267/1042) iets log::tests::a_resize_redraws_the_region_once287 PASS [ 0.021s] ( 268/1042) iets log::tests::a_session_id_is_a_uuid_v7288 PASS [ 0.013s] ( 269/1042) iets log::tests::escapes_are_filtered_the_way_nix_filters_them289 PASS [ 0.013s] ( 270/1042) iets log::tests::exit_status_flags_combine_like_nix290 PASS [ 0.015s] ( 271/1042) iets log::tests::ansi_stripping291 PASS [ 0.010s] ( 272/1042) iets log::tests::lint_warning_is_a_level_1_record292 PASS [ 0.008s] ( 273/1042) iets log::tests::record_is_nix_log_ei_plus_code_and_hint293 PASS [ 0.014s] ( 274/1042) iets log::tests::record_without_position294 PASS [ 0.014s] ( 275/1042) iets log::tests::text_shows_the_hint_of_an_unsupported_error295 PASS [ 0.007s] ( 276/1042) iets log::tests::without_a_terminal_output_is_plain296 PASS [ 3.438s] ( 277/1042) iets eval::tests::nix_eq_forces_what_the_shortcut_skips297 PASS [ 0.018s] ( 278/1042) iets log::tests::the_status_line_goes_under_the_region298 PASS [ 0.014s] ( 279/1042) iets nixbin::tests::every_iets_build_is_skipped299 PASS [ 0.017s] ( 280/1042) iets parallel::deque::tests::lifo_owner_fifo_thief300 PASS [ 0.019s] ( 281/1042) iets nixbin::tests::farm_marker_is_found_through_two_hops301 PASS [ 0.027s] ( 282/1042) iets parallel::fiber::tests::reservation_is_capped_and_mmap_failure_is_an_error302 PASS [ 0.032s] ( 283/1042) iets parallel::fiber::tests::migrates_between_threads303 PASS [ 0.016s] ( 284/1042) iets parallel::fiber::tests::resume_yield_finish304 PASS [ 0.071s] ( 285/1042) iets parallel::deque::tests::concurrent_sum305 PASS [ 0.060s] ( 286/1042) iets parallel::fiber::tests::large_stack_use_and_release306 PASS [ 0.016s] ( 287/1042) iets parallel::interner::tests::empty_name_misses_the_cache_sentinel307 PASS [ 0.072s] ( 288/1042) iets parallel::fiber::tests::a_freed_stack_frees_its_guard_entry308 PASS [ 0.006s] ( 289/1042) iets parallel::sched::tests::a_task_survives_packing_past_the_old_24_bit_start309 PASS [ 0.010s] ( 290/1042) iets parallel::sched::tests::park_and_wake_across_workers310 PASS [ 0.024s] ( 291/1042) iets parallel::interner::tests::intern_is_stable_and_shared311 PASS [ 0.019s] ( 292/1042) iets parallel::sched::tests::main_parks_and_is_woken_by_helper312 PASS [ 0.030s] ( 293/1042) iets parallel::sched::tests::fan_out_from_main313 PASS [ 0.033s] ( 294/1042) iets parallel::thunk::tests::deadlocked_fibers_are_cancelled314 PASS [ 0.031s] ( 295/1042) iets print::tests::float_formatting_edge_cases315 PASS [ 0.083s] ( 296/1042) iets parallel::interner::tests::concurrent_intern_agrees316 PASS [ 0.008s] ( 297/1042) iets profile::tests::a_weight_is_bytes_when_the_profile_asks_for_them317 PASS [ 0.020s] ( 298/1042) iets profile::tests::a_frame_keeps_its_call_site_and_its_name318 PASS [ 0.036s] ( 299/1042) iets profile::tests::a_deep_stack_is_capped319 PASS [ 0.009s] ( 300/1042) iets profile::tests::an_unwind_returns_to_a_depth320 PASS [ 0.008s] ( 301/1042) iets progress::tests::a_download_inside_a_copy_is_part_of_the_copy321 PASS [ 0.026s] ( 302/1042) iets profile::tests::a_sample_is_taken_once_per_tick322 PASS [ 0.011s] ( 303/1042) iets progress::tests::a_hidden_board_draws_nothing323 PASS [ 1.306s] ( 304/1042) iets lint::cli_cases::an_unknown_name_in_iets_lint_is_a_record324 PASS [ 0.008s] ( 305/1042) iets progress::tests::a_log_hears_of_a_task_after_first_and_then_every_heartbeat325 PASS [ 0.007s] ( 306/1042) iets progress::tests::several_of_a_kind_are_counted326 PASS [ 0.010s] ( 307/1042) iets progress::tests::a_transfer_that_does_not_move_says_so327 PASS [ 0.009s] ( 308/1042) iets progress::tests::store_hashes_are_left_out328 PASS [ 0.010s] ( 309/1042) iets project::tests::a_config_file_never_shrinks_the_root329 PASS [ 0.008s] ( 310/1042) iets project::tests::a_working_tree_wins_over_a_file_marker_below_it330 PASS [ 0.007s] ( 311/1042) iets project::tests::the_nearest_flake_wins_without_a_working_tree331 PASS [ 0.007s] ( 312/1042) iets project::tests::each_marker_is_a_root332 PASS [ 0.006s] ( 313/1042) iets provenance::tests::a_path_followed_by_a_colour_escape_still_matches333 PASS [ 0.006s] ( 314/1042) iets provenance::tests::a_shared_position_is_left_off_the_started_line_only334 PASS [ 0.007s] ( 315/1042) iets provenance::tests::an_input_file_is_labelled_by_its_lock_node335 PASS [ 0.007s] ( 316/1042) iets provenance::tests::failed_line_names_the_attribute_and_the_position336 PASS [ 0.008s] ( 317/1042) iets provenance::tests::a_tree_copied_from_a_store_tree_resolves_to_the_local_one337 PASS [ 0.007s] ( 318/1042) iets provenance::tests::locate_takes_the_longest_prefix338 PASS [ 0.007s] ( 319/1042) iets provenance::tests::locate_without_a_match_is_none339 PASS [ 0.007s] ( 320/1042) iets provenance::tests::rewrite_replaces_every_known_path_in_a_line340 PASS [ 0.006s] ( 321/1042) iets remote::grpc::backend::tests::a_built_root_asks_nothing_below_it341 PASS [ 0.006s] ( 322/1042) iets remote::grpc::backend::tests::a_cold_store_is_asked_the_rest_in_one_call342 PASS [ 0.005s] ( 323/1042) iets remote::grpc::build::tests::a_local_upload_failure_beats_the_stream_ended_status343 PASS [ 0.009s] ( 324/1042) iets remote::grpc::backend::tests::an_input_below_a_built_one_is_not_built344 PASS [ 2.219s] ( 325/1042) iets lint::cases::the_user_iets_toml_sets_a_level_and_the_project_file_wins_over_it345 PASS [ 0.017s] ( 326/1042) iets remote::grpc::backend::tests::a_built_input_stops_the_walk346 PASS [ 0.010s] ( 327/1042) iets remote::grpc::build::tests::a_self_reference_does_not_loop347 PASS [ 0.007s] ( 328/1042) iets remote::grpc::build::tests::reschedules_back_off_past_a_dead_worker348 PASS [ 0.027s] ( 329/1042) iets provenance::tests::rewrite_leaves_unknown_text_alone349 PASS [ 0.009s] ( 330/1042) iets remote::grpc::build::tests::topo_sort_puts_references_first350 PASS [ 0.011s] ( 331/1042) iets remote::grpc::build::tests::the_timings_report_with_every_line351 PASS [ 0.007s] ( 332/1042) iets remote::grpc::drvwire::tests::a_failure_keeps_its_message352 PASS [ 0.015s] ( 333/1042) iets remote::grpc::build::tests::required_features_come_from_the_env_or_structured_attrs353 PASS [ 0.008s] ( 334/1042) iets remote::grpc::health::tests::a_passed_cooldown_lets_one_caller_through354 PASS [ 0.011s] ( 335/1042) iets remote::grpc::drvwire::tests::build_result_round_trips_a_daemon_reply355 PASS [ 0.013s] ( 336/1042) iets remote::grpc::drvwire::tests::basic_derivation_matches_the_cxx_field_order356 PASS [ 0.018s] ( 337/1042) iets remote::grpc::drvwire::tests::an_unresolvable_input_output_is_an_error357 PASS [ 0.014s] ( 338/1042) iets remote::grpc::health::tests::a_completed_build_clears_the_history358 PASS [ 0.014s] ( 339/1042) iets remote::grpc::drvwire::tests::path_info_round_trips359 PASS [ 0.013s] ( 340/1042) iets remote::grpc::health::tests::one_address_does_not_refuse_another360 PASS [ 3.666s] ( 341/1042) iets eval::tests::laziness_and_recursion361 PASS [ 0.017s] ( 342/1042) iets remote::grpc::tests::a_token_needs_tls_and_unknown_parameters_are_errors362 PASS [ 0.017s] ( 343/1042) iets remote::grpc::health::tests::two_bounces_refuse_it363 PASS [ 0.019s] ( 344/1042) iets remote::grpc::health::tests::one_bounce_does_not_refuse_an_address364 PASS [ 0.022s] ( 345/1042) iets remote::grpc::health::tests::an_unknown_address_is_usable365 PASS [ 0.012s] ( 346/1042) iets remote::grpc::tests::every_parameter_parses366 PASS [ 0.022s] ( 347/1042) iets remote::grpc::health::tests::the_cooldown_grows_and_stops_at_30s367 PASS [ 0.012s] ( 348/1042) iets remote::grpc::tests::defaults_match_the_cxx_settings368 PASS [ 0.009s] ( 349/1042) iets remote::plan::tests::a_held_root_answers_for_its_closure369 PASS [ 0.015s] ( 350/1042) iets remote::grpc::tests::percent_escapes_decode_in_values370 PASS [ 0.015s] ( 351/1042) iets remote::grpc::tests::insecure_is_a_bare_flag_or_a_boolean371 PASS [ 0.014s] ( 352/1042) iets remote::plan::tests::a_cold_store_is_asked_the_rest_in_one_call372 PASS [ 0.015s] ( 353/1042) iets remote::grpc::tests::mtls_needs_both_halves373 PASS [ 0.010s] ( 354/1042) iets remote::plan::tests::a_held_input_answers_for_its_closure374 PASS [ 0.010s] ( 355/1042) iets remote::plan::tests::an_answered_root_is_not_asked_again375 PASS [ 0.016s] ( 356/1042) iets remote::plan::tests::memory_source_matches_dump_string376 PASS [ 0.016s] ( 357/1042) iets remote::worker::tests::an_ssh_host_is_never_an_option377 PASS [ 0.020s] ( 358/1042) iets remote::worker::tests::nix_sshopts_split_like_a_shell378 PASS [ 0.020s] ( 359/1042) iets remote::worker::tests::a_status_over_a_byte_is_not_a_success379 PASS [ 0.020s] ( 360/1042) iets remote::worker::counts_tests::each_change_is_a_verdict_in_order380 PASS [ 0.017s] ( 361/1042) iets remote::worker::tests::ssh_argv_puts_the_host_first381 PASS [ 0.016s] ( 362/1042) iets remote::worker::wire::tests::framed_sink_frames_and_terminates382 PASS [ 0.021s] ( 363/1042) iets remote::worker::tests::transport_from_url383 PASS [ 0.018s] ( 364/1042) iets remote::worker::wire::tests::build_results_are_read_as_nix_reads_them384 PASS [ 0.018s] ( 365/1042) iets remote::worker::wire::tests::replies_are_read_as_nix_reads_them385 PASS [ 0.039s] ( 366/1042) iets remote::plan::tests::hash_source_matches_nar_hash386 PASS [ 0.043s] ( 367/1042) iets remote::worker::counts_tests::a_repeated_update_claims_nothing387 PASS [ 0.010s] ( 368/1042) iets runtime::heap::tests::release_tombstones_every_chunk388 PASS [ 0.021s] ( 369/1042) iets remote::worker::wire::tests::strings_are_padded389 PASS [ 0.015s] ( 370/1042) iets runtime::value::layout::a_primop_pays_nothing_for_its_symbol390 PASS [ 0.025s] ( 371/1042) iets runtime::value::alloc_tests::a_list_too_long_to_address_has_no_size391 PASS [ 1.912s] ( 372/1042) iets lint::cli_cases::a_finding_record_has_the_span_and_the_edit_on_a_cache_hit_too392 PASS [ 3.028s] ( 373/1042) iets eval::tests::try_eval_and_errors393 PASS [ 2.065s] ( 374/1042) iets lint::cases::try_eval_does_not_catch_a_lint_error394 PASS [ 0.011s] ( 375/1042) iets session::tests::two_sessions_share_no_state395 PASS [ 2.043s] ( 376/1042) iets lint::cli_cases::a_finding_at_error_has_the_span_and_no_edit396 PASS [ 0.015s] ( 377/1042) iets settings::tests::a_missing_file_is_skipped_and_the_defaults_hold397 PASS [ 0.017s] ( 378/1042) iets settings::tests::a_flag_carries_several_places_separated_by_a_semicolon398 PASS [ 0.014s] ( 379/1042) iets settings::tests::a_settings_file_may_hold_lint_and_the_other_sources_may_not399 PASS [ 0.019s] ( 380/1042) iets settings::tests::a_project_file_holds_lint_and_nothing_else400 PASS [ 0.018s] ( 381/1042) iets settings::tests::a_wrong_type_names_the_key_and_the_file401 PASS [ 0.020s] ( 382/1042) iets settings::tests::each_source_wins_over_the_one_before402 PASS [ 0.020s] ( 383/1042) iets settings::tests::source_map_adds_up_and_every_other_key_replaces403 PASS [ 0.025s] ( 384/1042) iets settings::tests::builder_reads_all_three_forms404 PASS [ 0.016s] ( 385/1042) iets settings::tests::the_environment_wins_over_the_file405 PASS [ 0.015s] ( 386/1042) iets settings::tests::the_file_is_the_users406 PASS [ 0.015s] ( 387/1042) iets settings::tests::the_flag_leaves_the_argv407 PASS [ 0.022s] ( 388/1042) iets settings::tests::the_flag_pairs_are_kept_for_a_second_iets408 PASS [ 0.020s] ( 389/1042) iets settings::tests::the_flag_value_is_toml_when_it_reads_as_toml409 PASS [ 0.029s] ( 390/1042) iets settings::tests::the_user_file_turns_purity_off410 PASS [ 0.018s] ( 391/1042) iets settings::tests::unknown_key_names_the_file411 PASS [ 0.020s] ( 392/1042) iets source::local::tests::accepted_set_adds_parent_directories412 PASS [ 4.085s] ( 393/1042) iets builtins::fetch::tests::a_read_that_is_not_a_selection_has_no_site413 PASS [ 0.028s] ( 394/1042) iets source::local::tests::max_mtime_covers_root_and_children414 PASS [ 0.027s] ( 395/1042) iets source::local::tests::only_a_content_addressed_store_path_names_its_content415 PASS [ 1.977s] ( 396/1042) iets lint::cli_cases::a_warning_is_replayed_on_a_cache_hit416 PASS [ 0.029s] ( 397/1042) iets source::lock::tests::complete_lock_passes417 PASS [ 0.022s] ( 398/1042) iets source::lock::tests::declared_inputs_must_match_the_lock418 PASS [ 0.020s] ( 399/1042) iets source::lock::tests::empty_lock_has_no_inputs419 PASS [ 0.012s] ( 400/1042) iets source::remote::tests::a_leftover_is_not_a_valid_path420 PASS [ 0.012s] ( 401/1042) iets source::remote::tests::access_tokens_match_the_longest_prefix421 PASS [ 0.017s] ( 402/1042) iets source::lock::tests::incomplete_locks_fail422 PASS [ 0.010s] ( 403/1042) iets source::remote::tests::download_urls_match_the_fetchers423 PASS [ 0.006s] ( 404/1042) iets source::remote::tests::only_the_archive_types_are_fetched_by_iets424 PASS [ 0.015s] ( 405/1042) iets source::remote::tests::nix_literal_escapes425 PASS [ 0.027s] ( 406/1042) iets source::scm::git::tests::a_directory_in_a_repository_is_found426 PASS [ 0.028s] ( 407/1042) iets source::scm::ledger::tests::a_directory_in_a_working_tree_is_found427 PASS [ 4.075s] ( 408/1042) iets eval::tests::equality428 PASS [ 0.550s] ( 409/1042) iets parallel::thunk::tests::many_fibers_force_one_shared_graph429 PASS [ 0.006s] ( 410/1042) iets source::tests::dates430 PASS [ 0.007s] ( 411/1042) iets store::drv::tests::a_dynamic_input_writes_the_versioned_aterm_and_parses_back431 PASS [ 0.006s] ( 412/1042) iets store::drv::tests::an_env_key_named_json_is_refused432 PASS [ 0.035s] ( 413/1042) iets store::drv::tests::find_escape_finds_the_first_byte_to_escape433 PASS [ 0.016s] ( 414/1042) iets store::drv::tests::fixed_output_from_scratch434 PASS [ 0.428s] ( 415/1042) iets runtime::value::alloc_tests::a_speculated_thunk_is_forced_but_not_demanded435 PASS [ 0.417s] ( 416/1042) iets runtime::value::tests::union_lookup_agrees_with_iteration436 PASS [ 0.198s] ( 417/1042) iets source::scm::ledger::tests::the_count_is_lazy_and_kept_by_revision437 PASS [ 0.026s] ( 418/1042) iets store::drv::tests::fixtures_drv_path_matches_store_path438 PASS [ 0.030s] ( 419/1042) iets store::drv::tests::fixtures_output_paths_recompute439 PASS [ 0.032s] ( 420/1042) iets store::drv::tests::fixtures_roundtrip_byte_exact440 PASS [ 0.024s] ( 421/1042) iets store::drv::tests::input_addressed_multi_output_from_scratch441 PASS [ 0.012s] ( 422/1042) iets store::drv::tests::input_drvs_hash_modulo_from_scratch442 PASS [ 0.010s] ( 423/1042) iets store::drv::tests::masked_unparse_blanks_output_paths_and_env443 PASS [ 0.016s] ( 424/1042) iets store::drvdiff::tests::a_changed_input_drv_is_paired_by_name_and_recursed_into444 PASS [ 0.013s] ( 425/1042) iets store::drvdiff::tests::an_input_source_an_added_input_drv_and_a_fixed_output_show_up445 PASS [ 0.021s] ( 426/1042) iets store::drv::tests::string_escapes_roundtrip446 PASS [ 0.018s] ( 427/1042) iets store::drvdiff::tests::the_depth_limit_names_the_input_without_walking_it447 PASS [ 0.039s] ( 428/1042) iets store::drv::tests::the_escaped_tail_unparses_as_a_full_unparse448 PASS [ 0.026s] ( 429/1042) iets store::drvdiff::tests::env_name_shows_only_when_it_is_not_the_derivation_name449 PASS [ 0.026s] ( 430/1042) iets store::drvdiff::tests::json_names_what_differs450 PASS [ 0.015s] ( 431/1042) iets store::drvdiff::tests::the_same_derivation_is_empty451 PASS [ 0.017s] ( 432/1042) iets store::drvdiff::tests::the_local_fields_the_env_and_an_absent_value452 PASS [ 0.022s] ( 433/1042) iets store::hash::tests::base64_roundtrip453 PASS [ 0.011s] ( 434/1042) iets store::hash::tests::empty_sha256454 PASS [ 0.024s] ( 435/1042) iets store::hash::tests::compress_hash_xors455 PASS [ 0.021s] ( 436/1042) iets store::hash::tests::md5_nix32456 PASS [ 0.017s] ( 437/1042) iets store::hash::tests::parse_any_all_formats457 PASS [ 0.325s] ( 438/1042) iets source::scm::ledger::tests::an_untracked_file_is_the_error_of_nix458 PASS [ 0.022s] ( 439/1042) iets store::hash::tests::sha1_nix32459 PASS [ 0.014s] ( 440/1042) iets store::hash::tests::sha256_nix32460 PASS [ 0.030s] ( 441/1042) iets store::hash::tests::nix32_roundtrip_and_reject461 PASS [ 0.021s] ( 442/1042) iets store::hash::tests::sha256_sri462 PASS [ 0.021s] ( 443/1042) iets store::hash::tests::sha512_nix32_base64463 PASS [ 0.017s] ( 444/1042) iets store::nar::tests::directory_nar_hash_formats464 PASS [ 0.021s] ( 445/1042) iets store::hash::tests::streaming_matches_oneshot465 PASS [ 0.025s] ( 446/1042) iets store::nar::tests::directory_nar466 PASS [ 0.019s] ( 447/1042) iets store::nar::tests::directory_nar_with_an_executable467 PASS [ 0.014s] ( 448/1042) iets store::nar::tests::readers_refuse_what_nix_refuses468 PASS [ 0.018s] ( 449/1042) iets store::nar::tests::executable_file_nar469 PASS [ 4.337s] ( 450/1042) iets eval::tests::fetchurl_checks_its_argument_like_nix470 PASS [ 0.017s] ( 451/1042) iets store::nar::tests::regular_file_nar471 PASS [ 0.021s] ( 452/1042) iets store::nar::tests::filter_sees_types_and_paths472 PASS [ 0.017s] ( 453/1042) iets store::nar::tests::script_nar473 PASS [ 0.017s] ( 454/1042) iets store::nar::tests::restore_roundtrip474 PASS [ 0.020s] ( 455/1042) iets store::nar::tests::restore_rejects_garbage475 PASS [ 0.013s] ( 456/1042) iets store::path::tests::a_multibyte_char_across_the_hash_part_is_an_error476 PASS [ 0.014s] ( 457/1042) iets store::nar::tests::symlink_nar477 PASS [ 0.016s] ( 458/1042) iets store::path::tests::an_override_is_absolute_and_has_no_trailing_separator478 PASS [ 0.007s] ( 459/1042) iets store::path::tests::filter_source479 PASS [ 0.013s] ( 460/1042) iets store::path::tests::check_name_rules480 PASS [ 0.008s] ( 461/1042) iets store::path::tests::parse_and_accessors481 PASS [ 0.015s] ( 462/1042) iets store::path::tests::fixed_flat_sha1482 PASS [ 0.014s] ( 463/1042) iets store::path::tests::fixed_flat_sha256483 PASS [ 0.014s] ( 464/1042) iets store::path::tests::fixed_recursive_sha256484 PASS [ 0.026s] ( 465/1042) iets store::path::tests::output_names485 PASS [ 0.016s] ( 466/1042) iets store::path::tests::path_with_name486 PASS [ 0.019s] ( 467/1042) iets store::path::tests::path_copy_directory487 PASS [ 0.016s] ( 468/1042) iets store::path::tests::path_copy_file488 PASS [ 0.015s] ( 469/1042) iets store::path::tests::the_directory_is_found_as_a_string_and_as_a_path489 PASS [ 0.020s] ( 470/1042) iets store::path::tests::placeholder490 PASS [ 0.017s] ( 471/1042) iets store::path::tests::to_file_with_reference491 PASS [ 0.015s] ( 472/1042) iets syntax::tests::allow_comments492 PASS [ 0.017s] ( 473/1042) iets store::path::tests::to_file493 PASS [ 0.020s] ( 474/1042) iets store::path::tests::the_host_picks_the_store_directory494 PASS [ 0.021s] ( 475/1042) iets syntax::tests::a_line_ends_at_cr_lf_and_lone_cr495 PASS [ 0.019s] ( 476/1042) iets syntax::tests::an_interpolated_name_is_static_when_nix_has_one_string_node496 PASS [ 0.016s] ( 477/1042) iets syntax::tests::indented_string_stripping497 PASS [ 0.019s] ( 478/1042) iets syntax::tests::end_of_file_inside_a_path_is_at_its_last_token498 PASS [ 0.020s] ( 479/1042) iets syntax::tests::comments_and_misc499 PASS [ 0.023s] ( 480/1042) iets syntax::tests::attrs_and_bindings500 PASS [ 0.020s] ( 481/1042) iets syntax::tests::json_gives_every_node_its_kind_and_span501 PASS [ 0.020s] ( 482/1042) iets syntax::tests::lambdas502 PASS [ 0.020s] ( 483/1042) iets syntax::tests::line_col_counts_bytes503 PASS [ 0.019s] ( 484/1042) iets syntax::tests::nul_in_string_literals504 PASS [ 0.021s] ( 485/1042) iets syntax::tests::numbers505 PASS [ 0.010s] ( 486/1042) iets syntax::tests::paths506 PASS [ 0.019s] ( 487/1042) iets syntax::tests::spans_cover_tokens507 PASS [ 0.012s] ( 488/1042) iets syntax::tests::string_escapes_and_interpolation508 PASS [ 0.011s] ( 489/1042) iets syntax::tests::the_error_reported_is_the_one_nix_meets_first509 PASS [ 0.023s] ( 490/1042) iets syntax::tests::operator_precedence510 PASS [ 0.010s] ( 491/1042) iets sys::winpath::tests::a_relative_name_that_starts_with_unc_is_not_a_share511 PASS [ 0.012s] ( 492/1042) iets sys::winpath::tests::a_bare_drive_is_not_its_root512 PASS [ 0.012s] ( 493/1042) iets sys::winpath::tests::a_leading_double_slash_is_not_a_share513 PASS [ 0.006s] ( 494/1042) iets sys::winpath::tests::a_round_trip_is_stable514 PASS [ 0.058s] ( 495/1042) iets syntax::tests::lang_corpus515 PASS [ 0.018s] ( 496/1042) iets sys::winpath::tests::a_drive_is_the_first_component516 PASS [ 0.010s] ( 497/1042) iets sys::winpath::tests::dot_dot_stops_at_the_anchor517 PASS [ 0.013s] ( 498/1042) iets sys::winpath::tests::device_paths_are_not_shares_and_survive_a_round_trip518 PASS [ 0.007s] ( 499/1042) iets sys::winpath::tests::mixed_separators_agree519 PASS [ 0.012s] ( 500/1042) iets sys::winpath::tests::forward_slashes_make_a_share_too520 PASS [ 0.011s] ( 501/1042) iets sys::winpath::tests::native_names_come_back521 PASS [ 0.010s] ( 502/1042) iets sys::winpath::tests::network_shares_sit_under_unc522 PASS [ 0.008s] ( 503/1042) iets sys::winpath::tests::the_evaluators_form_is_left_alone523 PASS [ 0.009s] ( 504/1042) iets sys::winpath::tests::relative_and_rooted_paths_only_change_separator524 PASS [ 0.008s] ( 505/1042) iets trace::key::tests::key_is_order_and_value_sensitive525 PASS [ 2.289s] ( 506/1042) iets lint::cli_cases::an_allow_comment_is_part_of_the_cache_key_and_a_hit_replays_nothing526 PASS [ 0.017s] ( 507/1042) iets trace::key::tests::relative_path_detection527 PASS [ 0.013s] ( 508/1042) iets trace::store::tests::bytes_that_are_not_an_entry_are_bad_not_a_panic528 PASS [ 0.013s] ( 509/1042) iets trace::store::tests::a_reader_of_one_generation_never_sees_the_next529 PASS [ 0.010s] ( 510/1042) iets trace::tests::dedupe_keeps_conflicting_values530 PASS [ 0.018s] ( 511/1042) iets trace::store::tests::one_rename_publishes_every_part531 PASS [ 0.010s] ( 512/1042) iets trace::validate::dir_hash_tests::dir_hash_agrees_with_dir_listing_hash532 PASS [ 0.013s] ( 513/1042) iets trace::tests::only_a_named_query_is_an_observation533 PASS [ 0.014s] ( 514/1042) iets trace::tests::fingerprint_changes_with_content_size_and_seen_entries534 PASS [ 0.015s] ( 515/1042) iets trace::tests::dump_fingerprint_matches_the_separate_walk535 PASS [ 0.020s] ( 516/1042) iets trace::validate::tests::dir_stat_env_checks536 PASS [ 0.031s] ( 517/1042) iets trace::validate::tests::a_copy_in_place_that_keeps_the_stat_still_misses537 PASS [ 0.030s] ( 518/1042) iets trace::validate::tests::a_resolved_path_validates_as_the_same538 PASS [ 0.026s] ( 519/1042) iets trace::validate::tests::file_touch_refreshes_edit_misses539 PASS [ 0.013s] ( 520/1042) iets trace::watch::tests::only_the_paths_an_mtime_can_speak_for540 PASS [ 0.019s] ( 521/1042) iets trace::validate::tests::what_a_native_path_records_validates541 PASS [ 0.018s] ( 522/1042) iets trace::wire::tests::drvs_sources_roots_roundtrip542 PASS [ 0.032s] ( 523/1042) iets trace::wire::tests::readset_roundtrip543 PASS [ 0.027s] ( 524/1042) iets treestore::pack::tests::a_changed_index_byte_is_not_a_pack544 PASS [ 0.021s] ( 525/1042) iets treestore::pack::tests::a_reader_sees_a_pack_written_after_it_listed545 PASS [ 0.010s] ( 526/1042) iets treestore::pack::tests::an_empty_writer_leaves_no_file546 PASS [ 0.852s] ( 527/1042) iets runtime::value::alloc_tests::a_static_slice_is_interned_without_a_copy547 PASS [ 0.036s] ( 528/1042) iets treestore::pack::tests::a_pack_reads_back_what_was_written548 PASS [ 0.644s] ( 529/1042) iets source::scm::ledger::tests::a_change_of_the_ledger_is_a_change_of_the_working_tree549 PASS [ 0.021s] ( 530/1042) iets treestore::pack::tests::a_set_finds_objects_across_packs_and_drops_a_broken_one550 PASS [ 0.009s] ( 531/1042) iets treestore::tests::a_staged_directory_goes_when_it_is_dropped551 PASS [ 0.007s] ( 532/1042) iets treestore::tests::a_tree_is_named_by_its_nar_hash552 PASS [ 0.019s] ( 533/1042) iets treestore::tests::a_flat_file_is_named_by_the_hash_of_its_bytes553 PASS [ 0.011s] ( 534/1042) iets treestore::tests::a_stored_input_reads_back_and_a_wrong_hash_is_refused554 PASS [ 4.771s] ( 535/1042) iets builtins::fetch::tests::a_read_of_the_count_is_one_finding_for_each_tree555 PASS [ 0.025s] ( 536/1042) iets treestore::tests::a_put_after_a_collection_brings_its_own_objects556 PASS [ 0.034s] ( 537/1042) iets treestore::pack::tests::collect_removes_dead_packs_and_compacts_mostly_dead_ones557 PASS [ 0.011s] ( 538/1042) iets::aterm_crosscheck bytes_that_are_not_utf8_roundtrip558 PASS [ 0.011s] ( 539/1042) iets::aterm_crosscheck fixed_output_inputs_hide_their_provenance559 PASS [ 0.011s] ( 540/1042) iets::aterm_crosscheck fixed_output_path_is_recomputed_not_trusted560 PASS [ 0.008s] ( 541/1042) iets::aterm_crosscheck floating_ca_defers_itself_and_downstream561 PASS [ 0.006s] ( 542/1042) iets::aterm_crosscheck masked_and_unmasked_hashes_differ_once_filled562 PASS [ 0.008s] ( 543/1042) iets::aterm_crosscheck harmonia_cases_roundtrip563 PASS [ 0.008s] ( 544/1042) iets::aterm_crosscheck malformed_aterm_is_an_error564 PASS [ 0.008s] ( 545/1042) iets::aterm_crosscheck upstream_bench_drvs_parse_and_reprint_stably565 PASS [ 0.011s] ( 546/1042) iets::aterm_crosscheck upstream_bad_drvs_are_rejected566 PASS [ 0.007s] ( 547/1042) iets::aterm_crosscheck upstream_input_addressed_paths_recompute567 PASS [ 0.028s] ( 548/1042) iets treestore::tests::two_inputs_share_their_common_files568 PASS [ 0.008s] ( 549/1042) iets::aterm_crosscheck upstream_drvs_roundtrip_byte_exact569 PASS [ 4.016s] ( 550/1042) iets eval::tests::reading_a_derivation_output_is_unsupported570 PASS [ 0.006s] ( 551/1042) iets::aterm_crosscheck upstream_invariants_fill_in_deferred571 PASS [ 0.006s] ( 552/1042) iets::aterm_crosscheck upstream_invariants_input_addressed_kept_or_rejected572 PASS [ 0.011s] ( 553/1042) iets::aterm_crosscheck upstream_invariants_ca_floating_dependency573 PASS [ 0.012s] ( 554/1042) iets::cache_hygiene an_entry_that_is_not_a_plain_file_is_refused574 PASS [ 0.047s] ( 555/1042) iets treestore::tests::collect_keeps_what_an_entry_names575 PASS [ 0.132s] ( 556/1042) iets trace::validate::tests::the_lowest_failing_observation_is_the_one_reported576 PASS [ 0.018s] ( 557/1042) iets::cache_hygiene a_changed_byte_or_a_copied_entry_is_a_miss577 PASS [ 4.836s] ( 558/1042) iets api::value::tests::scalars578 PASS [ 0.016s] ( 559/1042) iets::cache_hygiene input_touch_child579 PASS [ 0.018s] ( 560/1042) iets::cache_hygiene an_input_observation_marks_its_entry_as_used580 PASS [ 0.025s] ( 561/1042) iets::cache_hygiene a_corrupt_entry_is_dropped_and_a_corrupt_store_is_wiped581 PASS [ 0.013s] ( 562/1042) iets::cache_hygiene unix_only::a_link_or_a_fifo_is_not_an_entry582 PASS [ 0.022s] ( 563/1042) iets::cache_hygiene unix_only::a_cache_is_private_to_its_owner583 PASS [ 0.269s] ( 564/1042) iets trace::tests::dedupe_of_many_repeats_is_linear584 PASS [ 1.047s] ( 565/1042) iets session::tests::a_released_session_leaves_the_other_alone585 PASS [ 0.206s] ( 566/1042) iets::cache_hygiene concurrent_readers_and_writers_never_see_a_torn_entry586 PASS [ 5.080s] ( 567/1042) iets builtins::fetch::tests::the_first_read_of_a_tree_gives_its_finding587 PASS [ 4.943s] ( 568/1042) iets eval::tests::attrs_and_lists588 PASS [ 1.066s] ( 569/1042) iets source::scm::ledger::tests::the_metadata_has_the_mark_of_its_tree589 PASS [ 3.813s] ( 570/1042) iets lint::cases::iets_lint_sets_a_level_and_a_flag_beats_it590 PASS [ 3.815s] ( 571/1042) iets lint::cases::scope_attributes_a_derivation_to_the_users_binding591 PASS [ 5.403s] ( 572/1042) iets builtins::fetch::tests::the_tree_decides_the_level592 PASS [ 1.467s] ( 573/1042) iets session::tests::a_value_used_after_release_is_loud593 PASS [ 5.239s] ( 574/1042) iets eval::tests::printing594 PASS [ 0.718s] ( 575/1042) iets::cache_hygiene cache_gc_removes_entries_past_the_ttl595 PASS [ 1.413s] ( 576/1042) iets source::scm::ledger::tests::a_name_resolves_to_a_revision_and_a_revision_has_a_tree596 PASS [ 4.649s] ( 577/1042) iets eval::tests::scoping597 PASS [ 1.963s] ( 578/1042) iets runtime::value::alloc_tests::a_full_string_table_records_no_more_but_still_shares598 PASS [ 1.744s] ( 579/1042) iets source::scm::ledger::tests::the_tracked_files_and_the_metadata_are_the_tree599 PASS [ 2.662s] ( 580/1042) iets lint::flake_cases::the_project_file_sets_tree_meta_per_tree600 PASS [ 3.530s] ( 581/1042) iets lint::cli_cases::the_scope_is_part_of_the_cache_key601 PASS [ 3.401s] ( 582/1042) iets lint::flake_cases::a_pre_existing_store_path_is_still_a_recopy602 PASS [ 3.466s] ( 583/1042) iets lint::flake_cases::a_directory_under_the_root_is_dir_copy_flake_not_path_copy603 PASS [ 6.228s] ( 584/1042) iets builtins::fetch::tests::the_name_on_a_value_that_is_not_a_tree_is_silent604 PASS [ 4.723s] ( 585/1042) iets lint::cases::the_project_iets_toml_sets_a_level_and_a_name_beats_its_family605 PASS [ 1.540s] ( 586/1042) iets::cache_semantics a_hit_prints_paths_and_positions_the_same606 PASS [ 3.440s] ( 587/1042) iets lint::flake_cases::a_tree_meta_finding_is_a_record_with_a_span_on_a_cache_hit_too607 PASS [ 4.101s] ( 588/1042) iets lint::cli_cases::an_allow_table_travels_in_the_ir_cache_entry_and_a_load_stays_silent608 PASS [ 2.739s] ( 589/1042) iets session::tests::a_parallel_run_releases_its_session609 PASS [ 1.928s] ( 590/1042) iets::cache_semantics a_lint_warning_is_replayed_on_a_hit610 PASS [ 1.224s] ( 591/1042) iets::classic_eval eval_jobs_summary611 PASS [ 4.489s] ( 592/1042) iets lint::flake_cases::a_copy_under_the_root_or_an_input_is_not_a_recopy612 PASS [ 2.268s] ( 593/1042) iets::cache_semantics the_cache_dir_keeps_what_it_did_not_make613 PASS [ 4.260s] ( 594/1042) iets lint::flake_cases::an_input_or_an_allowed_site_is_silent_and_the_scope_opens_the_input614 PASS [ 4.090s] ( 595/1042) iets lint::flake_cases::the_roots_metadata_in_a_derivation_is_reported_by_default615 PASS [ 7.779s] ( 596/1042) iets api::run::tests::helper_fibers_read_the_ir_cache616 PASS [ 5.049s] ( 597/1042) iets lint::flake_cases::an_input_is_silent_until_the_scope_or_the_inputs_table_opens_it617 PASS [ 0.486s] ( 598/1042) iets::cli a_bad_config_stops_only_what_reads_a_setting618 PASS [ 3.177s] ( 599/1042) iets::classic_build activity_records619 PASS [ 5.038s] ( 600/1042) iets lint::flake_cases::the_level_of_tree_meta_comes_from_the_flag_the_env_and_the_user_file620 PASS [ 3.488s] ( 601/1042) iets::cache_semantics a_copy_in_place_misses621 PASS [ 3.224s] ( 602/1042) iets::classic_build dry_run_and_json_log_path622 PASS [ 3.070s] ( 603/1042) iets::classic_build the_builder_setting623 PASS [ 2.130s] ( 604/1042) iets::classic_fallback a_full_stdout624 PASS [ 0.356s] ( 605/1042) iets::cli a_full_stdout_is_an_error625 PASS [ 3.787s] ( 606/1042) iets::cache_semantics a_pure_run_never_reads_an_impure_entry626 PASS [ 3.830s] ( 607/1042) iets::cache_semantics the_file_argument_keeps_one_entry627 PASS [ 7.574s] ( 608/1042) iets lint::cases::scope_limits_a_lint_to_the_entry_directory_until_it_is_opened628 PASS [ 0.954s] ( 609/1042) iets::cli completion_asks_the_binary_and_ignores_settings629 PASS [ 0.998s] ( 610/1042) iets::cli build_evaluates_every_installable630 PASS [ 1.008s] ( 611/1042) iets::cli build_cache_ignores_installable_order631 PASS [ 0.109s] ( 612/1042) iets::diff an_unknown_flag_is_a_usage_error632 PASS [ 0.417s] ( 613/1042) iets::cli io_errors_read_like_strerror633 PASS [ 1.263s] ( 614/1042) iets::cli current_system_is_the_hosts634 PASS [ 0.081s] ( 615/1042) iets::diff one_side_is_a_usage_error635 PASS [ 1.213s] ( 616/1042) iets::cli eval_json_forces_without_strict636 PASS [ 2.494s] ( 617/1042) iets::cli a_bad_command_line_names_the_problem637 PASS [ 1.295s] ( 618/1042) iets::cli help_and_version_go_to_stdout638 PASS [ 1.176s] ( 619/1042) iets::diff an_env_name_that_repeats_the_derivation_name_is_left_out639 PASS [ 1.076s] ( 620/1042) iets::diff depth_zero_stops_at_the_input_derivation640 PASS [ 5.712s] ( 621/1042) iets::cache_semantics search_uses_the_cache641 PASS [ 0.941s] ( 622/1042) iets::diff the_json_object_names_the_same_differences642 PASS [ 0.745s] ( 623/1042) iets::e2e_build a_build_log_cannot_forge_a_hash_mismatch643 PASS [ 2.292s] ( 624/1042) iets::cli eval_says_what_it_does_not_support644 PASS [ 1.372s] ( 625/1042) iets::diff equal_derivations_exit_0645 PASS [ 6.048s] ( 626/1042) iets::cache_semantics uncacheable_runs_write_nothing646 PASS [ 11.056s] ( 627/1042) iets builtins::fetch::tests::a_selection_of_the_count_is_the_site647 PASS [ 6.276s] ( 628/1042) iets::cache_semantics a_flake_keeps_one_entry648 PASS [ 2.771s] ( 629/1042) iets::cli dash_a_completes_the_attribute_names_under_its_root649 PASS [ 1.515s] ( 630/1042) iets::diff the_text_names_the_env_the_source_and_the_input_drv650 PASS [ 0.971s] ( 631/1042) iets::e2e_build no_build_uploads_every_installable651 PASS [ 1.630s] ( 632/1042) iets::diff two_installables_are_one_evaluation_each652 PASS [ 11.883s] ( 633/1042) iets api::concurrent_eval::concurrent_eval_sums_arena_use_over_workers653 PASS [ 3.739s] ( 634/1042) iets::cli a_flake_fragment_completes_to_the_outputs_attribute_names654 PASS [ 10.782s] ( 635/1042) iets lint::cases::allow_comments_silence_the_lines_they_cover655 PASS [ 1.786s] ( 636/1042) iets::e2e_build dry_run_over_a_tree656 PASS [ 1.276s] ( 637/1042) iets::e2e_evaljobs every_line_has_stats657 PASS [ 5.051s] ( 638/1042) iets::cli dash_f_names_the_file_in_the_native_namespace658 PASS [ 2.830s] ( 639/1042) iets::e2e_evaljobs ignored_flags_warn_once659 PASS [ 3.655s] ( 640/1042) iets::e2e_evaljobs iets_options_reach_the_workers660 PASS [ 9.804s] ( 641/1042) iets::classic_eval internal_json_errors661 PASS [ 5.069s] ( 642/1042) iets::e2e_build no_verdict_without_an_evaluation662 PASS [ 0.009s] ( 643/1042) iets::e2e_flake online_inputs663 FAIL [ 9.227s] ( 644/1042) iets::classic_shell nix_develop664 stdout ---665666 running 1 test667 test nix_develop ... FAILED668669 failures:670671 failures:672 nix_develop673674 test result: FAILED. 0 passed; 1 failed; 0 ignored; 0 measured; 3 filtered out; finished in 9.22s675 676 stderr ---677678 thread 'nix_develop' (4334) panicked at tests/e2e/mod.rs:491:13:679 1 failed:680 nix develop -c env (138 variables): only real []681 only ours ["IETS_PROGRESS=false"]682 ours stderr copying 5 paths...683 copying path '/tmp/iets-e2e.27G9qR/store/5j2j6gfxbj3l0cww4aymv1bgw32rs3q4-builder.sh' to 'daemon'...684 copying path '/tmp/iets-e2e.27G9qR/store/zc0338bxhzb0z2rci309940943s9h0ja-get-env.sh' to 'daemon'...685 copying path '/tmp/iets-e2e.27G9qR/store/3g04jingbkgjw9mjjbffij6sfdxmhzgk-builder-stdenv.sh' to 'daemon'...686 copying path '/tmp/iets-e2e.27G9qR/store/dqrk8kibmjq326824rr7dcivpfzkaa36-stdenv.drv' to 'daemon'...687 copying path '/tmp/iets-e2e.27G9qR/store/92hbxywfpv7wxqi796237wmdbwihr32v-shell-env.drv' to 'daemon'...688689 real stderr error (ignored): cannot find flake 'flake:nixpkgs' in the flake registries690691 note: run with `RUST_BACKTRACE=1` environment variable to display a backtrace692693 Cancelling due to test failure: 47 tests still running694 PASS [ 9.083s] ( 645/1042) iets::classic_shell nix_fmt695 PASS [ 7.164s] ( 646/1042) iets::diff dash_f_is_the_positional_file696 PASS [ 10.106s] ( 647/1042) iets::classic_eval the_builtins_names697 PASS [ 11.221s] ( 648/1042) iets::classic_build settings_reach_the_daemon698 PASS [ 12.404s] ( 649/1042) iets::cache_semantics flags_that_turn_the_cache_off699 PASS [ 6.880s] ( 650/1042) iets::e2e_build a_failure_in_a_dependency700 PASS [ 11.786s] ( 651/1042) iets::classic_eval ignored_flags_and_settings701 PASS [ 11.233s] ( 652/1042) iets::classic_eval nix_search702 PASS [ 6.974s] ( 653/1042) iets::e2e_build a_tree_builds_past_a_failure703 PASS [ 10.931s] ( 654/1042) iets::classic_fallback fallbacks704 PASS [ 12.544s] ( 655/1042) iets::classic_build the_roots_a_build_keeps705 PASS [ 6.228s] ( 656/1042) iets::e2e_evaljobs one_session_id_per_run706 PASS [ 4.511s] ( 657/1042) iets::e2e_flake a_sparse_checkout_is_dirty707 PASS [ 7.448s] ( 658/1042) iets::e2e_build one_root708 PASS [ 6.736s] ( 659/1042) iets::e2e_flake a_second_process_waits_for_the_download709 PASS [ 7.250s] ( 660/1042) iets::e2e_flake a_git_working_tree_caches710 PASS [ 5.254s] ( 661/1042) iets::e2e_flake an_unfetchable_input711 PASS [ 19.479s] ( 662/1042) iets eval::tests::pure_eval_answers_like_nix712 PASS [ 11.667s] ( 663/1042) iets::e2e_daemon a_closure_cold_and_warm713 FAIL [ 15.565s] ( 664/1042) iets::classic_shell nix_shell714 stdout ---715716 running 1 test717 test nix_shell ... FAILED718719 failures:720721 failures:722 nix_shell723724 test result: FAILED. 0 passed; 1 failed; 0 ignored; 0 measured; 3 filtered out; finished in 15.55s725 726 stderr ---727728 thread 'nix_shell' (4785) panicked at tests/e2e/mod.rs:491:13:729 1 failed:730 nix-shell --run env (136 variables): only real []731 only ours ["IETS_PROGRESS=false"]732 ours stderr 733 real stderr 734 note: run with `RUST_BACKTRACE=1` environment variable to display a backtrace735736 PASS [ 11.841s] ( 665/1042) iets::e2e_daemon a_path_on_stdout_or_a_failure737 PASS [ 16.402s] ( 666/1042) iets::classic_fallback fetchers738 PASS [ 16.465s] ( 667/1042) iets::classic_shell nix_shell_roots739 PASS [ 13.131s] ( 668/1042) iets::e2e_flake a_git_input_goes_through_nix740 PASS [ 15.068s] ( 669/1042) iets::e2e_daemon an_output_as_an_input_source741 PASS [ 11.195s] ( 670/1042) iets::e2e_flake inputs_of_every_type742 PASS [ 16.981s] ( 671/1042) iets::e2e_daemon a_source_tree_through_each_transport743 PASS [ 24.686s] ( 672/1042) iets::classic_build failures744 PASS [ 24.833s] ( 673/1042) iets::classic_eval auto_call_a_function_file745 PASS [ 28.780s] ( 674/1042) iets syntax::tests::deep_nesting_ends_with_an_error746 PASS [ 18.711s] ( 675/1042) iets::e2e_flake iets_fetches_a_tarball_input747 PASS [ 29.214s] ( 676/1042) iets::classic_eval symlinks_below_a_copied_path748 PASS [ 31.595s] ( 677/1042) iets::classic_eval nix_eval_of_a_flake749 PASS [ 35.167s] ( 678/1042) iets::classic_build out_links_and_roots750 PASS [ 35.300s] ( 679/1042) iets::classic_eval nix_derivation_show751 PASS [ 36.487s] ( 680/1042) iets::cache_semantics hits_and_misses752 PASS [ 35.438s] ( 681/1042) iets::classic_fallback fetch_git753 PASS [ 36.435s] ( 682/1042) iets::classic_eval pure_eval_and_nix_conf754 PASS [ 34.610s] ( 683/1042) iets::e2e_flake a_git_working_tree755 PASS [ 42.999s] ( 684/1042) iets::classic_cache the_tracing_cache756 PASS [ 35.896s] ( 685/1042) iets::e2e_flake rev_count757 PASS [ 50.958s] ( 686/1042) iets::classic_eval nix_instantiate758 PASS [ 56.463s] ( 687/1042) iets lint::fixtures::every_lint_fires_on_its_fixture_only_when_asked759 SLOW [> 60.000s] (---------) iets api::concurrent_eval::concurrent_eval_matches_sequential_eval760 SLOW [> 60.000s] (---------) iets runtime::value::tests::union_iteration_merges_like_a_fold761 SLOW [> 60.000s] (---------) iets::classic_eval nix_search_nixpkgs762 SLOW [> 60.000s] (---------) iets::e2e_evaljobs flags_match_nix_eval_jobs763 PASS [ 63.625s] ( 688/1042) iets::e2e_evaljobs flags_match_nix_eval_jobs764 PASS [ 80.086s] ( 689/1042) iets runtime::value::tests::union_iteration_merges_like_a_fold765 PASS [ 94.318s] ( 690/1042) iets::classic_eval nix_search_nixpkgs766 SLOW [>120.000s] (---------) iets api::concurrent_eval::concurrent_eval_matches_sequential_eval767 SLOW [>180.000s] (---------) iets api::concurrent_eval::concurrent_eval_matches_sequential_eval768 SLOW [>240.000s] (---------) iets api::concurrent_eval::concurrent_eval_matches_sequential_eval769 PASS [ 275.839s] ( 691/1042) iets api::concurrent_eval::concurrent_eval_matches_sequential_eval770------------771 Summary [ 275.842s] 691/1042 tests run: 689 passed (4 slow), 2 failed, 6 skipped772 FAIL [ 9.227s] ( 644/1042) iets::classic_shell nix_develop773 FAIL [ 15.565s] ( 664/1042) iets::classic_shell nix_shell774warning: 351/1042 tests were not run due to test failure (run with --no-fail-fast to run all tests, or run with --max-fail)775error: test run failed