nixbot

builds

numtide/iets build #488 failed

branch e2e-fixture · PR #202 · commit 57f29b215b · · took 27m 25s · eval 13s

eval warnings 2 kinds · 2 occurrences
  • warn setting 'accept-flake-config' is ignored: iets never applies a flake's nixConfig, so a flake that sets extra-substituters or allow-import-from-derivation there runs without them; put the settings in nix.conf ×1
  • warn setting 'plugin-files' is ignored: iets loads no plugins ×1

7 failed
failed attributes
status attribute duration
failed checks.x86_64-linux.clippy 0s
setup: error: gRPC QueryMissing on 'farm.numtide.com:50051' failed: bearer token rejected hint: Set NIX_GRPC_DEBUG=1 for a handshake trace.
setup:
error: gRPC QueryMissing on 'farm.numtide.com:50051' failed: bearer token rejected
       hint: Set NIX_GRPC_DEBUG=1 for a handshake trace.
failed checks.x86_64-linux.doc 0s
setup: this derivation will be built: error: gRPC QueryPathInfos on 'farm.numtide.com:50051' failed: bearer token rejected hint: Set NIX_GRPC_DEBUG=1 for …
setup:
this derivation will be built:
error: gRPC QueryPathInfos on 'farm.numtide.com:50051' failed: bearer token rejected
       hint: Set NIX_GRPC_DEBUG=1 for a handshake trace.
failed checks.x86_64-linux.doctest 0s
setup: error: gRPC QueryMissing on 'farm.numtide.com:50051' failed: bearer token rejected hint: Set NIX_GRPC_DEBUG=1 for a handshake trace.
setup:
error: gRPC QueryMissing on 'farm.numtide.com:50051' failed: bearer token rejected
       hint: Set NIX_GRPC_DEBUG=1 for a handshake trace.
failed checks.x86_64-linux.examples 0s
setup: error: gRPC QueryMissing on 'farm.numtide.com:50051' failed: bearer token rejected hint: Set NIX_GRPC_DEBUG=1 for a handshake trace.
setup:
error: gRPC QueryMissing on 'farm.numtide.com:50051' failed: bearer token rejected
       hint: Set NIX_GRPC_DEBUG=1 for a handshake trace.
failed checks.x86_64-linux.fmt 1s
setup: this derivation will be built: error: gRPC QueryPathInfos on 'farm.numtide.com:50051' failed: bearer token rejected hint: Set NIX_GRPC_DEBUG=1 for …
setup:
this derivation will be built:
error: gRPC QueryPathInfos on 'farm.numtide.com:50051' failed: bearer token rejected
       hint: Set NIX_GRPC_DEBUG=1 for a handshake trace.
failed checks.x86_64-linux.nixpkgs-eval 0s
setup: error: gRPC QueryMissing on 'farm.numtide.com:50051' failed: bearer token rejected hint: Set NIX_GRPC_DEBUG=1 for a handshake trace.
setup:
error: gRPC QueryMissing on 'farm.numtide.com:50051' failed: bearer token rejected
       hint: Set NIX_GRPC_DEBUG=1 for a handshake trace.
failed checks.x86_64-linux.test 0s
setup: error: gRPC QueryMissing on 'farm.numtide.com:50051' failed: bearer token rejected hint: Set NIX_GRPC_DEBUG=1 for a handshake trace.
setup:
error: gRPC QueryMissing on 'farm.numtide.com:50051' failed: bearer token rejected
       hint: Set NIX_GRPC_DEBUG=1 for a handshake trace.
10 succeeded
succeeded attributes
status attribute duration
loading…
21 already built
skipped attributes
status attribute duration
loading…