numtide/iets build #480 failed ← #479 #481 →
eval warnings
2 kinds
· 2 occurrences
- warn setting 'accept-flake-config' is ignored: iets never applies a flake's nixConfig, so a flake that sets extra-substituters or allow-import-from-derivation there runs without them; put the settings in nix.conf ×1
- warn setting 'plugin-files' is ignored: iets loads no plugins ×1
6 failed
| status | attribute | duration |
|---|---|---|
checks.aarch64-linux.ast-grep
|
9s | |
iets-ast-grep: elastic-arm-52ccf228: building hb1iizgrmip3r2i51369jakk8jh5l08v-iets-ast-grep.drv error[no-inline-absolute-paths]: use a `use` import instead of …iets-ast-grep: elastic-arm-52ccf228: building hb1iizgrmip3r2i51369jakk8jh5l08v-iets-ast-grep.drv error[no-inline-absolute-paths]: use a `use` import instead of an inline crate::/super::/std:: path ┌─ tests/hermetic/mod.rs:30:19 │ 30 │ for (k, _) in std::env::vars_os() { │ ^^^^^^^^^^^^^^^^^ Error: 1 error(s) found in code. Help: Scan succeeded and found error level diagnostics in the codebase. |
||
checks.x86_64-linux.ast-grep
|
3s | |
iets-ast-grep: error[no-inline-absolute-paths]: use a `use` import instead of an inline crate::/super::/std:: path ┌─ tests/hermetic/mod.rs:30:19 │ 30 │ …iets-ast-grep: error[no-inline-absolute-paths]: use a `use` import instead of an inline crate::/super::/std:: path ┌─ tests/hermetic/mod.rs:30:19 │ 30 │ for (k, _) in std::env::vars_os() { │ ^^^^^^^^^^^^^^^^^ Error: 1 error(s) found in code. Help: Scan succeeded and found error level diagnostics in the codebase. |
||
checks.x86_64-linux.classic-e2e
|
0s | |
setup: error: gRPC QueryMissing on 'farm.numtide.com:50051' failed: bearer token rejected hint: Set NIX_GRPC_DEBUG=1 for a handshake trace.setup: error: gRPC QueryMissing on 'farm.numtide.com:50051' failed: bearer token rejected hint: Set NIX_GRPC_DEBUG=1 for a handshake trace. |
||
checks.x86_64-linux.examples
|
1s | |
setup: error: gRPC QueryMissing on 'farm.numtide.com:50051' failed: bearer token rejected hint: Set NIX_GRPC_DEBUG=1 for a handshake trace.setup: error: gRPC QueryMissing on 'farm.numtide.com:50051' failed: bearer token rejected hint: Set NIX_GRPC_DEBUG=1 for a handshake trace. |
||
checks.x86_64-linux.nixpkgs-eval
|
0s | |
setup: error: gRPC QueryMissing on 'farm.numtide.com:50051' failed: bearer token rejected hint: Set NIX_GRPC_DEBUG=1 for a handshake trace.setup: error: gRPC QueryMissing on 'farm.numtide.com:50051' failed: bearer token rejected hint: Set NIX_GRPC_DEBUG=1 for a handshake trace. |
||
checks.x86_64-linux.test
|
0s | |
setup: error: gRPC QueryMissing on 'farm.numtide.com:50051' failed: bearer token rejected hint: Set NIX_GRPC_DEBUG=1 for a handshake trace.setup: error: gRPC QueryMissing on 'farm.numtide.com:50051' failed: bearer token rejected hint: Set NIX_GRPC_DEBUG=1 for a handshake trace. |
||
2 cancelled
| status | attribute | duration |
|---|---|---|
| loading… | ||
9 succeeded
| status | attribute | duration |
|---|---|---|
| loading… | ||
21 already built
| status | attribute | duration |
|---|---|---|
| loading… | ||