iets-nextest-0.1.0
checks.aarch64-linux.test
· build #452
· raw
1elastic-arm-5be5d98b: building m0nxl1bhn20d99v0rsfl7bhr4grm13fs-iets-nextest-0.1.0.drv
unpackPhase
2unpacking source archive /nix/store/xh8scqs0l78al7w2dvcz5pxjp3pciwyg-source3source root is sourcepatchPhase
4Executing configureCargoCommonVars5decompressing cargo artifacts from /nix/store/hgrp7hd209cjnbpq1cagcwcc404690ww-iets-deps-0.1.0/target.tar.zst to targetconfigurePhase
6will append /build/source/.cargo-home/config.toml with contents of /nix/store/xxq0blv9rwlynz621b9rcxrpnkm5if8f-vendor-cargo-deps/config.toml7default configurePhase, nothing to dobuildPhase
8+++ command cargo --version9cargo 1.98.0 (797e8a9bc 2026-08-05)10+++ command cargo nextest --version11cargo-nextest 0.9.14612release: 0.9.14613host: aarch64-unknown-linux-gnucheckPhase
14+++ command cargo nextest run --cargo-profile dev15 Compiling iets v0.1.0 (/build/source)16 Finished `dev` profile [unoptimized + debuginfo] target(s) in 1m 10s17------------18 Nextest run ID c5fc8fe2-a490-4342-8f25-71117e314c18 with nextest profile: default19 Starting 1004 tests across 26 binaries (6 tests skipped)20 PASS [ 0.022s] ( 1/1004) iets api::drvshow::tests::a_fixed_output_shows_its_content_address_and_no_path21 PASS [ 0.022s] ( 2/1004) iets api::installable::tests::default_and_fragment_attr_paths22 PASS [ 0.022s] ( 3/1004) iets api::drvshow::tests::a_multi_output_derivation23 PASS [ 0.026s] ( 4/1004) iets api::drvshow::tests::inputs_and_structured_attrs24 PASS [ 0.020s] ( 5/1004) iets api::drvshow::tests::a_non_canonical_structured_attrs_text_is_renormalised25 PASS [ 0.023s] ( 6/1004) iets api::fetch::tests::the_fake_hash_moves_the_output_and_the_drv26 PASS [ 0.024s] ( 7/1004) iets api::run::tests::a_fiber_template_carries_the_configuration27 PASS [ 0.037s] ( 8/1004) iets api::drvshow::tests::floats_take_nlohmanns_form28 PASS [ 0.039s] ( 9/1004) iets api::fetch::tests::only_a_fixed_output_drv_can_be_prefetched29 PASS [ 0.038s] ( 10/1004) iets api::drvshow::tests::pretty_matches_serde_json30 PASS [ 0.050s] ( 11/1004) iets api::installable::tests::the_name_a_program_takes_from_a_derivation_name31 PASS [ 0.051s] ( 12/1004) iets api::value::tests::apply_is_lazy32 PASS [ 0.021s] ( 13/1004) iets api::value::tests::thunk_reads_as_thunk33 PASS [ 0.043s] ( 14/1004) iets api::value::tests::attrs_by_name_and_index34 PASS [ 0.043s] ( 15/1004) iets api::value::tests::construction35 PASS [ 0.025s] ( 16/1004) iets api::value::tests::wrong_type_is_an_error36 PASS [ 0.011s] ( 17/1004) iets build::backend::tests::output_specs37 PASS [ 0.021s] ( 18/1004) iets build::backend::tests::base_names_drop_the_store_dir38 PASS [ 0.051s] ( 19/1004) iets api::value::tests::lists39 PASS [ 0.054s] ( 20/1004) iets api::value::tests::calling_a_function40 PASS [ 0.043s] ( 21/1004) iets api::value::tests::strings_and_context41 PASS [ 0.056s] ( 22/1004) iets api::value::tests::missing_attribute42 PASS [ 0.059s] ( 23/1004) iets api::value::tests::force_deep_forces_the_whole_tree43 PASS [ 0.028s] ( 24/1004) iets argv::tests::every_byte_round_trips44 PASS [ 0.020s] ( 25/1004) iets build::event::tests::durations45 PASS [ 0.023s] ( 26/1004) iets build::backend::tests::the_timings_report_with_every_line46 PASS [ 0.023s] ( 27/1004) iets build::executor::tests::a_declared_system_filters47 PASS [ 0.023s] ( 28/1004) iets build::executor::tests::no_place_at_all_is_a_usage_error48 PASS [ 0.024s] ( 29/1004) iets build::executor::tests::an_unsupported_url_says_what_is_expected49 PASS [ 0.024s] ( 30/1004) iets build::executor::tests::a_refusal_names_every_place_and_what_it_declared50 PASS [ 0.025s] ( 31/1004) iets build::executor::tests::a_feature_the_place_lacks_rules_it_out51 PASS [ 0.018s] ( 32/1004) iets build::executor::tests::the_first_place_that_takes_it_wins52 PASS [ 0.023s] ( 33/1004) iets build::executor::tests::one_place_declaring_nothing_takes_everything53 PASS [ 0.020s] ( 34/1004) iets build::fixhash::tests::a_longer_hash_is_not_a_match54 PASS [ 0.024s] ( 35/1004) iets build::fanout::tests::a_failed_dependency_blocks_its_dependants55 PASS [ 0.084s] ( 36/1004) iets api::value::tests::scalars56 PASS [ 0.027s] ( 37/1004) iets build::fanout::tests::dependencies_run_first57 PASS [ 0.022s] ( 38/1004) iets build::render::tests::a_build_the_backend_saw_succeed_is_verdicted_at_once58 PASS [ 0.015s] ( 39/1004) iets build::render::tests::a_long_attribute_keeps_its_ends59 PASS [ 0.026s] ( 40/1004) iets build::render::tests::a_build_log_never_reports_a_mismatch60 PASS [ 0.032s] ( 41/1004) iets build::fixhash::tests::two_matches_are_left_alone61 PASS [ 0.031s] ( 42/1004) iets build::render::tests::a_failure_after_the_activity_ended_never_claims_a_success62 PASS [ 0.034s] ( 43/1004) iets build::render::tests::a_daemon_failure_message_decides_the_verdict63 PASS [ 0.026s] ( 44/1004) iets build::render::tests::a_stalled_build_that_fails_still_shows_its_cause64 PASS [ 0.033s] ( 45/1004) iets build::render::tests::a_failure_shows_a_short_extract65 PASS [ 0.028s] ( 46/1004) iets build::render::tests::an_owned_build_is_verdicted_once_by_its_op66 PASS [ 0.026s] ( 47/1004) iets build::render::tests::an_unfolded_success_ends_with_its_verdict67 PASS [ 0.019s] ( 48/1004) iets build::render::tests::drv_paths_of_a_failure_message68 PASS [ 0.019s] ( 49/1004) iets build::render::tests::heartbeat_names_running_builds69 PASS [ 0.026s] ( 50/1004) iets build::render::tests::ci_folds_a_success_and_never_a_failure70 PASS [ 0.072s] ( 51/1004) iets build::fixhash::tests::one_match_is_rewritten_in_its_own_spelling71 PASS [ 0.033s] ( 52/1004) iets build::render::tests::logs_of_two_builds_do_not_interleave72 PASS [ 0.022s] ( 53/1004) iets build::tests::hash_stripping73 PASS [ 0.086s] ( 54/1004) iets build::fanout::tests::at_most_limit_builds_run_at_once74 PASS [ 0.031s] ( 55/1004) iets build::render::tests::tty_keeps_successful_logs_off_the_screen75 PASS [ 0.036s] ( 56/1004) iets build::render::tests::the_summary_follows_more_than_one_build76 PASS [ 0.045s] ( 57/1004) iets build::render::tests::the_live_region_spins_and_counts77 PASS [ 0.031s] ( 58/1004) iets build::tests::targets_become_jobs78 PASS [ 0.045s] ( 59/1004) iets build::render::tests::the_status_line_takes_the_colours_of_the_rows_above79 PASS [ 0.048s] ( 60/1004) iets build::render::tests::one_build_needs_no_summary80 PASS [ 0.023s] ( 61/1004) iets builtins::derivation::tests::a_dynamic_output_renders_the_placeholder_nix_renders81 PASS [ 0.049s] ( 62/1004) iets build::tests::a_target_with_no_verdict_fails82 PASS [ 0.018s] ( 63/1004) iets builtins::fetch::tests::nix_sees_no_mark83 PASS [ 0.033s] ( 64/1004) iets builtins::derivation::tests::the_two_placeholders_are_not_the_same84 PASS [ 0.059s] ( 65/1004) iets build::tests::a_fan_out_backend_keeps_the_cap_and_the_log_blocks85 PASS [ 0.032s] ( 66/1004) iets builtins::fetch::tests::an_entry_of_the_compiled_file_cache_keeps_the_site86 PASS [ 0.035s] ( 67/1004) iets builtins::fetch::tests::the_mark_follows_the_string_like_store_context87 PASS [ 0.031s] ( 68/1004) iets builtins::fetch_git::tests::a_working_tree_is_a_file_url_of_an_absolute_path88 PASS [ 0.029s] ( 69/1004) iets builtins::store_hooks::tests::a_relative_path_inside_an_entry_joins_once89 PASS [ 0.029s] ( 70/1004) iets builtins::fetch_git::tests::only_a_plain_rev_or_ref_is_read_by_iets90 PASS [ 0.025s] ( 71/1004) iets builtins::text::fromtoml::tests::inline_tables_stay_on_one_line91 PASS [ 0.046s] ( 72/1004) iets builtins::fetch::tests::the_tree_decides_the_level92 PASS [ 0.066s] ( 73/1004) iets builtins::fetch::tests::a_read_that_is_not_a_selection_has_no_site93 PASS [ 0.020s] ( 74/1004) iets builtins::text::fromtoml::tests::new_escapes_are_refused94 PASS [ 0.036s] ( 75/1004) iets builtins::store_hooks::tests::virtual_tree_reads_go_to_the_local_files95 PASS [ 0.058s] ( 76/1004) iets builtins::fetch::tests::the_name_on_a_value_that_is_not_a_tree_is_silent96 PASS [ 0.059s] ( 77/1004) iets builtins::fetch::tests::the_first_read_of_a_tree_gives_its_finding97 PASS [ 0.072s] ( 78/1004) iets builtins::fetch::tests::a_read_of_the_count_is_one_finding_for_each_tree98 PASS [ 0.022s] ( 79/1004) iets builtins::text::regex::tests::names99 PASS [ 0.023s] ( 80/1004) iets cachefs::tests::a_directory_that_is_not_ours_is_refused_untouched100 PASS [ 0.013s] ( 81/1004) iets cachefs::tests::a_touch_inside_the_interval_writes_nothing101 PASS [ 0.024s] ( 82/1004) iets cachefs::tests::a_wait_lock_waits_for_its_holder102 PASS [ 0.027s] ( 83/1004) iets cachefs::tests::a_store_without_a_version_file_is_wiped_once103 PASS [ 0.014s] ( 84/1004) iets cachefs::tests::a_wipe_of_the_ir_cache_walks_its_shards104 PASS [ 0.012s] ( 85/1004) iets cachefs::tests::an_empty_directory_is_ours_to_take105 PASS [ 0.036s] ( 86/1004) iets builtins::text::regex::tests::size_limit106 PASS [ 0.011s] ( 87/1004) iets cachefs::tests::an_input_store_of_the_spool_layout_is_wiped107 PASS [ 0.029s] ( 88/1004) iets cachefs::tests::a_stamp_in_the_future_is_due108 PASS [ 0.027s] ( 89/1004) iets cachefs::tests::a_sweep_runs_once_per_interval109 PASS [ 0.024s] ( 90/1004) iets cachefs::tests::a_wipe_keeps_what_iets_did_not_create110 PASS [ 0.277s] ( 91/1004) iets api::run::tests::the_counters_cover_the_helper_fibers111 PASS [ 0.014s] ( 92/1004) iets cli::build::tests::a_success_with_no_output_path_is_named112 PASS [ 0.111s] ( 93/1004) iets builtins::fetch::tests::a_selection_of_the_count_is_the_site113 PASS [ 0.021s] ( 94/1004) iets cli::build::tests::a_path_on_stdout_is_silent114 PASS [ 0.022s] ( 95/1004) iets cachefs::tests::sweep_drops_old_entries_and_keeps_young_ones115 PASS [ 0.022s] ( 96/1004) iets cli::build::tests::a_failed_build_reports_itself116 PASS [ 0.023s] ( 97/1004) iets cachefs::tests::version_mismatch_wipes_the_store117 PASS [ 0.028s] ( 98/1004) iets cachefs::tests::garbled_stamp_wipes_the_store118 PASS [ 0.020s] ( 99/1004) iets cli::build::tests::an_out_flag_that_matches_nothing_is_named119 PASS [ 0.020s] ( 100/1004) iets cli::build::tests::no_build_result_is_named120 PASS [ 0.022s] ( 101/1004) iets cli::build::tests::installables_are_sorted_without_repeats121 PASS [ 0.036s] ( 102/1004) iets cachefs::tests::sweep_ages_a_root_by_its_link_not_by_what_it_names122 PASS [ 0.014s] ( 103/1004) iets cli::build::tests::out_links_are_named_as_nix_build_names_them123 PASS [ 0.013s] ( 104/1004) iets cli::classic::nix::tests::flake_registry_is_the_setting124 PASS [ 0.038s] ( 105/1004) iets cachefs::tests::sweep_walks_the_shards_of_the_ir_cache125 PASS [ 0.022s] ( 106/1004) iets cli::build::tests::no_outcome_at_all_is_named126 PASS [ 0.020s] ( 107/1004) iets cli::classic::nix::tests::eval_takes_print_build_logs127 PASS [ 0.012s] ( 108/1004) iets cli::classic::shell::tests::outputs_become_placeholders128 PASS [ 0.014s] ( 109/1004) iets cli::complete::tests::a_positional_is_left_to_the_shell129 PASS [ 0.023s] ( 110/1004) iets cli::classic::shell::tests::declares_for_every_bash_shaped_value130 PASS [ 0.015s] ( 111/1004) iets cli::complete::tests::a_flag_value_completes_by_its_placeholder131 PASS [ 0.019s] ( 112/1004) iets cli::classic::shell::tests::sh_var_names132 PASS [ 0.021s] ( 113/1004) iets cli::classic::tests::a_flag_with_no_effect_is_noted_and_one_that_holds_is_not133 PASS [ 0.015s] ( 114/1004) iets cli::diff::tests::a_name_ends_at_the_first_dash_before_a_digit134 PASS [ 0.023s] ( 115/1004) iets cli::complete::tests::commands_complete_with_their_summary135 PASS [ 0.023s] ( 116/1004) iets cli::complete::tests::every_script_asks_the_binary136 PASS [ 0.020s] ( 117/1004) iets cli::complete::tests::subcommands_and_topics137 PASS [ 0.021s] ( 118/1004) iets cli::complete::tests::flags_complete_after_a_dash138 PASS [ 0.097s] ( 119/1004) iets cachefs::tests::a_lock_that_cannot_be_opened_is_not_a_busy_lock139 PASS [ 0.019s] ( 120/1004) iets cli::docs::tests::every_embedded_page_has_a_heading140 PASS [ 0.012s] ( 121/1004) iets cli::help::tests::help_fits_80_columns141 PASS [ 0.023s] ( 122/1004) iets cli::docs::tests::the_topic_list_fits_80_columns142 PASS [ 0.014s] ( 123/1004) iets cli::plumbing::tests::a_file_url_needs_one_slash_not_three143 PASS [ 0.019s] ( 124/1004) iets cli::plumbing::tests::a_url_is_the_positional_fetch_takes_itself144 PASS [ 0.031s] ( 125/1004) iets cli::docs::tests::topics_resolve_bare_and_qualified145 PASS [ 0.017s] ( 126/1004) iets cli::render::text::tests::a_long_value_shows_the_lines_that_differ146 PASS [ 0.027s] ( 127/1004) iets cli::help::tests::a_mistyped_command_is_suggested147 PASS [ 0.024s] ( 128/1004) iets cli::help::tests::messages148 PASS [ 0.026s] ( 129/1004) iets cli::help::tests::suggestions_come_from_the_help149 PASS [ 0.087s] ( 130/1004) iets cachefs::tests::the_writer_lock_excludes_one_holder_at_a_time150 PASS [ 0.017s] ( 131/1004) iets cli::search::tests::drv_names151 PASS [ 0.035s] ( 132/1004) iets cli::render::tests::sizes_render_as_nix_renders_them152 PASS [ 0.019s] ( 133/1004) iets cli::search::tests::merged_highlights153 PASS [ 0.034s] ( 134/1004) iets cli::run::tests::a_usage_error_is_an_exit_code_and_a_message154 PASS [ 0.016s] ( 135/1004) iets config::tests::a_classic_name_leaves_an_unimplemented_setting_to_nix155 PASS [ 0.026s] ( 136/1004) iets cli::search::tests::index_round_trip156 PASS [ 0.019s] ( 137/1004) iets config::tests::a_setting_with_no_effect_is_noted157 PASS [ 0.049s] ( 138/1004) iets cli::run::tests::eval_prints_its_value158 PASS [ 0.036s] ( 139/1004) iets compile::cache::tests::a_malformed_entry_is_a_miss_and_never_a_crash159 PASS [ 0.025s] ( 140/1004) iets config::tests::an_alias_is_its_setting160 PASS [ 0.022s] ( 141/1004) iets config::tests::bool_spellings161 PASS [ 0.017s] ( 142/1004) iets config::tests::extra_appends_to_list_settings_only162 PASS [ 0.025s] ( 143/1004) iets config::tests::bad_typed_values_error_where_they_are_set163 PASS [ 0.029s] ( 144/1004) iets config::tests::basic_syntax164 PASS [ 0.028s] ( 145/1004) iets config::tests::include_chain165 PASS [ 0.019s] ( 146/1004) iets config::tests::max_jobs_auto_is_the_cpu_count166 PASS [ 0.020s] ( 147/1004) iets config::tests::missing_include_errors_and_bang_include_does_not167 PASS [ 0.016s] ( 148/1004) iets config::tests::the_daemon_gets_the_store_settings_set_outside_the_system_file168 PASS [ 0.072s] ( 149/1004) iets cli::run::tests::the_hosts_environment_reaches_the_lint_configuration169 PASS [ 0.062s] ( 150/1004) iets compile::cache::tests::nesting_past_the_cap_misses170 PASS [ 0.030s] ( 151/1004) iets config::tests::option_nix_path_replaces_nix_path_and_extra_adds171 PASS [ 0.017s] ( 152/1004) iets config::tests::user_conf_files_are_in_precedence_order172 PASS [ 0.033s] ( 153/1004) iets config::tests::overrides_win_over_files173 PASS [ 0.022s] ( 154/1004) iets config::tests::typed_getters_and_defaults174 PASS [ 0.015s] ( 155/1004) iets devenv::tests::get_env_sh_store_path_matches_nix175 PASS [ 0.029s] ( 156/1004) iets config::tests::the_setting_tables_name_nix_settings176 PASS [ 0.022s] ( 157/1004) iets config::tests::unknown_settings_are_kept177 PASS [ 0.040s] ( 158/1004) iets config::tests::syntax_errors178 PASS [ 0.023s] ( 159/1004) iets devenv::tests::json_roundtrip_and_bash_forms179 PASS [ 0.023s] ( 160/1004) iets devenv::tests::output_checks_are_erased_only_when_present180 PASS [ 0.035s] ( 161/1004) iets devenv::tests::cached_result_roundtrip181 PASS [ 0.096s] ( 162/1004) iets compile::cache::tests::a_changed_byte_never_makes_the_evaluator_read_past_its_env182 PASS [ 0.025s] ( 163/1004) iets devenv::tests::non_bash_builder_is_refused183 PASS [ 0.018s] ( 164/1004) iets display::tests::a_full_width_line_keeps_its_last_column184 PASS [ 0.019s] ( 165/1004) iets devenv::tests::shell_escaping185 PASS [ 0.022s] ( 166/1004) iets display::tests::a_frame_is_one_synchronized_write186 PASS [ 0.026s] ( 167/1004) iets display::tests::a_region_taller_than_the_screen_is_clamped187 PASS [ 0.025s] ( 168/1004) iets display::tests::a_region_that_grows_and_shrinks_loses_no_output188 PASS [ 0.017s] ( 169/1004) iets display::tests::the_region_comes_down_on_close189 PASS [ 0.021s] ( 170/1004) iets display::tests::a_resize_burst_never_erases190 PASS [ 0.022s] ( 171/1004) iets display::tests::a_resize_keeps_one_region191 PASS [ 0.042s] ( 172/1004) iets devenv::tests::rewrites_apply_in_map_order_to_every_occurrence192 PASS [ 0.044s] ( 173/1004) iets devenv::tests::rc_script_rewrites_outputs_and_writes_attrs193 PASS [ 0.027s] ( 174/1004) iets display::tests::growth_does_not_eat_output194 PASS [ 0.028s] ( 175/1004) iets display::tests::colour_and_width195 PASS [ 0.030s] ( 176/1004) iets display::tests::output_scrolls_and_the_region_stays_at_the_bottom196 PASS [ 0.038s] ( 177/1004) iets display::tests::output_starts_at_the_origin197 PASS [ 0.027s] ( 178/1004) iets eval::tests::a_function_select_is_a_fresh_slot_when_its_subject_is_forced198 PASS [ 0.034s] ( 179/1004) iets display::tests::the_region_keeps_its_rows_until_a_smaller_size_lasts199 PASS [ 0.031s] ( 180/1004) iets display::tests::wrapped_output_does_not_corrupt_the_region200 PASS [ 0.034s] ( 181/1004) iets eval::tests::a_second_pseudo_file_keeps_its_own_positions201 PASS [ 0.028s] ( 182/1004) iets eval::tests::derivation_wrapper_exists202 PASS [ 0.018s] ( 183/1004) iets eval::tests::fetch_mercurial_names_a_way_out203 PASS [ 0.038s] ( 184/1004) iets eval::tests::an_invalid_regex_fails_before_the_string_is_forced204 PASS [ 0.041s] ( 185/1004) iets eval::tests::derivation_keeps_env_and_args_that_are_not_utf8205 PASS [ 0.165s] ( 186/1004) iets compile::cache::tests::a_changed_byte_of_a_stored_entry_is_a_miss206 PASS [ 0.040s] ( 187/1004) iets eval::tests::equality207 PASS [ 0.068s] ( 188/1004) iets eval::tests::arithmetic_and_strings208 PASS [ 0.043s] ( 189/1004) iets eval::tests::fetchurl_needs_a_sha256_in_every_mode209 PASS [ 0.037s] ( 190/1004) iets eval::tests::nix_eq_forces_what_the_shortcut_skips210 PASS [ 0.046s] ( 191/1004) iets eval::tests::from_json_and_toml_reject_null_bytes211 PASS [ 0.079s] ( 192/1004) iets eval::tests::attrs_and_lists212 PASS [ 0.050s] ( 193/1004) iets eval::tests::laziness_and_recursion213 PASS [ 0.071s] ( 194/1004) iets eval::tests::fetchurl_checks_its_argument_like_nix214 PASS [ 0.064s] ( 195/1004) iets eval::tests::printing215 PASS [ 0.043s] ( 196/1004) iets eval::tests::try_eval_and_errors216 PASS [ 0.044s] ( 197/1004) iets eval::tests::update_forces_the_right_operand_first217 PASS [ 0.067s] ( 198/1004) iets eval::tests::scoping218 PASS [ 0.035s] ( 199/1004) iets fetch::http::tests::credentials_in_the_url_are_sent_and_never_printed219 PASS [ 0.014s] ( 200/1004) iets fetch::http::tests::file_urls_name_a_local_path220 PASS [ 0.082s] ( 201/1004) iets eval::tests::reading_a_derivation_output_is_unsupported221 PASS [ 0.033s] ( 202/1004) iets fetch::http::tests::credentials_stay_on_the_first_origin222 PASS [ 0.016s] ( 203/1004) iets fetch::http::tests::redirects_resolve223 PASS [ 0.020s] ( 204/1004) iets fetch::http::tests::redirects_keep_credentials_only_on_the_same_origin224 PASS [ 0.021s] ( 205/1004) iets fetch::http::tests::magic_bytes225 PASS [ 0.012s] ( 206/1004) iets fetch::http::tests::urls_split226 PASS [ 0.018s] ( 207/1004) iets fetch::http::tests::trailing_bytes_and_a_second_layer227 PASS [ 0.020s] ( 208/1004) iets fetch::roots::tests::a_named_file_that_is_missing_or_empty_is_an_error228 PASS [ 0.016s] ( 209/1004) iets fetch::roots::tests::no_bundle_anywhere_gives_the_compiled_in_set229 PASS [ 0.021s] ( 210/1004) iets fetch::roots::tests::an_empty_nix_ssl_cert_file_hides_ssl_cert_file230 PASS [ 0.107s] ( 211/1004) iets eval::tests::sets_compare_in_the_symbol_order_of_nix231 PASS [ 0.023s] ( 212/1004) iets fetch::roots::tests::nix_ssl_cert_file_wins_over_ssl_cert_file_and_the_platform232 PASS [ 0.020s] ( 213/1004) iets fetch::roots::tests::the_platform_store_wins_over_the_compiled_in_set233 PASS [ 0.014s] ( 214/1004) iets fetch::spool::tests::an_empty_archive_is_an_empty_directory234 PASS [ 0.026s] ( 215/1004) iets fetch::spool::tests::a_changed_index_byte_is_a_miss235 PASS [ 0.022s] ( 216/1004) iets fetch::spool::tests::a_sparse_member_counts_against_the_size_limit236 PASS [ 0.031s] ( 217/1004) iets fetch::spool::tests::nar_hash_of_the_fixture237 PASS [ 0.042s] ( 218/1004) iets fetch::spool::tests::a_hard_link_never_replaces_a_member238 PASS [ 0.040s] ( 219/1004) iets fetch::spool::tests::a_stored_tree_dumps_the_spools_nar239 PASS [ 0.159s] ( 220/1004) iets eval::tests::pure_eval_answers_like_nix240 PASS [ 0.040s] ( 221/1004) iets fetch::spool::tests::archives_the_git_sink_accepts241 PASS [ 0.013s] ( 222/1004) iets fetch::spool::tests::the_scratch_file_never_follows_a_symlink242 PASS [ 0.033s] ( 223/1004) iets fetch::spool::tests::spool_matches_the_tree243 PASS [ 0.020s] ( 224/1004) iets fetch::spool::tests::the_errors_match244 PASS [ 0.022s] ( 225/1004) iets fetch::unpack::tests::keeps_the_root_when_it_is_not_a_single_directory245 PASS [ 0.015s] ( 226/1004) iets fetch::unpack::tests::member_names_are_made_relative_and_cannot_escape246 PASS [ 0.024s] ( 227/1004) iets fetch::unpack::tests::an_unsupported_member_type_is_an_error247 PASS [ 0.047s] ( 228/1004) iets fetch::spool::tests::spool_matches_the_tree_on_the_top_level248 PASS [ 0.051s] ( 229/1004) iets fetch::spool::tests::pax_sparse_members_are_expanded249 PASS [ 0.026s] ( 230/1004) iets fetch::unpack::tests::a_repeated_member_keeps_the_last_copy250 PASS [ 0.019s] ( 231/1004) iets fetch::unpack::tests::modes_symlinks_and_empty_dirs251 PASS [ 0.014s] ( 232/1004) iets flake::flakeref::tests::parses_the_kept_schemes252 PASS [ 0.025s] ( 233/1004) iets fetch::unpack::tests::nar_hash_of_the_fixture253 PASS [ 0.020s] ( 234/1004) iets flake::flakeref::tests::round_trips254 PASS [ 0.019s] ( 235/1004) iets flake::flakeref::tests::to_string_from_attrs255 PASS [ 0.023s] ( 236/1004) iets flake::flakeref::tests::git_urls_are_fixed_like_nix256 PASS [ 0.029s] ( 237/1004) iets flake::flakeref::tests::errors_and_unsupported257 PASS [ 0.021s] ( 238/1004) iets flake::tests::a_pinned_checkout_is_its_revision258 PASS [ 0.036s] ( 239/1004) iets flake::flakeref::tests::refuses_a_github_ref_named_twice259 PASS [ 0.016s] ( 240/1004) iets flake::tests::refs_resolve_against_cwd_and_home260 PASS [ 0.019s] ( 241/1004) iets flake::tests::attr_paths261 PASS [ 0.019s] ( 242/1004) iets jobs::line::tests::error_line_round_trip262 PASS [ 0.025s] ( 243/1004) iets jobs::constituents::tests::topo_sort_orders_and_detects_cycles263 PASS [ 0.051s] ( 244/1004) iets fetch::unpack::tests::strips_one_leading_component264 PASS [ 0.012s] ( 245/1004) iets lint::allow::tests::lines265 PASS [ 0.026s] ( 246/1004) iets jobs::line::tests::split_and_round_trip266 PASS [ 0.038s] ( 247/1004) iets jobs::constituents::tests::fnmatch_basics267 PASS [ 0.032s] ( 248/1004) iets jobs::tests::a_numeric_name_selects_an_attribute_under_a_set268 PASS [ 0.029s] ( 249/1004) iets lint::allow::tests::comment_names269 PASS [ 0.035s] ( 250/1004) iets jobs::line::tests::stats_survive_the_collector270 PASS [ 0.027s] ( 251/1004) iets lint::cases::a_project_file_may_not_set_nix_bin_dir271 PASS [ 0.047s] ( 252/1004) iets lint::cases::a_family_selector_selects_its_members272 PASS [ 0.041s] ( 253/1004) iets lint::cases::an_unknown_name_in_iets_toml_is_a_warning_and_the_rest_counts273 PASS [ 0.050s] ( 254/1004) iets lint::cases::one_warning_per_site274 PASS [ 0.060s] ( 255/1004) iets lint::cases::iets_lint_sets_a_level_and_a_flag_beats_it275 PASS [ 0.071s] ( 256/1004) iets lint::cases::an_unknown_name_in_iets_lint_is_a_warning_and_the_rest_counts276 PASS [ 0.094s] ( 257/1004) iets lint::cases::a_later_flag_wins_over_all_and_a_name_beats_a_later_all277 PASS [ 0.030s] ( 258/1004) iets lint::cli_cases::a_finding_at_error_has_the_span_and_no_edit278 PASS [ 0.043s] ( 259/1004) iets lint::cases::try_eval_does_not_catch_a_lint_error279 PASS [ 0.648s] ( 260/1004) iets builtins::text::regex::tests::long_inputs_do_not_recurse280 PASS [ 0.042s] ( 261/1004) iets lint::cli_cases::a_finding_record_has_the_span_and_the_edit_on_a_cache_hit_too281 PASS [ 0.107s] ( 262/1004) iets lint::cases::scope_attributes_a_derivation_to_the_users_binding282 PASS [ 0.041s] ( 263/1004) iets lint::cli_cases::a_warning_is_replayed_on_a_cache_hit283 PASS [ 0.022s] ( 264/1004) iets lint::cli_cases::an_unknown_lint_name_in_a_flag_is_a_usage_error284 PASS [ 0.088s] ( 265/1004) iets lint::cases::the_user_iets_toml_sets_a_level_and_the_project_file_wins_over_it285 PASS [ 0.100s] ( 266/1004) iets lint::cases::the_project_iets_toml_sets_a_level_and_a_name_beats_its_family286 PASS [ 0.139s] ( 267/1004) iets lint::cases::scope_limits_a_lint_to_the_entry_directory_until_it_is_opened287 PASS [ 0.041s] ( 268/1004) iets lint::cli_cases::an_unknown_name_in_iets_lint_is_a_record288 PASS [ 0.041s] ( 269/1004) iets lint::cli_cases::lint_list_shows_the_effective_levels_and_the_scope289 PASS [ 0.087s] ( 270/1004) iets lint::cli_cases::an_allow_comment_is_part_of_the_cache_key_and_a_hit_replays_nothing290 PASS [ 0.212s] ( 271/1004) iets lint::cases::allow_comments_silence_the_lines_they_cover291 PASS [ 0.074s] ( 272/1004) iets lint::cli_cases::the_scope_is_part_of_the_cache_key292 PASS [ 0.407s] ( 273/1004) iets fetch::http::tests::downloads_stop_at_the_size_limit293 PASS [ 0.118s] ( 274/1004) iets lint::cli_cases::an_allow_table_travels_in_the_ir_cache_entry_and_a_load_stays_silent294 PASS [ 0.093s] ( 275/1004) iets lint::flake_cases::a_copy_under_the_root_or_an_input_is_not_a_recopy295 PASS [ 0.011s] ( 276/1004) iets lint::site::tests::a_literal_lint_of_nix_has_an_edit296 PASS [ 0.010s] ( 277/1004) iets lint::site::tests::the_span_is_the_innermost_node_of_the_kind_of_the_lint297 PASS [ 0.096s] ( 278/1004) iets lint::flake_cases::a_directory_under_the_root_is_dir_copy_flake_not_path_copy298 PASS [ 0.026s] ( 279/1004) iets lint::tests::an_unknown_name_is_a_warning_in_a_file_and_an_error_in_a_flag299 PASS [ 0.019s] ( 280/1004) iets lint::tests::keys300 PASS [ 0.116s] ( 281/1004) iets lint::flake_cases::a_tree_meta_finding_is_a_record_with_a_span_on_a_cache_hit_too301 PASS [ 0.012s] ( 282/1004) iets lint::tests::names_are_unique_kebab_case302 PASS [ 0.019s] ( 283/1004) iets lint::tests::scope_and_inputs303 PASS [ 0.023s] ( 284/1004) iets lint::tests::selectors_and_order304 PASS [ 0.021s] ( 285/1004) iets lint::tests::specificity_inside_a_source_and_order_between_sources305 PASS [ 0.031s] ( 286/1004) iets lint::tests::the_project_file_walk_stops_at_the_project_root306 PASS [ 0.018s] ( 287/1004) iets log::tests::a_coloured_error_is_an_error_record307 PASS [ 0.143s] ( 288/1004) iets lint::flake_cases::an_input_is_silent_until_the_scope_or_the_inputs_table_opens_it308 PASS [ 0.024s] ( 289/1004) iets lint::tests::toml_table309 PASS [ 0.126s] ( 290/1004) iets lint::flake_cases::the_project_file_sets_tree_meta_per_tree310 PASS [ 0.147s] ( 291/1004) iets lint::flake_cases::the_level_of_tree_meta_comes_from_the_flag_the_env_and_the_user_file311 PASS [ 0.024s] ( 292/1004) iets log::tests::a_hash_mismatch_names_the_hash_it_got312 PASS [ 0.029s] ( 293/1004) iets log::tests::a_fixed_hash_has_the_shape_of_a_finding_with_an_edit313 PASS [ 0.028s] ( 294/1004) iets log::tests::a_half_line_waits_for_its_newline314 PASS [ 0.160s] ( 295/1004) iets lint::flake_cases::an_input_or_an_allowed_site_is_silent_and_the_scope_opens_the_input315 PASS [ 0.022s] ( 296/1004) iets log::tests::a_mismatch_reason_keeps_both_hashes316 PASS [ 0.029s] ( 297/1004) iets log::tests::a_forged_mismatch_is_dropped317 PASS [ 0.131s] ( 298/1004) iets lint::flake_cases::the_roots_metadata_in_a_derivation_is_reported_by_default318 PASS [ 0.022s] ( 299/1004) iets log::tests::a_session_id_is_a_uuid_v7319 PASS [ 0.027s] ( 300/1004) iets log::tests::a_region_stays_under_the_output_that_scrolls_above_it320 PASS [ 0.026s] ( 301/1004) iets log::tests::escapes_are_filtered_the_way_nix_filters_them321 PASS [ 0.028s] ( 302/1004) iets log::tests::a_resolved_copy_reports_its_mismatch_as_a_line322 PASS [ 0.028s] ( 303/1004) iets log::tests::a_resize_redraws_the_region_once323 PASS [ 0.028s] ( 304/1004) iets log::tests::activity_records_are_nix_json_logger_records324 PASS [ 0.031s] ( 305/1004) iets log::tests::ansi_stripping325 PASS [ 0.032s] ( 306/1004) iets log::tests::a_pause_takes_the_view_down_for_a_prompt326 PASS [ 0.020s] ( 307/1004) iets log::tests::exit_status_flags_combine_like_nix327 PASS [ 0.020s] ( 308/1004) iets log::tests::the_status_line_goes_under_the_region328 PASS [ 0.017s] ( 309/1004) iets nixbin::tests::every_iets_build_is_skipped329 PASS [ 0.022s] ( 310/1004) iets log::tests::record_is_nix_log_ei_plus_code_and_hint330 PASS [ 0.023s] ( 311/1004) iets log::tests::without_a_terminal_output_is_plain331 PASS [ 0.028s] ( 312/1004) iets log::tests::lint_warning_is_a_level_1_record332 PASS [ 0.028s] ( 313/1004) iets log::tests::text_shows_the_hint_of_an_unsupported_error333 PASS [ 0.029s] ( 314/1004) iets log::tests::record_without_position334 PASS [ 0.021s] ( 315/1004) iets nixbin::tests::farm_marker_is_found_through_two_hops335 PASS [ 0.019s] ( 316/1004) iets parallel::deque::tests::lifo_owner_fifo_thief336 PASS [ 0.016s] ( 317/1004) iets parallel::fiber::tests::resume_yield_finish337 PASS [ 0.021s] ( 318/1004) iets parallel::fiber::tests::reservation_is_capped_and_mmap_failure_is_an_error338 PASS [ 0.023s] ( 319/1004) iets parallel::interner::tests::empty_name_misses_the_cache_sentinel339 PASS [ 0.018s] ( 320/1004) iets parallel::sched::tests::a_task_survives_packing_past_the_old_24_bit_start340 PASS [ 0.046s] ( 321/1004) iets parallel::fiber::tests::large_stack_use_and_release341 PASS [ 0.024s] ( 322/1004) iets parallel::interner::tests::intern_is_stable_and_shared342 PASS [ 0.052s] ( 323/1004) iets parallel::fiber::tests::migrates_between_threads343 PASS [ 0.024s] ( 324/1004) iets parallel::sched::tests::main_parks_and_is_woken_by_helper344 PASS [ 0.085s] ( 325/1004) iets parallel::fiber::tests::a_freed_stack_frees_its_guard_entry345 PASS [ 0.045s] ( 326/1004) iets parallel::sched::tests::fan_out_from_main346 PASS [ 0.020s] ( 327/1004) iets print::tests::float_formatting_edge_cases347 PASS [ 0.048s] ( 328/1004) iets parallel::sched::tests::park_and_wake_across_workers348 PASS [ 0.055s] ( 329/1004) iets parallel::thunk::tests::deadlocked_fibers_are_cancelled349 PASS [ 0.023s] ( 330/1004) iets profile::tests::a_sample_is_taken_once_per_tick350 PASS [ 0.030s] ( 331/1004) iets profile::tests::a_frame_keeps_its_call_site_and_its_name351 PASS [ 0.119s] ( 332/1004) iets parallel::deque::tests::concurrent_sum352 PASS [ 0.024s] ( 333/1004) iets profile::tests::an_unwind_returns_to_a_depth353 PASS [ 0.017s] ( 334/1004) iets progress::tests::a_log_hears_of_a_task_after_first_and_then_every_heartbeat354 PASS [ 0.035s] ( 335/1004) iets profile::tests::a_weight_is_bytes_when_the_profile_asks_for_them355 PASS [ 0.016s] ( 336/1004) iets progress::tests::a_transfer_that_does_not_move_says_so356 PASS [ 0.027s] ( 337/1004) iets progress::tests::a_download_inside_a_copy_is_part_of_the_copy357 PASS [ 0.029s] ( 338/1004) iets progress::tests::several_of_a_kind_are_counted358 PASS [ 0.028s] ( 339/1004) iets project::tests::a_config_file_never_shrinks_the_root359 PASS [ 0.029s] ( 340/1004) iets progress::tests::store_hashes_are_left_out360 PASS [ 0.028s] ( 341/1004) iets project::tests::a_working_tree_wins_over_a_file_marker_below_it361 PASS [ 0.082s] ( 342/1004) iets profile::tests::a_deep_stack_is_capped362 PASS [ 0.026s] ( 343/1004) iets project::tests::each_marker_is_a_root363 PASS [ 0.792s] ( 344/1004) iets fetch::http::tests::a_transient_status_is_retried364 PASS [ 0.014s] ( 345/1004) iets provenance::tests::a_shared_position_is_left_off_the_started_line_only365 PASS [ 0.023s] ( 346/1004) iets project::tests::the_nearest_flake_wins_without_a_working_tree366 PASS [ 0.019s] ( 347/1004) iets provenance::tests::a_tree_copied_from_a_store_tree_resolves_to_the_local_one367 PASS [ 0.019s] ( 348/1004) iets provenance::tests::an_input_file_is_labelled_by_its_lock_node368 PASS [ 0.025s] ( 349/1004) iets provenance::tests::a_path_followed_by_a_colour_escape_still_matches369 PASS [ 0.017s] ( 350/1004) iets provenance::tests::locate_takes_the_longest_prefix370 PASS [ 0.020s] ( 351/1004) iets provenance::tests::rewrite_leaves_unknown_text_alone371 PASS [ 0.024s] ( 352/1004) iets provenance::tests::locate_without_a_match_is_none372 PASS [ 0.035s] ( 353/1004) iets provenance::tests::failed_line_names_the_attribute_and_the_position373 PASS [ 0.020s] ( 354/1004) iets provenance::tests::rewrite_replaces_every_known_path_in_a_line374 PASS [ 0.022s] ( 355/1004) iets remote::grpc::backend::tests::a_built_input_stops_the_walk375 PASS [ 0.200s] ( 356/1004) iets parallel::interner::tests::concurrent_intern_agrees376 PASS [ 0.030s] ( 357/1004) iets remote::grpc::backend::tests::a_cold_store_is_asked_the_rest_in_one_call377 PASS [ 0.033s] ( 358/1004) iets remote::grpc::backend::tests::a_built_root_asks_nothing_below_it378 PASS [ 0.019s] ( 359/1004) iets remote::grpc::build::tests::a_local_upload_failure_beats_the_stream_ended_status379 PASS [ 0.019s] ( 360/1004) iets remote::grpc::backend::tests::an_input_below_a_built_one_is_not_built380 PASS [ 0.024s] ( 361/1004) iets remote::grpc::build::tests::a_self_reference_does_not_loop381 PASS [ 0.022s] ( 362/1004) iets remote::grpc::build::tests::reschedules_back_off_past_a_dead_worker382 PASS [ 0.032s] ( 363/1004) iets remote::grpc::build::tests::required_features_come_from_the_env_or_structured_attrs383 PASS [ 0.019s] ( 364/1004) iets remote::grpc::build::tests::the_timings_report_with_every_line384 PASS [ 0.018s] ( 365/1004) iets remote::grpc::drvwire::tests::a_failure_keeps_its_message385 PASS [ 0.021s] ( 366/1004) iets remote::grpc::drvwire::tests::basic_derivation_matches_the_cxx_field_order386 PASS [ 0.025s] ( 367/1004) iets remote::grpc::build::tests::topo_sort_puts_references_first387 PASS [ 0.023s] ( 368/1004) iets remote::grpc::drvwire::tests::an_unresolvable_input_output_is_an_error388 PASS [ 0.024s] ( 369/1004) iets remote::grpc::drvwire::tests::build_result_round_trips_a_daemon_reply389 PASS [ 0.026s] ( 370/1004) iets remote::grpc::health::tests::a_completed_build_clears_the_history390 PASS [ 0.030s] ( 371/1004) iets remote::grpc::drvwire::tests::path_info_round_trips391 PASS [ 0.027s] ( 372/1004) iets remote::grpc::health::tests::a_passed_cooldown_lets_one_caller_through392 PASS [ 0.029s] ( 373/1004) iets remote::grpc::health::tests::an_unknown_address_is_usable393 PASS [ 0.024s] ( 374/1004) iets remote::grpc::health::tests::the_cooldown_grows_and_stops_at_30s394 PASS [ 0.025s] ( 375/1004) iets remote::grpc::health::tests::one_address_does_not_refuse_another395 PASS [ 0.042s] ( 376/1004) iets remote::grpc::health::tests::one_bounce_does_not_refuse_an_address396 PASS [ 0.019s] ( 377/1004) iets remote::grpc::tests::mtls_needs_both_halves397 PASS [ 0.020s] ( 378/1004) iets remote::grpc::tests::percent_escapes_decode_in_values398 PASS [ 0.028s] ( 379/1004) iets remote::grpc::tests::defaults_match_the_cxx_settings399 PASS [ 0.027s] ( 380/1004) iets remote::grpc::tests::every_parameter_parses400 PASS [ 0.040s] ( 381/1004) iets remote::grpc::health::tests::two_bounces_refuse_it401 PASS [ 0.030s] ( 382/1004) iets remote::grpc::tests::a_token_needs_tls_and_unknown_parameters_are_errors402 PASS [ 0.027s] ( 383/1004) iets remote::grpc::tests::insecure_is_a_bare_flag_or_a_boolean403 PASS [ 0.020s] ( 384/1004) iets remote::plan::tests::a_held_root_answers_for_its_closure404 PASS [ 0.022s] ( 385/1004) iets remote::plan::tests::a_cold_store_is_asked_the_rest_in_one_call405 PASS [ 0.019s] ( 386/1004) iets remote::plan::tests::memory_source_matches_dump_string406 PASS [ 0.020s] ( 387/1004) iets remote::worker::counts_tests::a_repeated_update_claims_nothing407 PASS [ 0.022s] ( 388/1004) iets remote::plan::tests::hash_source_matches_nar_hash408 PASS [ 0.024s] ( 389/1004) iets remote::plan::tests::an_answered_root_is_not_asked_again409 PASS [ 0.023s] ( 390/1004) iets remote::worker::counts_tests::each_change_is_a_verdict_in_order410 PASS [ 0.031s] ( 391/1004) iets remote::plan::tests::a_held_input_answers_for_its_closure411 PASS [ 0.011s] ( 392/1004) iets remote::worker::tests::an_ssh_host_is_never_an_option412 PASS [ 0.012s] ( 393/1004) iets remote::worker::tests::a_status_over_a_byte_is_not_a_success413 PASS [ 0.017s] ( 394/1004) iets remote::worker::tests::nix_sshopts_split_like_a_shell414 PASS [ 0.015s] ( 395/1004) iets remote::worker::wire::tests::build_results_are_read_as_nix_reads_them415 PASS [ 0.020s] ( 396/1004) iets remote::worker::tests::ssh_argv_puts_the_host_first416 PASS [ 0.017s] ( 397/1004) iets runtime::heap::tests::release_tombstones_every_chunk417 PASS [ 0.020s] ( 398/1004) iets remote::worker::wire::tests::framed_sink_frames_and_terminates418 PASS [ 0.020s] ( 399/1004) iets remote::worker::wire::tests::replies_are_read_as_nix_reads_them419 PASS [ 0.027s] ( 400/1004) iets remote::worker::tests::transport_from_url420 PASS [ 0.027s] ( 401/1004) iets remote::worker::wire::tests::strings_are_padded421 PASS [ 0.023s] ( 402/1004) iets runtime::value::alloc_tests::a_list_too_long_to_address_has_no_size422 PASS [ 0.020s] ( 403/1004) iets runtime::value::alloc_tests::a_static_slice_is_interned_without_a_copy423 PASS [ 0.027s] ( 404/1004) iets runtime::value::alloc_tests::a_speculated_thunk_is_forced_but_not_demanded424 PASS [ 0.025s] ( 405/1004) iets runtime::value::layout::a_primop_pays_nothing_for_its_symbol425 PASS [ 0.030s] ( 406/1004) iets runtime::value::tests::union_lookup_agrees_with_iteration426 PASS [ 0.024s] ( 407/1004) iets session::tests::two_sessions_share_no_state427 PASS [ 0.023s] ( 408/1004) iets settings::tests::a_flag_carries_several_places_separated_by_a_semicolon428 PASS [ 0.027s] ( 409/1004) iets settings::tests::a_missing_file_is_skipped_and_the_defaults_hold429 PASS [ 1.037s] ( 410/1004) iets fetch::http::tests::a_stalled_download_fails430 PASS [ 0.025s] ( 411/1004) iets settings::tests::a_project_file_holds_lint_and_nothing_else431 PASS [ 0.023s] ( 412/1004) iets settings::tests::a_wrong_type_names_the_key_and_the_file432 PASS [ 0.037s] ( 413/1004) iets settings::tests::a_settings_file_may_hold_lint_and_the_other_sources_may_not433 PASS [ 0.066s] ( 414/1004) iets session::tests::a_value_used_after_release_is_loud434 PASS [ 0.081s] ( 415/1004) iets session::tests::a_parallel_run_releases_its_session435 PASS [ 0.022s] ( 416/1004) iets settings::tests::builder_reads_all_three_forms436 PASS [ 0.027s] ( 417/1004) iets settings::tests::each_source_wins_over_the_one_before437 PASS [ 0.027s] ( 418/1004) iets settings::tests::source_map_adds_up_and_every_other_key_replaces438 PASS [ 0.019s] ( 419/1004) iets settings::tests::the_flag_value_is_toml_when_it_reads_as_toml439 PASS [ 0.031s] ( 420/1004) iets settings::tests::the_environment_wins_over_the_file440 PASS [ 0.031s] ( 421/1004) iets settings::tests::the_file_is_the_users441 PASS [ 0.027s] ( 422/1004) iets settings::tests::the_flag_leaves_the_argv442 PASS [ 0.030s] ( 423/1004) iets settings::tests::the_flag_pairs_are_kept_for_a_second_iets443 PASS [ 0.019s] ( 424/1004) iets settings::tests::the_user_file_turns_purity_off444 PASS [ 0.015s] ( 425/1004) iets settings::tests::unknown_key_names_the_file445 PASS [ 0.021s] ( 426/1004) iets source::local::tests::only_a_content_addressed_store_path_names_its_content446 PASS [ 0.125s] ( 427/1004) iets session::tests::a_released_session_leaves_the_other_alone447 PASS [ 0.007s] ( 428/1004) iets source::lock::tests::empty_lock_has_no_inputs448 PASS [ 0.024s] ( 429/1004) iets source::local::tests::max_mtime_covers_root_and_children449 PASS [ 0.028s] ( 430/1004) iets source::local::tests::accepted_set_adds_parent_directories450 PASS [ 0.027s] ( 431/1004) iets source::lock::tests::complete_lock_passes451 PASS [ 0.021s] ( 432/1004) iets source::lock::tests::declared_inputs_must_match_the_lock452 PASS [ 0.020s] ( 433/1004) iets source::lock::tests::incomplete_locks_fail453 PASS [ 0.012s] ( 434/1004) iets source::scm::git::tests::a_directory_in_a_repository_is_found454 PASS [ 0.026s] ( 435/1004) iets source::remote::tests::download_urls_match_the_fetchers455 PASS [ 0.028s] ( 436/1004) iets source::remote::tests::nix_literal_escapes456 PASS [ 0.035s] ( 437/1004) iets source::remote::tests::a_leftover_is_not_a_valid_path457 PASS [ 0.028s] ( 438/1004) iets source::remote::tests::only_the_archive_types_are_fetched_by_iets458 PASS [ 0.039s] ( 439/1004) iets source::remote::tests::access_tokens_match_the_longest_prefix459 PASS [ 0.023s] ( 440/1004) iets source::scm::ledger::tests::a_directory_in_a_working_tree_is_found460 PASS [ 0.028s] ( 441/1004) iets source::tests::dates461 PASS [ 0.056s] ( 442/1004) iets source::scm::ledger::tests::a_change_of_the_ledger_is_a_change_of_the_working_tree462 PASS [ 0.042s] ( 443/1004) iets source::scm::ledger::tests::the_tracked_files_and_the_metadata_are_the_tree463 PASS [ 0.059s] ( 444/1004) iets source::scm::ledger::tests::a_name_resolves_to_a_revision_and_a_revision_has_a_tree464 PASS [ 0.059s] ( 445/1004) iets source::scm::ledger::tests::the_count_is_lazy_and_kept_by_revision465 PASS [ 0.019s] ( 446/1004) iets store::drv::tests::a_dynamic_input_writes_the_versioned_aterm_and_parses_back466 PASS [ 0.018s] ( 447/1004) iets store::drv::tests::an_env_key_named_json_is_refused467 PASS [ 0.017s] ( 448/1004) iets store::drv::tests::fixed_output_from_scratch468 PASS [ 0.064s] ( 449/1004) iets source::scm::ledger::tests::an_untracked_file_is_the_error_of_nix469 PASS [ 0.076s] ( 450/1004) iets source::scm::ledger::tests::the_metadata_has_the_mark_of_its_tree470 PASS [ 0.021s] ( 451/1004) iets store::drv::tests::input_addressed_multi_output_from_scratch471 PASS [ 0.013s] ( 452/1004) iets store::drv::tests::masked_unparse_blanks_output_paths_and_env472 PASS [ 0.035s] ( 453/1004) iets store::drv::tests::fixtures_output_paths_recompute473 PASS [ 0.036s] ( 454/1004) iets store::drv::tests::fixtures_roundtrip_byte_exact474 PASS [ 0.032s] ( 455/1004) iets store::drv::tests::input_drvs_hash_modulo_from_scratch475 PASS [ 0.024s] ( 456/1004) iets store::drvdiff::tests::an_input_source_an_added_input_drv_and_a_fixed_output_show_up476 PASS [ 0.026s] ( 457/1004) iets store::drv::tests::string_escapes_roundtrip477 PASS [ 0.015s] ( 458/1004) iets store::drvdiff::tests::env_name_shows_only_when_it_is_not_the_derivation_name478 PASS [ 0.030s] ( 459/1004) iets store::drvdiff::tests::a_changed_input_drv_is_paired_by_name_and_recursed_into479 PASS [ 0.020s] ( 460/1004) iets store::drvdiff::tests::the_depth_limit_names_the_input_without_walking_it480 PASS [ 0.023s] ( 461/1004) iets store::drvdiff::tests::json_names_what_differs481 PASS [ 0.013s] ( 462/1004) iets store::hash::tests::base64_roundtrip482 PASS [ 0.018s] ( 463/1004) iets store::drvdiff::tests::the_same_derivation_is_empty483 PASS [ 0.022s] ( 464/1004) iets store::drvdiff::tests::the_local_fields_the_env_and_an_absent_value484 PASS [ 0.025s] ( 465/1004) iets store::hash::tests::compress_hash_xors485 PASS [ 0.083s] ( 466/1004) iets store::drv::tests::fixtures_drv_path_matches_store_path486 PASS [ 0.010s] ( 467/1004) iets store::hash::tests::sha1_nix32487 PASS [ 0.023s] ( 468/1004) iets store::hash::tests::nix32_roundtrip_and_reject488 PASS [ 0.030s] ( 469/1004) iets store::hash::tests::empty_sha256489 PASS [ 0.021s] ( 470/1004) iets store::hash::tests::parse_any_all_formats490 PASS [ 0.031s] ( 471/1004) iets store::hash::tests::md5_nix32491 PASS [ 0.026s] ( 472/1004) iets store::hash::tests::sha512_nix32_base64492 PASS [ 0.028s] ( 473/1004) iets store::hash::tests::sha256_nix32493 PASS [ 0.028s] ( 474/1004) iets store::hash::tests::sha256_sri494 PASS [ 0.019s] ( 475/1004) iets store::nar::tests::directory_nar_hash_formats495 PASS [ 0.024s] ( 476/1004) iets store::hash::tests::streaming_matches_oneshot496 PASS [ 0.032s] ( 477/1004) iets store::nar::tests::directory_nar497 PASS [ 0.030s] ( 478/1004) iets store::nar::tests::directory_nar_with_an_executable498 PASS [ 0.018s] ( 479/1004) iets store::nar::tests::readers_refuse_what_nix_refuses499 PASS [ 0.021s] ( 480/1004) iets store::nar::tests::executable_file_nar500 PASS [ 0.013s] ( 481/1004) iets store::nar::tests::restore_rejects_garbage501 PASS [ 0.020s] ( 482/1004) iets store::nar::tests::regular_file_nar502 PASS [ 0.037s] ( 483/1004) iets store::nar::tests::filter_sees_types_and_paths503 PASS [ 0.026s] ( 484/1004) iets store::nar::tests::script_nar504 PASS [ 0.026s] ( 485/1004) iets store::nar::tests::symlink_nar505 PASS [ 0.026s] ( 486/1004) iets store::path::tests::a_multibyte_char_across_the_hash_part_is_an_error506 PASS [ 0.024s] ( 487/1004) iets store::path::tests::check_name_rules507 PASS [ 0.035s] ( 488/1004) iets store::nar::tests::restore_roundtrip508 PASS [ 0.012s] ( 489/1004) iets store::path::tests::fixed_flat_sha256509 PASS [ 0.037s] ( 490/1004) iets store::path::tests::an_override_is_absolute_and_has_no_trailing_separator510 PASS [ 0.016s] ( 491/1004) iets store::path::tests::fixed_recursive_sha256511 PASS [ 0.017s] ( 492/1004) iets store::path::tests::output_names512 PASS [ 0.023s] ( 493/1004) iets store::path::tests::fixed_flat_sha1513 PASS [ 0.018s] ( 494/1004) iets store::path::tests::parse_and_accessors514 PASS [ 0.032s] ( 495/1004) iets store::path::tests::filter_source515 PASS [ 0.010s] ( 496/1004) iets store::path::tests::placeholder516 PASS [ 0.018s] ( 497/1004) iets store::path::tests::path_copy_directory517 PASS [ 0.015s] ( 498/1004) iets store::path::tests::the_host_picks_the_store_directory518 PASS [ 0.021s] ( 499/1004) iets store::path::tests::path_copy_file519 PASS [ 0.026s] ( 500/1004) iets store::path::tests::to_file520 PASS [ 0.020s] ( 501/1004) iets store::path::tests::to_file_with_reference521 PASS [ 0.021s] ( 502/1004) iets syntax::tests::a_line_ends_at_cr_lf_and_lone_cr522 PASS [ 0.030s] ( 503/1004) iets store::path::tests::the_directory_is_found_as_a_string_and_as_a_path523 PASS [ 0.034s] ( 504/1004) iets store::path::tests::path_with_name524 PASS [ 0.015s] ( 505/1004) iets syntax::tests::an_interpolated_name_is_static_when_nix_has_one_string_node525 PASS [ 0.031s] ( 506/1004) iets syntax::tests::allow_comments526 PASS [ 0.023s] ( 507/1004) iets syntax::tests::attrs_and_bindings527 PASS [ 0.023s] ( 508/1004) iets syntax::tests::comments_and_misc528 PASS [ 0.020s] ( 509/1004) iets syntax::tests::json_gives_every_node_its_kind_and_span529 PASS [ 0.024s] ( 510/1004) iets syntax::tests::indented_string_stripping530 PASS [ 0.038s] ( 511/1004) iets syntax::tests::end_of_file_inside_a_path_is_at_its_last_token531 PASS [ 0.016s] ( 512/1004) iets syntax::tests::line_col_counts_bytes532 PASS [ 0.029s] ( 513/1004) iets syntax::tests::numbers533 PASS [ 0.012s] ( 514/1004) iets syntax::tests::spans_cover_tokens534 PASS [ 0.057s] ( 515/1004) iets syntax::tests::nul_in_string_literals535 PASS [ 0.062s] ( 516/1004) iets syntax::tests::lambdas536 PASS [ 0.044s] ( 517/1004) iets syntax::tests::paths537 PASS [ 0.023s] ( 518/1004) iets sys::winpath::tests::a_bare_drive_is_not_its_root538 PASS [ 0.036s] ( 519/1004) iets syntax::tests::string_escapes_and_interpolation539 PASS [ 0.070s] ( 520/1004) iets syntax::tests::operator_precedence540 PASS [ 0.026s] ( 521/1004) iets sys::winpath::tests::a_drive_is_the_first_component541 PASS [ 0.040s] ( 522/1004) iets syntax::tests::the_error_reported_is_the_one_nix_meets_first542 PASS [ 0.019s] ( 523/1004) iets sys::winpath::tests::a_relative_name_that_starts_with_unc_is_not_a_share543 PASS [ 0.020s] ( 524/1004) iets sys::winpath::tests::a_leading_double_slash_is_not_a_share544 PASS [ 0.024s] ( 525/1004) iets sys::winpath::tests::device_paths_are_not_shares_and_survive_a_round_trip545 PASS [ 0.009s] ( 526/1004) iets sys::winpath::tests::forward_slashes_make_a_share_too546 PASS [ 0.026s] ( 527/1004) iets sys::winpath::tests::a_round_trip_is_stable547 PASS [ 0.028s] ( 528/1004) iets sys::winpath::tests::dot_dot_stops_at_the_anchor548 PASS [ 0.024s] ( 529/1004) iets sys::winpath::tests::mixed_separators_agree549 PASS [ 0.017s] ( 530/1004) iets sys::winpath::tests::network_shares_sit_under_unc550 PASS [ 0.025s] ( 531/1004) iets sys::winpath::tests::native_names_come_back551 PASS [ 0.011s] ( 532/1004) iets sys::winpath::tests::the_evaluators_form_is_left_alone552 PASS [ 0.033s] ( 533/1004) iets sys::winpath::tests::relative_and_rooted_paths_only_change_separator553 PASS [ 0.018s] ( 534/1004) iets trace::key::tests::key_is_order_and_value_sensitive554 PASS [ 0.015s] ( 535/1004) iets trace::store::tests::a_reader_of_one_generation_never_sees_the_next555 PASS [ 0.016s] ( 536/1004) iets trace::store::tests::one_rename_publishes_every_part556 PASS [ 0.025s] ( 537/1004) iets trace::store::tests::bytes_that_are_not_an_entry_are_bad_not_a_panic557 PASS [ 0.019s] ( 538/1004) iets trace::tests::dedupe_keeps_conflicting_values558 PASS [ 0.037s] ( 539/1004) iets trace::key::tests::relative_path_detection559 PASS [ 0.016s] ( 540/1004) iets trace::tests::dump_fingerprint_matches_the_separate_walk560 PASS [ 0.014s] ( 541/1004) iets trace::tests::only_a_named_query_is_an_observation561 PASS [ 0.018s] ( 542/1004) iets trace::validate::dir_hash_tests::dir_hash_agrees_with_dir_listing_hash562 PASS [ 0.929s] ( 543/1004) iets parallel::thunk::tests::many_fibers_force_one_shared_graph563 PASS [ 0.029s] ( 544/1004) iets trace::tests::fingerprint_changes_with_content_size_and_seen_entries564 PASS [ 0.024s] ( 545/1004) iets trace::validate::tests::a_copy_in_place_that_keeps_the_stat_still_misses565 PASS [ 0.024s] ( 546/1004) iets trace::validate::tests::a_resolved_path_validates_as_the_same566 PASS [ 0.043s] ( 547/1004) iets trace::validate::tests::file_touch_refreshes_edit_misses567 PASS [ 0.028s] ( 548/1004) iets trace::watch::tests::only_the_paths_an_mtime_can_speak_for568 PASS [ 0.063s] ( 549/1004) iets trace::validate::tests::dir_stat_env_checks569 PASS [ 0.049s] ( 550/1004) iets trace::validate::tests::what_a_native_path_records_validates570 PASS [ 0.019s] ( 551/1004) iets trace::wire::tests::drvs_sources_roots_roundtrip571 PASS [ 0.024s] ( 552/1004) iets trace::wire::tests::readset_roundtrip572 PASS [ 0.043s] ( 553/1004) iets treestore::pack::tests::a_pack_reads_back_what_was_written573 PASS [ 0.041s] ( 554/1004) iets treestore::pack::tests::a_reader_sees_a_pack_written_after_it_listed574 PASS [ 0.051s] ( 555/1004) iets treestore::pack::tests::a_set_finds_objects_across_packs_and_drops_a_broken_one575 PASS [ 0.022s] ( 556/1004) iets treestore::pack::tests::an_empty_writer_leaves_no_file576 PASS [ 0.041s] ( 557/1004) iets treestore::pack::tests::collect_removes_dead_packs_and_compacts_mostly_dead_ones577 PASS [ 0.043s] ( 558/1004) iets treestore::tests::a_flat_file_is_named_by_the_hash_of_its_bytes578 PASS [ 0.018s] ( 559/1004) iets treestore::tests::a_staged_directory_goes_when_it_is_dropped579 PASS [ 1.787s] ( 560/1004) iets fetch::http::tests::a_decompression_bomb_is_refused580 PASS [ 0.010s] ( 561/1004) iets treestore::tests::a_tree_is_named_by_its_nar_hash581 PASS [ 0.062s] ( 562/1004) iets treestore::tests::a_put_after_a_collection_brings_its_own_objects582 PASS [ 0.135s] ( 563/1004) iets treestore::pack::tests::a_changed_index_byte_is_not_a_pack583 PASS [ 0.035s] ( 564/1004) iets treestore::tests::a_stored_input_reads_back_and_a_wrong_hash_is_refused584 PASS [ 0.011s] ( 565/1004) iets::aterm_crosscheck fixed_output_path_is_recomputed_not_trusted585 PASS [ 0.036s] ( 566/1004) iets treestore::tests::two_inputs_share_their_common_files586 PASS [ 0.023s] ( 567/1004) iets::aterm_crosscheck bytes_that_are_not_utf8_roundtrip587 PASS [ 0.026s] ( 568/1004) iets::aterm_crosscheck fixed_output_inputs_hide_their_provenance588 PASS [ 1.455s] ( 569/1004) iets lint::flake_cases::a_pre_existing_store_path_is_still_a_recopy589 PASS [ 0.016s] ( 570/1004) iets::aterm_crosscheck harmonia_cases_roundtrip590 PASS [ 0.017s] ( 571/1004) iets::aterm_crosscheck floating_ca_defers_itself_and_downstream591 PASS [ 0.008s] ( 572/1004) iets::aterm_crosscheck masked_and_unmasked_hashes_differ_once_filled592 PASS [ 0.233s] ( 573/1004) iets trace::validate::tests::the_lowest_failing_observation_is_the_one_reported593 PASS [ 0.026s] ( 574/1004) iets::aterm_crosscheck malformed_aterm_is_an_error594 PASS [ 0.021s] ( 575/1004) iets::aterm_crosscheck upstream_bad_drvs_are_rejected595 PASS [ 0.022s] ( 576/1004) iets::aterm_crosscheck upstream_input_addressed_paths_recompute596 PASS [ 0.083s] ( 577/1004) iets treestore::tests::collect_keeps_what_an_entry_names597 PASS [ 0.027s] ( 578/1004) iets::aterm_crosscheck upstream_bench_drvs_parse_and_reprint_stably598 PASS [ 0.027s] ( 579/1004) iets::aterm_crosscheck upstream_drvs_roundtrip_byte_exact599 PASS [ 0.015s] ( 580/1004) iets::aterm_crosscheck upstream_invariants_ca_floating_dependency600 PASS [ 0.032s] ( 581/1004) iets::aterm_crosscheck upstream_invariants_fill_in_deferred601 PASS [ 0.029s] ( 582/1004) iets::aterm_crosscheck upstream_invariants_input_addressed_kept_or_rejected602 PASS [ 0.032s] ( 583/1004) iets::cache_hygiene an_input_observation_marks_its_entry_as_used603 PASS [ 0.034s] ( 584/1004) iets::cache_hygiene a_corrupt_entry_is_dropped_and_a_corrupt_store_is_wiped604 PASS [ 0.022s] ( 585/1004) iets::cache_hygiene input_touch_child605 PASS [ 0.044s] ( 586/1004) iets::cache_hygiene an_entry_that_is_not_a_plain_file_is_refused606 PASS [ 0.047s] ( 587/1004) iets::cache_hygiene a_changed_byte_or_a_copied_entry_is_a_miss607 PASS [ 0.014s] ( 588/1004) iets::cache_hygiene unix_only::a_link_or_a_fifo_is_not_an_entry608 PASS [ 0.042s] ( 589/1004) iets::cache_hygiene unix_only::a_cache_is_private_to_its_owner609 PASS [ 0.078s] ( 590/1004) iets::cache_hygiene cache_gc_removes_entries_past_the_ttl610 PASS [ 0.328s] ( 591/1004) iets::cache_semantics a_lint_warning_is_replayed_on_a_hit611 PASS [ 0.689s] ( 592/1004) iets trace::tests::dedupe_of_many_repeats_is_linear612 PASS [ 0.350s] ( 593/1004) iets::cache_semantics a_hit_prints_paths_and_positions_the_same613 PASS [ 0.900s] ( 594/1004) iets syntax::tests::lang_corpus614 PASS [ 0.660s] ( 595/1004) iets::cache_semantics a_copy_in_place_misses615 PASS [ 0.648s] ( 596/1004) iets::cache_semantics a_pure_run_never_reads_an_impure_entry616 PASS [ 0.737s] ( 597/1004) iets::cache_hygiene concurrent_readers_and_writers_never_see_a_torn_entry617 PASS [ 0.573s] ( 598/1004) iets::cache_semantics the_cache_dir_keeps_what_it_did_not_make618 PASS [ 0.593s] ( 599/1004) iets::cache_semantics the_file_argument_keeps_one_entry619 PASS [ 0.471s] ( 600/1004) iets::cli a_bad_command_line_names_the_problem620 PASS [ 0.291s] ( 601/1004) iets::cli build_evaluates_every_installable621 PASS [ 1.344s] ( 602/1004) iets::cache_semantics a_flake_keeps_one_entry622 PASS [ 1.022s] ( 603/1004) iets::cache_semantics search_uses_the_cache623 PASS [ 0.702s] ( 604/1004) iets::cli a_flake_fragment_completes_to_the_outputs_attribute_names624 PASS [ 0.291s] ( 605/1004) iets::cli completion_asks_the_binary_and_ignores_settings625 PASS [ 0.603s] ( 606/1004) iets::cli build_cache_ignores_installable_order626 PASS [ 0.200s] ( 607/1004) iets::cli eval_json_forces_without_strict627 PASS [ 0.151s] ( 608/1004) iets::cli io_errors_read_like_strerror628 PASS [ 0.022s] ( 609/1004) iets::diff an_unknown_flag_is_a_usage_error629 PASS [ 0.322s] ( 610/1004) iets::cli help_and_version_go_to_stdout630 PASS [ 0.442s] ( 611/1004) iets::cli dash_a_completes_the_attribute_names_under_its_root631 PASS [ 0.057s] ( 612/1004) iets::diff one_side_is_a_usage_error632 PASS [ 0.216s] ( 613/1004) iets::diff depth_zero_stops_at_the_input_derivation633 PASS [ 0.300s] ( 614/1004) iets::diff an_env_name_that_repeats_the_derivation_name_is_left_out634 PASS [ 1.316s] ( 615/1004) iets::cache_semantics uncacheable_runs_write_nothing635 PASS [ 0.715s] ( 616/1004) iets::cli dash_f_names_the_file_in_the_native_namespace636 PASS [ 0.251s] ( 617/1004) iets::diff two_installables_are_one_evaluation_each637 PASS [ 0.287s] ( 618/1004) iets::diff the_text_names_the_env_the_source_and_the_input_drv638 PASS [ 0.389s] ( 619/1004) iets::diff equal_derivations_exit_0639 PASS [ 0.517s] ( 620/1004) iets::diff the_json_object_names_the_same_differences640 PASS [ 2.365s] ( 621/1004) iets::cache_semantics flags_that_turn_the_cache_off641 FAIL [ 0.328s] ( 622/1004) iets::e2e_build dry_run_over_a_tree642 stdout ---643644 running 1 test645 test dry_run_over_a_tree ... FAILED646647 failures:648649 failures:650 dry_run_over_a_tree651652 test result: FAILED. 0 passed; 1 failed; 0 ignored; 0 measured; 6 filtered out; finished in 0.32s653 654 stderr ---655656 thread 'dry_run_over_a_tree' (4072) panicked at tests/e2e_build.rs:164:5:657 error: nothing to build: the expression has no derivation in it658659 note: run with `RUST_BACKTRACE=1` environment variable to display a backtrace660661 Cancelling due to test failure: 15 tests still running662 PASS [ 0.855s] ( 623/1004) iets::diff dash_f_is_the_positional_file663 FAIL [ 0.374s] ( 624/1004) iets::e2e_build a_tree_builds_past_a_failure664 stdout ---665666 running 1 test667 test a_tree_builds_past_a_failure ... FAILED668669 failures:670671 failures:672 a_tree_builds_past_a_failure673674 test result: FAILED. 0 passed; 1 failed; 0 ignored; 0 measured; 6 filtered out; finished in 0.35s675 676 stderr ---677678 thread 'a_tree_builds_past_a_failure' (4080) panicked at tests/e2e_build.rs:59:5:679 assertion `left == right` failed: error: nothing to build: the expression has no derivation in it680681 left: Some(1)682 right: Some(100)683 note: run with `RUST_BACKTRACE=1` environment variable to display a backtrace684685 PASS [ 0.430s] ( 625/1004) iets::e2e_build no_build_uploads_every_installable686 PASS [ 3.793s] ( 626/1004) iets runtime::value::alloc_tests::a_full_string_table_records_no_more_but_still_shares687 PASS [ 0.876s] ( 627/1004) iets::e2e_build a_build_log_cannot_forge_a_hash_mismatch688 PASS [ 0.555s] ( 628/1004) iets::e2e_build no_verdict_without_an_evaluation689 FAIL [ 0.598s] ( 629/1004) iets::e2e_build one_root690 stdout ---691692 running 1 test693 test one_root ... FAILED694695 failures:696697 failures:698 one_root699700 test result: FAILED. 0 passed; 1 failed; 0 ignored; 0 measured; 6 filtered out; finished in 0.59s701 702 stderr ---703704 thread 'one_root' (4219) panicked at tests/e2e_build.rs:148:5:705 error: nothing to build: the expression has no derivation in it706707 note: run with `RUST_BACKTRACE=1` environment variable to display a backtrace708709 PASS [ 0.975s] ( 630/1004) iets::e2e_build a_failure_in_a_dependency710 PASS [ 5.595s] ( 631/1004) iets api::run::tests::helper_fibers_read_the_ir_cache711 PASS [ 5.292s] ( 632/1004) iets lint::fixtures::every_lint_fires_on_its_fixture_only_when_asked712 PASS [ 4.423s] ( 633/1004) iets::cache_semantics hits_and_misses713 PASS [ 9.378s] ( 634/1004) iets api::concurrent_eval::concurrent_eval_sums_arena_use_over_workers714 PASS [ 9.088s] ( 635/1004) iets runtime::value::tests::union_iteration_merges_like_a_fold715 PASS [ 24.858s] ( 636/1004) iets syntax::tests::deep_nesting_ends_with_an_error716 SLOW [> 60.000s] (---------) iets api::concurrent_eval::concurrent_eval_matches_sequential_eval717 SLOW [>120.000s] (---------) iets api::concurrent_eval::concurrent_eval_matches_sequential_eval718 SLOW [>180.000s] (---------) iets api::concurrent_eval::concurrent_eval_matches_sequential_eval719 SLOW [>240.000s] (---------) iets api::concurrent_eval::concurrent_eval_matches_sequential_eval720 PASS [ 273.764s] ( 637/1004) iets api::concurrent_eval::concurrent_eval_matches_sequential_eval721------------722 Summary [ 273.770s] 637/1004 tests run: 634 passed (1 slow), 3 failed, 6 skipped723 FAIL [ 0.328s] ( 622/1004) iets::e2e_build dry_run_over_a_tree724 FAIL [ 0.374s] ( 624/1004) iets::e2e_build a_tree_builds_past_a_failure725 FAIL [ 0.598s] ( 629/1004) iets::e2e_build one_root726warning: 367/1004 tests were not run due to test failure (run with --no-fail-fast to run all tests, or run with --max-fail)727error: test run failed