nixbot

builds

failed iets-nextest-0.1.0 checks.x86_64-linux.test · build #376 · raw

unpackPhase
1unpacking source archive /nix/store/zjjisyn6j6gnm51xr1f41i0jr8irja06-source2source root is source
patchPhase
3Executing configureCargoCommonVars4decompressing cargo artifacts from /nix/store/4ag17s7r3x70qan6yhkvb308lflc1jrh-iets-deps-0.1.0/target.tar.zst to target
configurePhase
5will append /build/source/.cargo-home/config.toml with contents of /nix/store/a8si5lqcnsxaa7nv2zfpl0vi6iqck9mw-vendor-cargo-deps/config.toml6default configurePhase, nothing to do
buildPhase
7+++ command cargo --version8cargo 1.98.0 (797e8a9bc 2026-08-05)9+++ command cargo nextest --version10cargo-nextest 0.9.14611release: 0.9.14612host: x86_64-unknown-linux-gnu
checkPhase
13+++ command cargo nextest run --cargo-profile dev14 Compiling iets v0.1.0 (/build/source)15 Finished `dev` profile [unoptimized + debuginfo] target(s) in 1m 00s16------------17 Nextest run ID 48e1609e-1247-48b0-985e-3d0b00cac459 with nextest profile: default18 Starting 631 tests across 13 binaries (5 tests skipped)19 PASS [ 0.039s] ( 1/631) iets build::fanout::tests::a_failed_dependency_blocks_its_dependants20 PASS [ 0.039s] ( 2/631) iets build::backend::tests::output_specs21 PASS [ 0.039s] ( 3/631) iets build::render::tests::a_build_log_never_reports_a_mismatch22 PASS [ 0.036s] ( 4/631) iets build::backend::tests::the_timings_report_with_every_line23 PASS [ 0.039s] ( 5/631) iets api::drvshow::tests::floats_take_nlohmanns_form24 PASS [ 0.039s] ( 6/631) iets build::executor::tests::no_place_at_all_is_a_usage_error25 PASS [ 0.043s] ( 7/631) iets build::executor::tests::a_declared_system_filters26 PASS [ 0.045s] ( 8/631) iets api::fetch::tests::the_fake_hash_moves_the_output_and_the_drv27 PASS [ 0.043s] ( 9/631) iets build::render::tests::a_failure_after_the_activity_ended_never_claims_a_success28 PASS [ 0.042s] ( 10/631) iets build::backend::tests::base_names_drop_the_store_dir29 PASS [ 0.043s] ( 11/631) iets build::executor::tests::one_place_declaring_nothing_takes_everything30 PASS [ 0.044s] ( 12/631) iets build::executor::tests::an_unsupported_url_says_what_is_expected31 PASS [ 0.044s] ( 13/631) iets build::fixhash::tests::two_matches_are_left_alone32 PASS [ 0.044s] ( 14/631) iets build::fanout::tests::dependencies_run_first33 PASS [ 0.044s] ( 15/631) iets build::fixhash::tests::a_longer_hash_is_not_a_match34 PASS [ 0.043s] ( 16/631) iets build::executor::tests::a_refusal_names_every_place_and_what_it_declared35 PASS [ 0.045s] ( 17/631) iets api::drvshow::tests::a_multi_output_derivation36 PASS [ 0.044s] ( 18/631) iets build::event::tests::durations37 PASS [ 0.044s] ( 19/631) iets build::executor::tests::a_feature_the_place_lacks_rules_it_out38 PASS [ 0.045s] ( 20/631) iets api::drvshow::tests::inputs_and_structured_attrs39 PASS [ 0.046s] ( 21/631) iets api::drvshow::tests::a_non_canonical_structured_attrs_text_is_renormalised40 PASS [ 0.046s] ( 22/631) iets api::fetch::tests::only_a_fixed_output_drv_can_be_prefetched41 PASS [ 0.051s] ( 23/631) iets api::drvshow::tests::pretty_matches_serde_json42 PASS [ 0.050s] ( 24/631) iets api::drvshow::tests::a_fixed_output_shows_its_content_address_and_no_path43 PASS [ 0.049s] ( 25/631) iets build::executor::tests::the_first_place_that_takes_it_wins44 PASS [ 0.050s] ( 26/631) iets api::installable::tests::default_and_fragment_attr_paths45 PASS [ 0.018s] ( 27/631) iets build::render::tests::a_long_attribute_keeps_its_ends46 PASS [ 0.054s] ( 28/631) iets argv::tests::every_byte_round_trips47 PASS [ 0.019s] ( 29/631) iets build::render::tests::a_failure_shows_a_short_extract48 PASS [ 0.018s] ( 30/631) iets build::render::tests::an_owned_build_is_verdicted_once_by_its_op49 PASS [ 0.058s] ( 31/631) iets api::installable::tests::the_name_a_program_takes_from_a_derivation_name50 PASS [ 0.018s] ( 32/631) iets build::render::tests::an_unfolded_success_ends_with_its_verdict51 PASS [ 0.022s] ( 33/631) iets build::render::tests::a_stalled_build_that_fails_still_shows_its_cause52 PASS [ 0.063s] ( 34/631) iets build::render::tests::a_build_the_backend_saw_succeed_is_verdicted_at_once53 PASS [ 0.065s] ( 35/631) iets build::render::tests::a_daemon_failure_message_decides_the_verdict54 PASS [ 0.026s] ( 36/631) iets build::render::tests::ci_folds_a_success_and_never_a_failure55 PASS [ 0.067s] ( 37/631) iets build::fixhash::tests::one_match_is_rewritten_in_its_own_spelling56 PASS [ 0.013s] ( 38/631) iets build::tests::targets_become_jobs57 PASS [ 0.026s] ( 39/631) iets build::render::tests::drv_paths_of_a_failure_message58 PASS [ 0.017s] ( 40/631) iets build::render::tests::one_build_needs_no_summary59 PASS [ 0.024s] ( 41/631) iets build::render::tests::tty_keeps_successful_logs_off_the_screen60 PASS [ 0.027s] ( 42/631) iets build::render::tests::the_status_line_takes_the_colours_of_the_rows_above61 PASS [ 0.028s] ( 43/631) iets builtins::derivation::tests::a_dynamic_output_renders_the_placeholder_nix_renders62 PASS [ 0.025s] ( 44/631) iets builtins::store_hooks::tests::a_relative_path_inside_an_entry_joins_once63 PASS [ 0.025s] ( 45/631) iets builtins::fetch_git::tests::a_working_tree_is_a_file_url_of_an_absolute_path64 PASS [ 0.027s] ( 46/631) iets build::render::tests::the_summary_follows_more_than_one_build65 PASS [ 0.034s] ( 47/631) iets build::render::tests::the_live_region_spins_and_counts66 PASS [ 0.027s] ( 48/631) iets build::render::tests::logs_of_two_builds_do_not_interleave67 PASS [ 0.028s] ( 49/631) iets build::tests::hash_stripping68 PASS [ 0.028s] ( 50/631) iets builtins::derivation::tests::the_two_placeholders_are_not_the_same69 PASS [ 0.015s] ( 51/631) iets cachefs::tests::a_stamp_in_the_future_is_due70 PASS [ 0.024s] ( 52/631) iets builtins::text::fromtoml::tests::new_escapes_are_refused71 PASS [ 0.033s] ( 53/631) iets build::render::tests::heartbeat_names_running_builds72 PASS [ 0.032s] ( 54/631) iets builtins::text::regex::tests::names73 PASS [ 0.030s] ( 55/631) iets builtins::fetch_git::tests::only_a_plain_rev_or_ref_is_read_by_iets74 PASS [ 0.026s] ( 56/631) iets builtins::text::fromtoml::tests::inline_tables_stay_on_one_line75 PASS [ 0.029s] ( 57/631) iets cachefs::tests::a_directory_that_is_not_ours_is_refused_untouched76 PASS [ 0.109s] ( 58/631) iets build::fanout::tests::at_most_limit_builds_run_at_once77 PASS [ 0.058s] ( 59/631) iets build::tests::a_target_with_no_verdict_fails78 PASS [ 0.030s] ( 60/631) iets cachefs::tests::a_wipe_keeps_what_iets_did_not_create79 PASS [ 0.026s] ( 61/631) iets cachefs::tests::a_wait_lock_waits_for_its_holder80 PASS [ 0.044s] ( 62/631) iets builtins::text::regex::tests::size_limit81 PASS [ 0.030s] ( 63/631) iets cachefs::tests::a_store_without_a_version_file_is_wiped_once82 PASS [ 0.033s] ( 64/631) iets cachefs::tests::a_sweep_runs_once_per_interval83 PASS [ 0.029s] ( 65/631) iets cachefs::tests::a_wipe_of_the_ir_cache_walks_its_shards84 PASS [ 0.034s] ( 66/631) iets cachefs::tests::a_touch_inside_the_interval_writes_nothing85 PASS [ 0.061s] ( 67/631) iets build::tests::a_fan_out_backend_keeps_the_cap_and_the_log_blocks86 PASS [ 0.029s] ( 68/631) iets cachefs::tests::an_empty_directory_is_ours_to_take87 PASS [ 0.020s] ( 69/631) iets cachefs::tests::sweep_drops_old_entries_and_keeps_young_ones88 PASS [ 0.023s] ( 70/631) iets cachefs::tests::version_mismatch_wipes_the_store89 PASS [ 0.024s] ( 71/631) iets cachefs::tests::sweep_ages_a_root_by_its_link_not_by_what_it_names90 PASS [ 0.035s] ( 72/631) iets cachefs::tests::an_input_store_of_the_spool_layout_is_wiped91 PASS [ 0.035s] ( 73/631) iets cachefs::tests::garbled_stamp_wipes_the_store92 PASS [ 0.035s] ( 74/631) iets cli::build::tests::a_failed_build_reports_itself93 PASS [ 0.020s] ( 75/631) iets cli::complete::tests::a_positional_is_left_to_the_shell94 PASS [ 0.023s] ( 76/631) iets cli::build::tests::no_build_result_is_named95 PASS [ 0.025s] ( 77/631) iets cli::build::tests::an_out_flag_that_matches_nothing_is_named96 PASS [ 0.026s] ( 78/631) iets cli::build::tests::out_links_are_named_as_nix_build_names_them97 PASS [ 0.022s] ( 79/631) iets cli::classic::shell::tests::sh_var_names98 PASS [ 0.024s] ( 80/631) iets cli::build::tests::installables_are_sorted_without_repeats99 PASS [ 0.024s] ( 81/631) iets cli::classic::shell::tests::declares_for_every_bash_shaped_value100 PASS [ 0.026s] ( 82/631) iets cli::classic::shell::tests::outputs_become_placeholders101 PASS [ 0.028s] ( 83/631) iets cli::build::tests::no_outcome_at_all_is_named102 PASS [ 0.027s] ( 84/631) iets cli::complete::tests::a_flag_value_completes_by_its_placeholder103 PASS [ 0.048s] ( 85/631) iets cachefs::tests::sweep_walks_the_shards_of_the_ir_cache104 PASS [ 0.024s] ( 86/631) iets cli::complete::tests::every_script_asks_the_binary105 PASS [ 0.028s] ( 87/631) iets cli::complete::tests::commands_complete_with_their_summary106 PASS [ 0.048s] ( 88/631) iets cli::build::tests::a_path_on_stdout_is_silent107 PASS [ 0.034s] ( 89/631) iets cli::classic::tests::a_flag_with_no_effect_is_noted_and_one_that_holds_is_not108 PASS [ 0.045s] ( 90/631) iets cli::build::tests::a_success_with_no_output_path_is_named109 PASS [ 0.017s] ( 91/631) iets cli::help::tests::messages110 PASS [ 0.023s] ( 92/631) iets cli::diff::tests::a_name_ends_at_the_first_dash_before_a_digit111 PASS [ 0.020s] ( 93/631) iets cli::docs::tests::the_topic_list_fits_80_columns112 PASS [ 0.034s] ( 94/631) iets cli::complete::tests::flags_complete_after_a_dash113 PASS [ 0.029s] ( 95/631) iets cli::help::tests::help_fits_80_columns114 PASS [ 0.037s] ( 96/631) iets cli::complete::tests::subcommands_and_topics115 PASS [ 0.033s] ( 97/631) iets cli::help::tests::a_mistyped_command_is_suggested116 PASS [ 0.033s] ( 98/631) iets cli::plumbing::tests::a_url_is_the_positional_fetch_takes_itself117 PASS [ 0.030s] ( 99/631) iets cli::render::text::tests::a_long_value_shows_the_lines_that_differ118 PASS [ 0.033s] (100/631) iets cli::render::tests::sizes_render_as_nix_renders_them119 PASS [ 0.033s] (101/631) iets cli::plumbing::tests::a_file_url_needs_one_slash_not_three120 PASS [ 0.038s] (102/631) iets cli::docs::tests::topics_resolve_bare_and_qualified121 PASS [ 0.042s] (103/631) iets cli::docs::tests::every_embedded_page_has_a_heading122 PASS [ 0.023s] (104/631) iets cli::search::tests::merged_highlights123 PASS [ 0.009s] (105/631) iets config::tests::an_alias_is_its_setting124 PASS [ 0.019s] (106/631) iets config::tests::a_classic_name_leaves_an_unimplemented_setting_to_nix125 PASS [ 0.124s] (107/631) iets cachefs::tests::a_lock_that_cannot_be_opened_is_not_a_busy_lock126 PASS [ 0.109s] (108/631) iets cachefs::tests::the_writer_lock_excludes_one_holder_at_a_time127 PASS [ 0.032s] (109/631) iets config::tests::extra_appends_to_list_settings_only128 PASS [ 0.059s] (110/631) iets cli::search::tests::drv_names129 PASS [ 0.073s] (111/631) iets cli::help::tests::suggestions_come_from_the_help130 PASS [ 0.065s] (112/631) iets cli::search::tests::index_round_trip131 PASS [ 0.047s] (113/631) iets config::tests::a_setting_with_no_effect_is_noted132 PASS [ 0.044s] (114/631) iets config::tests::bad_typed_values_error_where_they_are_set133 PASS [ 0.016s] (115/631) iets config::tests::syntax_errors134 PASS [ 0.010s] (116/631) iets config::tests::typed_getters_and_defaults135 PASS [ 0.044s] (117/631) iets config::tests::basic_syntax136 PASS [ 0.048s] (118/631) iets config::tests::max_jobs_auto_is_the_cpu_count137 PASS [ 0.048s] (119/631) iets config::tests::bool_spellings138 PASS [ 0.031s] (120/631) iets config::tests::overrides_win_over_files139 PASS [ 0.018s] (121/631) iets config::tests::the_setting_tables_name_nix_settings140 PASS [ 0.081s] (122/631) iets cli::run::tests::a_usage_error_is_an_exit_code_and_a_message141 PASS [ 0.012s] (123/631) iets config::tests::unknown_settings_are_kept142 PASS [ 0.044s] (124/631) iets config::tests::missing_include_errors_and_bang_include_does_not143 PASS [ 0.047s] (125/631) iets config::tests::option_nix_path_replaces_nix_path_and_extra_adds144 PASS [ 0.054s] (126/631) iets config::tests::include_chain145 PASS [ 0.012s] (127/631) iets devenv::tests::non_bash_builder_is_refused146 PASS [ 0.027s] (128/631) iets config::tests::the_daemon_gets_the_store_settings_set_outside_the_system_file147 PASS [ 0.009s] (129/631) iets devenv::tests::shell_escaping148 PASS [ 0.015s] (130/631) iets devenv::tests::cached_result_roundtrip149 PASS [ 0.012s] (131/631) iets display::tests::a_full_width_line_keeps_its_last_column150 PASS [ 0.014s] (132/631) iets devenv::tests::rewrites_apply_in_map_order_to_every_occurrence151 PASS [ 0.019s] (133/631) iets devenv::tests::get_env_sh_store_path_matches_nix152 PASS [ 0.024s] (134/631) iets config::tests::user_conf_files_are_in_precedence_order153 PASS [ 0.016s] (135/631) iets devenv::tests::output_checks_are_erased_only_when_present154 PASS [ 0.026s] (136/631) iets devenv::tests::json_roundtrip_and_bash_forms155 PASS [ 0.022s] (137/631) iets devenv::tests::rc_script_rewrites_outputs_and_writes_attrs156 PASS [ 0.014s] (138/631) iets display::tests::colour_and_width157 PASS [ 0.020s] (139/631) iets display::tests::a_resize_burst_never_erases158 PASS [ 0.025s] (140/631) iets display::tests::a_frame_is_one_synchronized_write159 PASS [ 0.014s] (141/631) iets display::tests::output_starts_at_the_origin160 PASS [ 0.015s] (142/631) iets display::tests::the_region_keeps_its_rows_until_a_smaller_size_lasts161 PASS [ 0.016s] (143/631) iets display::tests::the_region_comes_down_on_close162 PASS [ 0.030s] (144/631) iets display::tests::a_region_taller_than_the_screen_is_clamped163 PASS [ 0.023s] (145/631) iets display::tests::output_scrolls_and_the_region_stays_at_the_bottom164 PASS [ 0.019s] (146/631) iets display::tests::wrapped_output_does_not_corrupt_the_region165 PASS [ 0.030s] (147/631) iets display::tests::a_region_that_grows_and_shrinks_loses_no_output166 PASS [ 0.029s] (148/631) iets display::tests::growth_does_not_eat_output167 PASS [ 0.073s] (149/631) iets display::tests::a_resize_keeps_one_region168 PASS [ 0.329s] (150/631) iets builtins::text::regex::tests::long_inputs_do_not_recurse169 PASS [ 0.552s] (151/631) iets api::value::tests::construction170 PASS [ 0.565s] (152/631) iets api::value::tests::thunk_reads_as_thunk171 PASS [ 0.570s] (153/631) iets api::value::tests::attrs_by_name_and_index172 PASS [ 0.536s] (154/631) iets builtins::fetch::tests::nix_sees_no_mark173 PASS [ 0.595s] (155/631) iets api::value::tests::apply_is_lazy174 PASS [ 0.364s] (156/631) iets eval::tests::a_second_pseudo_file_keeps_its_own_positions175 PASS [ 0.557s] (157/631) iets builtins::fetch::tests::the_mark_follows_the_string_like_store_context176 PASS [ 0.629s] (158/631) iets api::value::tests::force_deep_forces_the_whole_tree177 PASS [ 0.469s] (159/631) iets compile::cache::tests::a_malformed_entry_is_a_miss_and_never_a_crash178 PASS [ 0.649s] (160/631) iets api::value::tests::wrong_type_is_an_error179 PASS [ 0.025s] (161/631) iets fetch::http::tests::credentials_stay_on_the_first_origin180 PASS [ 0.049s] (162/631) iets fetch::http::tests::credentials_in_the_url_are_sent_and_never_printed181 PASS [ 0.464s] (163/631) iets eval::tests::a_function_select_is_a_fresh_slot_when_its_subject_is_forced182 PASS [ 0.028s] (164/631) iets fetch::http::tests::file_urls_name_a_local_path183 PASS [ 0.015s] (165/631) iets fetch::http::tests::magic_bytes184 PASS [ 0.013s] (166/631) iets fetch::http::tests::redirects_keep_credentials_only_on_the_same_origin185 PASS [ 0.680s] (167/631) iets builtins::fetch::tests::an_entry_of_the_compiled_file_cache_keeps_the_site186 PASS [ 0.019s] (168/631) iets fetch::http::tests::urls_split187 PASS [ 0.028s] (169/631) iets fetch::http::tests::trailing_bytes_and_a_second_layer188 PASS [ 0.017s] (170/631) iets fetch::roots::tests::an_empty_nix_ssl_cert_file_hides_ssl_cert_file189 PASS [ 0.045s] (171/631) iets fetch::http::tests::redirects_resolve190 PASS [ 0.017s] (172/631) iets fetch::roots::tests::a_named_file_that_is_missing_or_empty_is_an_error191 PASS [ 0.016s] (173/631) iets fetch::roots::tests::nix_ssl_cert_file_wins_over_ssl_cert_file_and_the_platform192 PASS [ 0.021s] (174/631) iets fetch::roots::tests::the_platform_store_wins_over_the_compiled_in_set193 PASS [ 0.127s] (175/631) iets fetch::http::tests::downloads_stop_at_the_size_limit194 PASS [ 0.814s] (176/631) iets api::value::tests::lists195 PASS [ 0.756s] (177/631) iets builtins::store_hooks::tests::virtual_tree_reads_go_to_the_local_files196 PASS [ 0.055s] (178/631) iets fetch::roots::tests::no_bundle_anywhere_gives_the_compiled_in_set197 PASS [ 0.582s] (179/631) iets eval::tests::fetch_mercurial_names_a_way_out198 PASS [ 0.039s] (180/631) iets fetch::spool::tests::an_empty_archive_is_an_empty_directory199 PASS [ 0.032s] (181/631) iets fetch::spool::tests::archives_the_git_sink_accepts200 PASS [ 0.056s] (182/631) iets fetch::spool::tests::a_sparse_member_counts_against_the_size_limit201 PASS [ 0.021s] (183/631) iets fetch::spool::tests::nar_hash_of_the_fixture202 PASS [ 0.037s] (184/631) iets fetch::spool::tests::pax_sparse_members_are_expanded203 PASS [ 0.028s] (185/631) iets fetch::spool::tests::the_errors_match204 PASS [ 0.054s] (186/631) iets fetch::spool::tests::spool_matches_the_tree_on_the_top_level205 PASS [ 0.043s] (187/631) iets fetch::unpack::tests::a_repeated_member_keeps_the_last_copy206 PASS [ 0.044s] (188/631) iets fetch::spool::tests::the_scratch_file_never_follows_a_symlink207 PASS [ 0.947s] (189/631) iets api::run::tests::a_fiber_template_carries_the_configuration208 PASS [ 0.374s] (190/631) iets fetch::unpack::tests::an_unsupported_member_type_is_an_error209 PASS [ 0.351s] (191/631) iets fetch::unpack::tests::keeps_the_root_when_it_is_not_a_single_directory210 PASS [ 0.350s] (192/631) iets fetch::unpack::tests::member_names_are_made_relative_and_cannot_escape211 PASS [ 1.037s] (193/631) iets eval::tests::an_invalid_regex_fails_before_the_string_is_forced212 PASS [ 1.288s] (194/631) iets api::value::tests::calling_a_function213 PASS [ 1.129s] (195/631) iets compile::cache::tests::a_changed_byte_of_a_stored_entry_is_a_miss214 PASS [ 0.501s] (196/631) iets fetch::spool::tests::a_changed_index_byte_is_a_miss215 PASS [ 0.473s] (197/631) iets fetch::spool::tests::a_stored_tree_dumps_the_spools_nar216 PASS [ 1.285s] (198/631) iets api::value::tests::strings_and_context217 PASS [ 0.361s] (199/631) iets fetch::unpack::tests::modes_symlinks_and_empty_dirs218 PASS [ 0.519s] (200/631) iets fetch::spool::tests::a_hard_link_never_replaces_a_member219 PASS [ 0.452s] (201/631) iets fetch::spool::tests::spool_matches_the_tree220 PASS [ 1.310s] (202/631) iets api::value::tests::missing_attribute221 PASS [ 0.035s] (203/631) iets fetch::unpack::tests::nar_hash_of_the_fixture222 PASS [ 0.039s] (204/631) iets flake::flakeref::tests::parses_the_kept_schemes223 PASS [ 0.041s] (205/631) iets flake::flakeref::tests::git_urls_are_fixed_like_nix224 PASS [ 0.048s] (206/631) iets flake::flakeref::tests::errors_and_unsupported225 PASS [ 0.039s] (207/631) iets flake::flakeref::tests::round_trips226 PASS [ 0.046s] (208/631) iets flake::tests::attr_paths227 PASS [ 0.033s] (209/631) iets jobs::line::tests::split_and_round_trip228 PASS [ 0.061s] (210/631) iets flake::flakeref::tests::refuses_a_github_ref_named_twice229 PASS [ 0.048s] (211/631) iets flake::tests::refs_resolve_against_cwd_and_home230 PASS [ 0.022s] (212/631) iets lint::allow::tests::comment_names231 PASS [ 0.060s] (213/631) iets flake::tests::a_pinned_checkout_is_its_revision232 PASS [ 0.059s] (214/631) iets flake::flakeref::tests::to_string_from_attrs233 PASS [ 0.043s] (215/631) iets jobs::line::tests::error_line_round_trip234 PASS [ 0.055s] (216/631) iets jobs::constituents::tests::topo_sort_orders_and_detects_cycles235 PASS [ 0.076s] (217/631) iets fetch::unpack::tests::strips_one_leading_component236 PASS [ 0.028s] (218/631) iets lint::allow::tests::lines237 PASS [ 0.059s] (219/631) iets lint::cases::a_project_file_may_not_set_nix_bin_dir238 PASS [ 1.254s] (220/631) iets compile::cache::tests::nesting_past_the_cap_misses239 PASS [ 0.806s] (221/631) iets fetch::http::tests::a_transient_status_is_retried240 PASS [ 0.103s] (222/631) iets jobs::line::tests::stats_survive_the_collector241 PASS [ 1.204s] (223/631) iets eval::tests::derivation_wrapper_exists242 PASS [ 1.219s] (224/631) iets eval::tests::derivation_keeps_env_and_args_that_are_not_utf8243 PASS [ 0.020s] (225/631) iets lint::site::tests::a_literal_lint_of_nix_has_an_edit244 PASS [ 0.031s] (226/631) iets lint::site::tests::the_span_is_the_innermost_node_of_the_kind_of_the_lint245 PASS [ 0.040s] (227/631) iets lint::tests::an_unknown_name_is_a_warning_in_a_file_and_an_error_in_a_flag246 PASS [ 0.026s] (228/631) iets lint::tests::keys247 PASS [ 0.923s] (229/631) iets fetch::http::tests::a_decompression_bomb_is_refused248 PASS [ 0.028s] (230/631) iets lint::tests::names_are_unique_kebab_case249 PASS [ 0.027s] (231/631) iets lint::tests::scope_and_inputs250 PASS [ 0.027s] (232/631) iets lint::tests::selectors_and_order251 PASS [ 0.023s] (233/631) iets lint::tests::specificity_inside_a_source_and_order_between_sources252 PASS [ 0.024s] (234/631) iets lint::tests::the_project_file_walk_stops_at_the_project_root253 PASS [ 0.026s] (235/631) iets lint::tests::toml_table254 PASS [ 1.342s] (236/631) iets eval::tests::from_json_and_toml_reject_null_bytes255 PASS [ 0.045s] (237/631) iets log::tests::a_coloured_error_is_an_error_record256 PASS [ 0.033s] (238/631) iets log::tests::a_fixed_hash_has_the_shape_of_a_finding_with_an_edit257 PASS [ 0.031s] (239/631) iets log::tests::a_forged_mismatch_is_dropped258 PASS [ 1.475s] (240/631) iets cli::run::tests::eval_prints_its_value259 PASS [ 0.027s] (241/631) iets log::tests::a_half_line_waits_for_its_newline260 PASS [ 0.299s] (242/631) iets jobs::tests::a_numeric_name_selects_an_attribute_under_a_set261 PASS [ 0.019s] (243/631) iets log::tests::a_mismatch_reason_keeps_both_hashes262 PASS [ 0.020s] (244/631) iets log::tests::a_hash_mismatch_names_the_hash_it_got263 PASS [ 0.327s] (245/631) iets jobs::constituents::tests::fnmatch_basics264 PASS [ 0.023s] (246/631) iets log::tests::a_pause_takes_the_view_down_for_a_prompt265 PASS [ 1.383s] (247/631) iets eval::tests::fetchurl_needs_a_sha256_in_every_mode266 PASS [ 1.050s] (248/631) iets eval::tests::update_forces_the_right_operand_first267 PASS [ 0.025s] (249/631) iets log::tests::a_region_stays_under_the_output_that_scrolls_above_it268 PASS [ 0.020s] (250/631) iets log::tests::a_resolved_copy_reports_its_mismatch_as_a_line269 PASS [ 0.032s] (251/631) iets log::tests::a_resize_redraws_the_region_once270 PASS [ 1.048s] (252/631) iets fetch::http::tests::a_stalled_download_fails271 PASS [ 0.027s] (253/631) iets log::tests::activity_records_are_nix_json_logger_records272 PASS [ 0.032s] (254/631) iets log::tests::ansi_stripping273 PASS [ 0.021s] (255/631) iets log::tests::record_is_nix_log_ei_plus_code_and_hint274 PASS [ 0.030s] (256/631) iets log::tests::escapes_are_filtered_the_way_nix_filters_them275 PASS [ 0.025s] (257/631) iets log::tests::record_without_position276 PASS [ 0.023s] (258/631) iets log::tests::without_a_terminal_output_is_plain277 PASS [ 0.023s] (259/631) iets log::tests::the_status_line_goes_under_the_region278 PASS [ 0.050s] (260/631) iets log::tests::a_session_id_is_a_uuid_v7279 PASS [ 0.026s] (261/631) iets log::tests::text_shows_the_hint_of_an_unsupported_error280 PASS [ 0.044s] (262/631) iets log::tests::exit_status_flags_combine_like_nix281 PASS [ 0.055s] (263/631) iets log::tests::lint_warning_is_a_level_1_record282 PASS [ 0.035s] (264/631) iets nixbin::tests::farm_marker_is_found_through_two_hops283 PASS [ 0.026s] (265/631) iets parallel::deque::tests::lifo_owner_fifo_thief284 PASS [ 0.020s] (266/631) iets parallel::fiber::tests::resume_yield_finish285 PASS [ 0.047s] (267/631) iets parallel::fiber::tests::reservation_is_capped_and_mmap_failure_is_an_error286 PASS [ 0.064s] (268/631) iets nixbin::tests::every_iets_build_is_skipped287 PASS [ 0.071s] (269/631) iets parallel::fiber::tests::migrates_between_threads288 PASS [ 1.498s] (270/631) iets eval::tests::nix_eq_forces_what_the_shortcut_skips289 PASS [ 0.082s] (271/631) iets parallel::fiber::tests::a_freed_stack_frees_its_guard_entry290 PASS [ 0.103s] (272/631) iets parallel::deque::tests::concurrent_sum291 PASS [ 0.159s] (273/631) iets parallel::fiber::tests::large_stack_use_and_release292 PASS [ 1.595s] (274/631) iets eval::tests::arithmetic_and_strings293 PASS [ 0.058s] (275/631) iets parallel::sched::tests::main_parks_and_is_woken_by_helper294 PASS [ 0.055s] (276/631) iets parallel::interner::tests::empty_name_misses_the_cache_sentinel295 PASS [ 0.022s] (277/631) iets parallel::sched::tests::a_task_survives_packing_past_the_old_24_bit_start296 PASS [ 0.034s] (278/631) iets parallel::sched::tests::park_and_wake_across_workers297 PASS [ 0.059s] (279/631) iets print::tests::float_formatting_edge_cases298 PASS [ 0.488s] (280/631) iets lint::cases::one_warning_per_site299 PASS [ 0.162s] (281/631) iets parallel::interner::tests::concurrent_intern_agrees300 PASS [ 0.043s] (282/631) iets parallel::interner::tests::intern_is_stable_and_shared301 PASS [ 0.030s] (283/631) iets progress::tests::a_download_inside_a_copy_is_part_of_the_copy302 PASS [ 0.031s] (284/631) iets profile::tests::a_frame_keeps_its_call_site_and_its_name303 PASS [ 0.031s] (285/631) iets profile::tests::a_sample_is_taken_once_per_tick304 PASS [ 0.030s] (286/631) iets progress::tests::a_log_hears_of_a_task_after_first_and_then_every_heartbeat305 PASS [ 0.031s] (287/631) iets profile::tests::a_weight_is_bytes_when_the_profile_asks_for_them306 PASS [ 0.021s] (288/631) iets progress::tests::several_of_a_kind_are_counted307 PASS [ 0.037s] (289/631) iets profile::tests::an_unwind_returns_to_a_depth308 PASS [ 0.037s] (290/631) iets progress::tests::a_transfer_that_does_not_move_says_so309 PASS [ 0.028s] (291/631) iets progress::tests::store_hashes_are_left_out310 PASS [ 0.022s] (292/631) iets project::tests::the_nearest_flake_wins_without_a_working_tree311 PASS [ 1.641s] (293/631) iets eval::tests::laziness_and_recursion312 PASS [ 0.021s] (294/631) iets project::tests::each_marker_is_a_root313 PASS [ 0.026s] (295/631) iets project::tests::a_working_tree_wins_over_a_file_marker_below_it314 PASS [ 0.087s] (296/631) iets parallel::thunk::tests::deadlocked_fibers_are_cancelled315 PASS [ 0.031s] (297/631) iets provenance::tests::a_path_followed_by_a_colour_escape_still_matches316 PASS [ 0.031s] (298/631) iets provenance::tests::a_tree_copied_from_a_store_tree_resolves_to_the_local_one317 PASS [ 0.026s] (299/631) iets provenance::tests::an_input_file_is_labelled_by_its_lock_node318 PASS [ 0.025s] (300/631) iets provenance::tests::locate_takes_the_longest_prefix319 PASS [ 1.888s] (301/631) iets builtins::fetch::tests::a_read_that_is_not_a_selection_has_no_site320 PASS [ 0.079s] (302/631) iets profile::tests::a_deep_stack_is_capped321 PASS [ 0.046s] (303/631) iets provenance::tests::a_shared_position_is_left_off_the_started_line_only322 PASS [ 1.362s] (304/631) iets eval::tests::sets_compare_in_the_symbol_order_of_nix323 PASS [ 0.568s] (305/631) iets lint::cases::an_unknown_name_in_iets_lint_is_a_warning_and_the_rest_counts324 PASS [ 0.095s] (306/631) iets parallel::sched::tests::fan_out_from_main325 PASS [ 0.518s] (307/631) iets lint::cases::try_eval_does_not_catch_a_lint_error326 PASS [ 0.023s] (308/631) iets remote::grpc::build::tests::required_features_come_from_the_env_or_structured_attrs327 PASS [ 0.048s] (309/631) iets provenance::tests::rewrite_leaves_unknown_text_alone328 PASS [ 0.048s] (310/631) iets provenance::tests::locate_without_a_match_is_none329 PASS [ 0.045s] (311/631) iets provenance::tests::rewrite_replaces_every_known_path_in_a_line330 PASS [ 0.035s] (312/631) iets remote::grpc::backend::tests::a_cold_store_is_asked_the_rest_in_one_call331 PASS [ 0.022s] (313/631) iets remote::grpc::drvwire::tests::a_failure_keeps_its_message332 PASS [ 0.028s] (314/631) iets remote::grpc::build::tests::a_self_reference_does_not_loop333 PASS [ 0.076s] (315/631) iets project::tests::a_config_file_never_shrinks_the_root334 PASS [ 0.031s] (316/631) iets remote::grpc::build::tests::the_timings_report_with_every_line335 PASS [ 0.062s] (317/631) iets provenance::tests::failed_line_names_the_attribute_and_the_position336 PASS [ 0.038s] (318/631) iets remote::grpc::build::tests::a_local_upload_failure_beats_the_stream_ended_status337 PASS [ 0.053s] (319/631) iets remote::grpc::backend::tests::a_built_input_stops_the_walk338 PASS [ 0.038s] (320/631) iets remote::grpc::build::tests::reschedules_back_off_past_a_dead_worker339 PASS [ 1.822s] (321/631) iets cli::run::tests::the_hosts_environment_reaches_the_lint_configuration340 PASS [ 0.018s] (322/631) iets remote::grpc::drvwire::tests::build_result_round_trips_a_daemon_reply341 PASS [ 0.056s] (323/631) iets remote::grpc::backend::tests::an_input_below_a_built_one_is_not_built342 PASS [ 0.044s] (324/631) iets remote::grpc::build::tests::topo_sort_puts_references_first343 PASS [ 0.021s] (325/631) iets remote::grpc::drvwire::tests::path_info_round_trips344 PASS [ 0.059s] (326/631) iets remote::grpc::backend::tests::a_built_root_asks_nothing_below_it345 PASS [ 0.029s] (327/631) iets remote::grpc::drvwire::tests::basic_derivation_matches_the_cxx_field_order346 PASS [ 0.027s] (328/631) iets remote::grpc::health::tests::one_address_does_not_refuse_another347 PASS [ 0.013s] (329/631) iets remote::grpc::tests::insecure_is_a_bare_flag_or_a_boolean348 PASS [ 0.032s] (330/631) iets remote::grpc::drvwire::tests::an_unresolvable_input_output_is_an_error349 PASS [ 0.035s] (331/631) iets remote::grpc::health::tests::a_completed_build_clears_the_history350 PASS [ 0.027s] (332/631) iets remote::grpc::tests::a_token_needs_tls_and_unknown_parameters_are_errors351 PASS [ 0.027s] (333/631) iets remote::grpc::tests::defaults_match_the_cxx_settings352 PASS [ 0.018s] (334/631) iets remote::plan::tests::hash_source_matches_nar_hash353 PASS [ 0.044s] (335/631) iets remote::grpc::health::tests::one_bounce_does_not_refuse_an_address354 PASS [ 1.952s] (336/631) iets builtins::fetch::tests::the_first_read_of_a_tree_gives_its_finding355 PASS [ 0.019s] (337/631) iets remote::plan::tests::an_answered_root_is_not_asked_again356 PASS [ 0.029s] (338/631) iets remote::plan::tests::a_held_input_answers_for_its_closure357 PASS [ 0.049s] (339/631) iets remote::grpc::health::tests::a_passed_cooldown_lets_one_caller_through358 PASS [ 0.030s] (340/631) iets remote::grpc::tests::percent_escapes_decode_in_values359 PASS [ 0.050s] (341/631) iets remote::grpc::health::tests::an_unknown_address_is_usable360 PASS [ 0.024s] (342/631) iets remote::worker::counts_tests::a_repeated_update_claims_nothing361 PASS [ 0.048s] (343/631) iets remote::grpc::health::tests::the_cooldown_grows_and_stops_at_30s362 PASS [ 0.044s] (344/631) iets remote::grpc::tests::every_parameter_parses363 PASS [ 0.025s] (345/631) iets remote::worker::counts_tests::each_change_is_a_verdict_in_order364 PASS [ 0.020s] (346/631) iets remote::worker::tests::a_status_over_a_byte_is_not_a_success365 PASS [ 0.020s] (347/631) iets remote::worker::tests::an_ssh_host_is_never_an_option366 PASS [ 0.013s] (348/631) iets remote::worker::tests::transport_from_url367 PASS [ 0.054s] (349/631) iets remote::grpc::health::tests::two_bounces_refuse_it368 PASS [ 0.041s] (350/631) iets remote::plan::tests::a_held_root_answers_for_its_closure369 PASS [ 0.052s] (351/631) iets remote::grpc::tests::mtls_needs_both_halves370 PASS [ 0.018s] (352/631) iets runtime::heap::tests::release_tombstones_every_chunk371 PASS [ 0.041s] (353/631) iets remote::plan::tests::memory_source_matches_dump_string372 PASS [ 0.024s] (354/631) iets remote::worker::wire::tests::replies_are_read_as_nix_reads_them373 PASS [ 0.028s] (355/631) iets remote::worker::wire::tests::strings_are_padded374 PASS [ 0.019s] (356/631) iets runtime::value::layout::a_primop_pays_nothing_for_its_symbol375 PASS [ 0.034s] (357/631) iets remote::worker::tests::ssh_argv_puts_the_host_first376 PASS [ 0.049s] (358/631) iets remote::worker::wire::tests::build_results_are_read_as_nix_reads_them377 PASS [ 0.691s] (359/631) iets lint::cases::a_family_selector_selects_its_members378 PASS [ 0.026s] (360/631) iets settings::tests::a_flag_carries_several_places_separated_by_a_semicolon379 PASS [ 0.027s] (361/631) iets session::tests::two_sessions_share_no_state380 PASS [ 0.022s] (362/631) iets settings::tests::a_project_file_holds_lint_and_nothing_else381 PASS [ 1.802s] (363/631) iets eval::tests::equality382 PASS [ 0.061s] (364/631) iets runtime::value::alloc_tests::a_list_too_long_to_address_has_no_size383 PASS [ 0.069s] (365/631) iets remote::worker::tests::nix_sshopts_split_like_a_shell384 PASS [ 0.071s] (366/631) iets remote::worker::wire::tests::framed_sink_frames_and_terminates385 PASS [ 0.027s] (367/631) iets settings::tests::builder_reads_all_three_forms386 PASS [ 2.045s] (368/631) iets builtins::fetch::tests::a_read_of_the_count_is_one_finding_for_each_tree387 PASS [ 0.025s] (369/631) iets settings::tests::the_flag_value_is_toml_when_it_reads_as_toml388 PASS [ 0.043s] (370/631) iets settings::tests::source_map_adds_up_and_every_other_key_replaces389 PASS [ 0.084s] (371/631) iets settings::tests::a_missing_file_is_skipped_and_the_defaults_hold390 PASS [ 0.139s] (372/631) iets remote::plan::tests::a_cold_store_is_asked_the_rest_in_one_call391 PASS [ 0.037s] (373/631) iets settings::tests::the_user_file_turns_purity_off392 PASS [ 0.043s] (374/631) iets settings::tests::the_flag_leaves_the_argv393 PASS [ 0.077s] (375/631) iets settings::tests::a_settings_file_may_hold_lint_and_the_other_sources_may_not394 PASS [ 0.043s] (376/631) iets settings::tests::the_file_is_the_users395 PASS [ 0.044s] (377/631) iets settings::tests::each_source_wins_over_the_one_before396 PASS [ 1.812s] (378/631) iets eval::tests::printing397 PASS [ 0.050s] (379/631) iets settings::tests::the_environment_wins_over_the_file398 PASS [ 0.054s] (380/631) iets settings::tests::a_wrong_type_names_the_key_and_the_file399 PASS [ 0.033s] (381/631) iets source::local::tests::accepted_set_adds_parent_directories400 PASS [ 1.879s] (382/631) iets eval::tests::fetchurl_checks_its_argument_like_nix401 PASS [ 0.053s] (383/631) iets source::local::tests::max_mtime_covers_root_and_children402 PASS [ 0.027s] (384/631) iets source::remote::tests::nix_literal_escapes403 PASS [ 0.060s] (385/631) iets settings::tests::unknown_key_names_the_file404 PASS [ 0.039s] (386/631) iets source::remote::tests::a_leftover_is_not_a_valid_path405 PASS [ 0.030s] (387/631) iets source::remote::tests::only_the_archive_types_are_fetched_by_iets406 PASS [ 0.043s] (388/631) iets source::lock::tests::empty_lock_has_no_inputs407 PASS [ 0.048s] (389/631) iets source::lock::tests::declared_inputs_must_match_the_lock408 PASS [ 0.054s] (390/631) iets source::lock::tests::complete_lock_passes409 PASS [ 0.098s] (391/631) iets settings::tests::the_flag_pairs_are_kept_for_a_second_iets410 PASS [ 0.033s] (392/631) iets source::scm::ledger::tests::a_directory_in_a_working_tree_is_found411 PASS [ 2.020s] (393/631) iets compile::cache::tests::a_changed_byte_never_makes_the_evaluator_read_past_its_env412 PASS [ 0.012s] (394/631) iets store::drv::tests::fixed_output_from_scratch413 PASS [ 0.026s] (395/631) iets source::tests::dates414 PASS [ 1.624s] (396/631) iets eval::tests::scoping415 PASS [ 0.029s] (397/631) iets store::drv::tests::a_dynamic_input_writes_the_versioned_aterm_and_parses_back416 PASS [ 0.022s] (398/631) iets store::drv::tests::an_env_key_named_json_is_refused417 PASS [ 0.012s] (399/631) iets store::drv::tests::masked_unparse_blanks_output_paths_and_env418 PASS [ 0.016s] (400/631) iets store::drv::tests::string_escapes_roundtrip419 PASS [ 0.096s] (401/631) iets source::remote::tests::access_tokens_match_the_longest_prefix420 PASS [ 0.099s] (402/631) iets source::remote::tests::download_urls_match_the_fetchers421 PASS [ 0.098s] (403/631) iets source::lock::tests::incomplete_locks_fail422 PASS [ 0.029s] (404/631) iets store::drv::tests::input_drvs_hash_modulo_from_scratch423 PASS [ 1.630s] (405/631) iets eval::tests::try_eval_and_errors424 PASS [ 0.016s] (406/631) iets store::drvdiff::tests::a_changed_input_drv_is_paired_by_name_and_recursed_into425 PASS [ 0.012s] (407/631) iets store::drvdiff::tests::an_input_source_an_added_input_drv_and_a_fixed_output_show_up426 PASS [ 0.011s] (408/631) iets store::drvdiff::tests::env_name_shows_only_when_it_is_not_the_derivation_name427 PASS [ 0.009s] (409/631) iets store::drvdiff::tests::the_depth_limit_names_the_input_without_walking_it428 PASS [ 0.017s] (410/631) iets store::drvdiff::tests::json_names_what_differs429 PASS [ 0.054s] (411/631) iets store::drv::tests::fixtures_output_paths_recompute430 PASS [ 0.047s] (412/631) iets store::drv::tests::fixtures_roundtrip_byte_exact431 PASS [ 1.978s] (413/631) iets eval::tests::attrs_and_lists432 PASS [ 0.013s] (414/631) iets store::drvdiff::tests::the_local_fields_the_env_and_an_absent_value433 PASS [ 0.014s] (415/631) iets store::drvdiff::tests::the_same_derivation_is_empty434 PASS [ 0.046s] (416/631) iets store::drv::tests::input_addressed_multi_output_from_scratch435 PASS [ 0.061s] (417/631) iets store::drv::tests::fixtures_drv_path_matches_store_path436 PASS [ 0.119s] (418/631) iets source::local::tests::only_a_content_addressed_store_path_names_its_content437 PASS [ 0.021s] (419/631) iets store::hash::tests::compress_hash_xors438 PASS [ 0.011s] (420/631) iets store::hash::tests::sha256_nix32439 PASS [ 0.022s] (421/631) iets store::hash::tests::base64_roundtrip440 PASS [ 0.125s] (422/631) iets source::scm::git::tests::a_directory_in_a_repository_is_found441 PASS [ 0.010s] (423/631) iets store::nar::tests::directory_nar_with_an_executable442 PASS [ 2.264s] (424/631) iets api::run::tests::the_counters_cover_the_helper_fibers443 PASS [ 0.036s] (425/631) iets store::hash::tests::sha256_sri444 PASS [ 0.035s] (426/631) iets store::hash::tests::sha512_nix32_base64445 PASS [ 0.035s] (427/631) iets store::hash::tests::streaming_matches_oneshot446 PASS [ 0.036s] (428/631) iets store::hash::tests::parse_any_all_formats447 PASS [ 0.036s] (429/631) iets store::hash::tests::sha1_nix32448 PASS [ 0.037s] (430/631) iets store::hash::tests::nix32_roundtrip_and_reject449 PASS [ 0.026s] (431/631) iets store::nar::tests::filter_sees_types_and_paths450 PASS [ 0.015s] (432/631) iets store::nar::tests::executable_file_nar451 PASS [ 0.054s] (433/631) iets store::hash::tests::empty_sha256452 PASS [ 0.058s] (434/631) iets store::hash::tests::md5_nix32453 PASS [ 2.225s] (435/631) iets builtins::fetch::tests::the_name_on_a_value_that_is_not_a_tree_is_silent454 PASS [ 0.022s] (436/631) iets store::nar::tests::script_nar455 PASS [ 0.023s] (437/631) iets store::path::tests::filter_source456 PASS [ 0.046s] (438/631) iets store::nar::tests::readers_refuse_what_nix_refuses457 PASS [ 0.028s] (439/631) iets store::path::tests::fixed_flat_sha1458 PASS [ 0.031s] (440/631) iets store::nar::tests::restore_roundtrip459 PASS [ 0.036s] (441/631) iets store::path::tests::fixed_flat_sha256460 PASS [ 0.046s] (442/631) iets store::path::tests::a_multibyte_char_across_the_hash_part_is_an_error461 PASS [ 0.062s] (443/631) iets store::nar::tests::regular_file_nar462 PASS [ 0.047s] (444/631) iets store::path::tests::check_name_rules463 PASS [ 0.049s] (445/631) iets store::nar::tests::symlink_nar464 PASS [ 0.059s] (446/631) iets store::path::tests::an_override_is_absolute_and_has_no_trailing_separator465 PASS [ 0.040s] (447/631) iets store::path::tests::parse_and_accessors466 PASS [ 0.094s] (448/631) iets store::nar::tests::directory_nar_hash_formats467 PASS [ 0.044s] (449/631) iets store::path::tests::fixed_recursive_sha256468 PASS [ 0.098s] (450/631) iets store::nar::tests::directory_nar469 PASS [ 0.033s] (451/631) iets store::path::tests::path_copy_file470 PASS [ 0.032s] (452/631) iets store::path::tests::placeholder471 PASS [ 0.048s] (453/631) iets store::path::tests::output_names472 PASS [ 0.065s] (454/631) iets store::nar::tests::restore_rejects_garbage473 PASS [ 0.315s] (455/631) iets runtime::value::alloc_tests::a_static_slice_is_interned_without_a_copy474 PASS [ 0.973s] (456/631) iets lint::cases::a_later_flag_wins_over_all_and_a_name_beats_a_later_all475 PASS [ 0.025s] (457/631) iets store::path::tests::the_directory_is_found_as_a_string_and_as_a_path476 PASS [ 0.030s] (458/631) iets store::path::tests::the_host_picks_the_store_directory477 PASS [ 0.049s] (459/631) iets store::path::tests::path_with_name478 PASS [ 0.033s] (460/631) iets store::path::tests::to_file479 PASS [ 0.036s] (461/631) iets syntax::tests::a_line_ends_at_cr_lf_and_lone_cr480 PASS [ 0.023s] (462/631) iets syntax::tests::attrs_and_bindings481 PASS [ 0.025s] (463/631) iets syntax::tests::allow_comments482 PASS [ 0.034s] (464/631) iets syntax::tests::indented_string_stripping483 PASS [ 0.042s] (465/631) iets syntax::tests::json_gives_every_node_its_kind_and_span484 PASS [ 0.047s] (466/631) iets syntax::tests::lambdas485 PASS [ 0.048s] (467/631) iets syntax::tests::an_interpolated_name_is_static_when_nix_has_one_string_node486 PASS [ 0.095s] (468/631) iets store::path::tests::path_copy_directory487 PASS [ 0.376s] (469/631) iets runtime::value::tests::union_lookup_agrees_with_iteration488 PASS [ 0.078s] (470/631) iets store::path::tests::to_file_with_reference489 PASS [ 0.039s] (471/631) iets syntax::tests::the_error_reported_is_the_one_nix_meets_first490 PASS [ 0.028s] (472/631) iets sys::winpath::tests::a_bare_drive_is_not_its_root491 PASS [ 0.050s] (473/631) iets syntax::tests::operator_precedence492 PASS [ 0.067s] (474/631) iets syntax::tests::end_of_file_inside_a_path_is_at_its_last_token493 PASS [ 0.056s] (475/631) iets syntax::tests::numbers494 PASS [ 0.021s] (476/631) iets sys::winpath::tests::a_leading_double_slash_is_not_a_share495 PASS [ 0.247s] (477/631) iets source::scm::ledger::tests::the_metadata_has_the_mark_of_its_tree496 PASS [ 0.068s] (478/631) iets syntax::tests::nul_in_string_literals497 PASS [ 0.255s] (479/631) iets source::scm::ledger::tests::a_name_resolves_to_a_revision_and_a_revision_has_a_tree498 PASS [ 0.055s] (480/631) iets syntax::tests::string_escapes_and_interpolation499 PASS [ 0.062s] (481/631) iets syntax::tests::paths500 PASS [ 0.075s] (482/631) iets syntax::tests::line_col_counts_bytes501 PASS [ 0.017s] (483/631) iets sys::winpath::tests::forward_slashes_make_a_share_too502 PASS [ 0.019s] (484/631) iets sys::winpath::tests::device_paths_are_not_shares_and_survive_a_round_trip503 PASS [ 0.036s] (485/631) iets sys::winpath::tests::a_relative_name_that_starts_with_unc_is_not_a_share504 PASS [ 0.021s] (486/631) iets sys::winpath::tests::mixed_separators_agree505 PASS [ 0.063s] (487/631) iets syntax::tests::spans_cover_tokens506 PASS [ 0.024s] (488/631) iets sys::winpath::tests::network_shares_sit_under_unc507 PASS [ 0.029s] (489/631) iets sys::winpath::tests::dot_dot_stops_at_the_anchor508 PASS [ 1.061s] (490/631) iets lint::cases::an_unknown_name_in_iets_toml_is_a_warning_and_the_rest_counts509 PASS [ 0.099s] (491/631) iets syntax::tests::comments_and_misc510 PASS [ 0.018s] (492/631) iets trace::tests::dump_fingerprint_matches_the_separate_walk511 PASS [ 0.013s] (493/631) iets trace::validate::dir_hash_tests::dir_hash_agrees_with_dir_listing_hash512 PASS [ 0.060s] (494/631) iets sys::winpath::tests::a_drive_is_the_first_component513 PASS [ 0.035s] (495/631) iets sys::winpath::tests::relative_and_rooted_paths_only_change_separator514 PASS [ 0.047s] (496/631) iets sys::winpath::tests::a_round_trip_is_stable515 PASS [ 0.028s] (497/631) iets trace::store::tests::a_reader_of_one_generation_never_sees_the_next516 PASS [ 0.038s] (498/631) iets sys::winpath::tests::native_names_come_back517 PASS [ 0.024s] (499/631) iets trace::tests::dedupe_keeps_conflicting_values518 PASS [ 0.027s] (500/631) iets trace::store::tests::one_rename_publishes_every_part519 PASS [ 0.025s] (501/631) iets trace::tests::fingerprint_changes_with_content_size_and_seen_entries520 PASS [ 0.309s] (502/631) iets source::scm::ledger::tests::a_change_of_the_ledger_is_a_change_of_the_working_tree521 PASS [ 0.290s] (503/631) iets source::scm::ledger::tests::the_count_is_lazy_and_kept_by_revision522 PASS [ 0.039s] (504/631) iets trace::key::tests::relative_path_detection523 PASS [ 0.047s] (505/631) iets trace::key::tests::key_is_order_and_value_sensitive524 PASS [ 0.051s] (506/631) iets sys::winpath::tests::the_evaluators_form_is_left_alone525 PASS [ 0.036s] (507/631) iets trace::tests::only_a_named_query_is_an_observation526 PASS [ 0.043s] (508/631) iets trace::store::tests::bytes_that_are_not_an_entry_are_bad_not_a_panic527 PASS [ 0.043s] (509/631) iets trace::validate::tests::a_copy_in_place_that_keeps_the_stat_still_misses528 PASS [ 0.036s] (510/631) iets trace::validate::tests::what_a_native_path_records_validates529 PASS [ 0.454s] (511/631) iets runtime::value::alloc_tests::a_speculated_thunk_is_forced_but_not_demanded530 PASS [ 0.031s] (512/631) iets trace::wire::tests::readset_roundtrip531 PASS [ 0.044s] (513/631) iets trace::validate::tests::file_touch_refreshes_edit_misses532 PASS [ 0.044s] (514/631) iets trace::validate::tests::dir_stat_env_checks533 PASS [ 0.323s] (515/631) iets source::scm::ledger::tests::an_untracked_file_is_the_error_of_nix534 PASS [ 0.013s] (516/631) iets::aterm_crosscheck bytes_that_are_not_utf8_roundtrip535 PASS [ 0.017s] (517/631) iets::aterm_crosscheck floating_ca_defers_itself_and_downstream536 PASS [ 1.118s] (518/631) iets lint::cases::iets_lint_sets_a_level_and_a_flag_beats_it537 PASS [ 0.029s] (519/631) iets::aterm_crosscheck fixed_output_path_is_recomputed_not_trusted538 PASS [ 0.029s] (520/631) iets::aterm_crosscheck fixed_output_inputs_hide_their_provenance539 PASS [ 1.075s] (521/631) iets lint::cases::the_user_iets_toml_sets_a_level_and_the_project_file_wins_over_it540 PASS [ 2.498s] (522/631) iets api::value::tests::scalars541 PASS [ 0.056s] (523/631) iets treestore::pack::tests::collect_removes_dead_packs_and_compacts_mostly_dead_ones542 PASS [ 0.061s] (524/631) iets treestore::pack::tests::a_changed_index_byte_is_not_a_pack543 PASS [ 0.061s] (525/631) iets treestore::pack::tests::a_pack_reads_back_what_was_written544 PASS [ 0.062s] (526/631) iets trace::wire::tests::drvs_sources_roots_roundtrip545 PASS [ 0.025s] (527/631) iets::aterm_crosscheck harmonia_cases_roundtrip546 PASS [ 0.056s] (528/631) iets treestore::tests::a_flat_file_is_named_by_the_hash_of_its_bytes547 PASS [ 0.061s] (529/631) iets treestore::pack::tests::a_reader_sees_a_pack_written_after_it_listed548 PASS [ 0.077s] (530/631) iets treestore::pack::tests::a_set_finds_objects_across_packs_and_drops_a_broken_one549 PASS [ 0.031s] (531/631) iets::aterm_crosscheck upstream_bench_drvs_parse_and_reprint_stably550 PASS [ 0.045s] (532/631) iets::aterm_crosscheck upstream_bad_drvs_are_rejected551 PASS [ 0.094s] (533/631) iets trace::watch::tests::only_the_paths_an_mtime_can_speak_for552 PASS [ 0.074s] (534/631) iets treestore::tests::two_inputs_share_their_common_files553 PASS [ 2.475s] (535/631) iets builtins::fetch::tests::the_tree_decides_the_level554 PASS [ 0.039s] (536/631) iets::aterm_crosscheck upstream_invariants_input_addressed_kept_or_rejected555 PASS [ 0.061s] (537/631) iets::aterm_crosscheck masked_and_unmasked_hashes_differ_once_filled556 PASS [ 0.095s] (538/631) iets treestore::tests::a_stored_input_reads_back_and_a_wrong_hash_is_refused557 PASS [ 0.046s] (539/631) iets::aterm_crosscheck upstream_invariants_ca_floating_dependency558 PASS [ 0.072s] (540/631) iets::aterm_crosscheck malformed_aterm_is_an_error559 PASS [ 0.092s] (541/631) iets treestore::tests::a_tree_is_named_by_its_nar_hash560 PASS [ 0.102s] (542/631) iets treestore::tests::a_put_after_a_collection_brings_its_own_objects561 PASS [ 0.106s] (543/631) iets treestore::tests::a_staged_directory_goes_when_it_is_dropped562 PASS [ 0.111s] (544/631) iets treestore::pack::tests::an_empty_writer_leaves_no_file563 PASS [ 0.053s] (545/631) iets::cache_hygiene an_entry_that_is_not_a_plain_file_is_refused564 PASS [ 0.057s] (546/631) iets::aterm_crosscheck upstream_invariants_fill_in_deferred565 PASS [ 0.040s] (547/631) iets::cache_hygiene crash_writer_child566 PASS [ 0.036s] (548/631) iets::cache_hygiene unix_only::a_link_or_a_fifo_is_not_an_entry567 PASS [ 0.072s] (549/631) iets::cache_hygiene a_changed_byte_or_a_copied_entry_is_a_miss568 PASS [ 0.072s] (550/631) iets::cache_hygiene an_input_observation_marks_its_entry_as_used569 PASS [ 0.060s] (551/631) iets::cache_hygiene input_touch_child570 PASS [ 0.082s] (552/631) iets::aterm_crosscheck upstream_input_addressed_paths_recompute571 PASS [ 0.054s] (553/631) iets::cache_hygiene unix_only::a_cache_is_private_to_its_owner572 PASS [ 0.126s] (554/631) iets treestore::tests::collect_keeps_what_an_entry_names573 PASS [ 0.434s] (555/631) iets source::scm::ledger::tests::the_tracked_files_and_the_metadata_are_the_tree574 PASS [ 0.117s] (556/631) iets::aterm_crosscheck upstream_drvs_roundtrip_byte_exact575 PASS [ 0.104s] (557/631) iets::cache_hygiene a_corrupt_entry_is_dropped_and_a_corrupt_store_is_wiped576 PASS [ 0.231s] (558/631) iets trace::validate::tests::the_lowest_failing_observation_is_the_one_reported577 PASS [ 2.167s] (559/631) iets eval::tests::reading_a_derivation_output_is_unsupported578 PASS [ 0.699s] (560/631) iets session::tests::a_released_session_leaves_the_other_alone579 PASS [ 0.430s] (561/631) iets syntax::tests::lang_corpus580 PASS [ 0.215s] (562/631) iets::diff one_side_is_a_usage_error581 PASS [ 0.206s] (563/631) iets::events a_group_that_does_not_exist_is_a_settings_error582 PASS [ 0.240s] (564/631) iets::diff an_unknown_flag_is_a_usage_error583 PASS [ 2.765s] (565/631) iets builtins::fetch::tests::a_selection_of_the_count_is_the_site584 PASS [ 0.037s] (566/631) iets::help_topics a_page_the_binary_does_not_carry_names_its_path585 PASS [ 0.327s] (567/631) iets::cache_hygiene cache_gc_removes_entries_past_the_ttl586 PASS [ 0.064s] (568/631) iets::help_topics a_command_wins_over_a_topic_of_the_same_name587 PASS [ 0.033s] (569/631) iets::help_topics an_unknown_topic_is_a_usage_error_with_a_suggestion588 PASS [ 1.461s] (570/631) iets lint::cases::scope_attributes_a_derivation_to_the_users_binding589 PASS [ 1.430s] (571/631) iets lint::cases::the_project_iets_toml_sets_a_level_and_a_name_beats_its_family590 PASS [ 0.043s] (572/631) iets::help_topics help_lists_the_topics591 PASS [ 0.044s] (573/631) iets::layering porcelain_names_no_layer_below_the_api592 PASS [ 0.027s] (574/631) iets::nar_parity dump_is_byte_identical_to_nix_store_dump593 PASS [ 0.027s] (575/631) iets::nar_parity parse_length_matches_nix594 PASS [ 0.365s] (576/631) iets::cache_hygiene concurrent_readers_and_writers_never_see_a_torn_entry595 PASS [ 0.032s] (577/631) iets::nar_parity every_node_hashes_like_nix596 PASS [ 0.017s] (578/631) iets::nar_parity reader_caps_names_and_targets597 PASS [ 0.014s] (579/631) iets::nar_parity restore_round_trips_the_awkward_tree598 PASS [ 0.086s] (580/631) iets::help_topics a_topic_prints_its_page599 PASS [ 0.048s] (581/631) iets::layering porcelain_signatures_name_no_evaluator_value600 PASS [ 0.044s] (582/631) iets::profile a_profile_that_is_not_eval_is_a_settings_error601 PASS [ 0.048s] (583/631) iets::profile a_profile_refuses_more_than_one_worker602 PASS [ 0.419s] (584/631) iets::cache_hygiene a_killed_writer_leaves_the_store_usable603 PASS [ 0.405s] (585/631) iets::cli completion_asks_the_binary_and_ignores_settings604 PASS [ 1.577s] (586/631) iets lint::cases::scope_limits_a_lint_to_the_entry_directory_until_it_is_opened605 PASS [ 0.421s] (587/631) iets::cli help_and_version_go_to_stdout606 PASS [ 1.135s] (588/631) iets parallel::thunk::tests::many_fibers_force_one_shared_graph607 PASS [ 0.583s] (589/631) iets trace::tests::dedupe_of_many_repeats_is_linear608 PASS [ 0.971s] (590/631) iets session::tests::a_value_used_after_release_is_loud609 PASS [ 0.999s] (591/631) iets session::tests::a_parallel_run_releases_its_session610 PASS [ 0.511s] (592/631) iets::cli build_cache_ignores_installable_order611 PASS [ 0.550s] (593/631) iets::cli a_bad_command_line_names_the_problem612 PASS [ 0.543s] (594/631) iets::cli build_evaluates_every_installable613 PASS [ 0.544s] (595/631) iets::diff depth_zero_stops_at_the_input_derivation614 PASS [ 0.228s] (596/631) iets::profile an_unprofiled_run_says_nothing_about_a_profile615 PASS [ 0.273s] (597/631) iets::profile a_run_shorter_than_a_tick_says_it_sampled_nothing616 PASS [ 0.584s] (598/631) iets::events the_sink_is_its_own_knob617 PASS [ 0.645s] (599/631) iets::cli io_errors_read_like_strerror618 PASS [ 0.357s] (600/631) iets::pure a_directory_with_no_marker_is_its_own_project619 PASS [ 0.346s] (601/631) iets::pure the_pure_setting_is_the_users_alone620 PASS [ 0.708s] (602/631) iets::diff an_env_name_that_repeats_the_derivation_name_is_left_out621 PASS [ 0.673s] (603/631) iets::events a_tree_add_names_the_local_path_it_copied622 PASS [ 0.761s] (604/631) iets::events a_text_add_names_its_size_and_its_position623 PASS [ 0.774s] (605/631) iets::diff the_text_names_the_env_the_source_and_the_input_drv624 PASS [ 0.815s] (606/631) iets::diff two_installables_are_one_evaluation_each625 PASS [ 0.714s] (607/631) iets::fetchurl a_wrong_hash_is_refused_with_the_hash_the_file_has626 PASS [ 0.938s] (608/631) iets::cli dash_a_completes_the_attribute_names_under_its_root627 PASS [ 1.057s] (609/631) iets::cli dash_f_names_the_file_in_the_native_namespace628 PASS [ 1.053s] (610/631) iets::diff equal_derivations_exit_0629 PASS [ 0.729s] (611/631) iets::pure the_other_purity_rules_hold_without_a_flag630 PASS [ 1.116s] (612/631) iets::events a_group_nobody_named_says_nothing631 PASS [ 1.166s] (613/631) iets::cli a_flake_fragment_completes_to_the_outputs_attribute_names632 PASS [ 1.135s] (614/631) iets::diff the_json_object_names_the_same_differences633 PASS [ 0.932s] (615/631) iets::pure a_read_in_the_project_is_pure_and_one_above_it_is_not634 PASS [ 1.257s] (616/631) iets::events all_takes_the_cold_groups635 PASS [ 1.288s] (617/631) iets::fetchurl a_hashed_fetch_has_the_store_path_nix_gives636 PASS [ 1.256s] (618/631) iets::fetchurl without_a_hash_no_evaluation_fetches_and_prefetch_gives_the_hash637 PASS [ 3.989s] (619/631) iets api::run::tests::helper_fibers_read_the_ir_cache638 PASS [ 1.474s] (620/631) iets::diff dash_f_is_the_positional_file639 PASS [ 2.677s] (621/631) iets lint::cases::allow_comments_silence_the_lines_they_cover640 PASS [ 2.058s] (622/631) iets runtime::value::alloc_tests::a_full_string_table_records_no_more_but_still_shares641 PASS [ 4.506s] (623/631) iets eval::tests::pure_eval_answers_like_nix642 PASS [ 2.680s] (624/631) iets::profile a_builtin_names_itself_in_a_frame643 PASS [ 4.065s] (625/631) iets::profile a_folded_line_is_a_stack_and_a_count644 PASS [ 7.824s] (626/631) iets api::concurrent_eval::concurrent_eval_sums_arena_use_over_workers645 PASS [ 9.624s] (627/631) iets::profile an_allocation_profile_accounts_for_the_arena646 FAIL [ 12.647s] (628/631) iets lint::fixtures::every_lint_fires_on_its_fixture_only_when_asked647 stdout ---648649 running 1 test650 test lint::fixtures::every_lint_fires_on_its_fixture_only_when_asked ... FAILED651652 failures:653654 failures:655 lint::fixtures::every_lint_fires_on_its_fixture_only_when_asked656657 test result: FAILED. 0 passed; 1 failed; 0 ignored; 0 measured; 560 filtered out; finished in 12.63s658 659 stderr ---660661 thread 'lint::fixtures::every_lint_fires_on_its_fixture_only_when_asked' (1478) panicked at src/lint/fixtures.rs:92:5:662 eq-type-mismatch: stderr differs from eq-type-mismatch.warn.exp:663 warning: [eq-type-mismatch] `==` compares a string with a set: values of different types are never equal, so the result is constant664 at /build/source/tests/lint/eq-type-mismatch.nix:1:52665 warning: [eq-type-mismatch] `==` compares an integer with a string: values of different types are never equal, so the result is constant666 at /build/source/tests/lint/eq-type-mismatch.nix:1:4667668 note: run with `RUST_BACKTRACE=1` environment variable to display a backtrace669670 Cancelling due to test failure: 3 tests still running671 PASS [ 23.588s] (629/631) iets syntax::tests::deep_nesting_ends_with_an_error672 PASS [ 24.626s] (630/631) iets runtime::value::tests::union_iteration_merges_like_a_fold673 SLOW [> 60.000s] (-------) iets api::concurrent_eval::concurrent_eval_matches_sequential_eval674 SLOW [>120.000s] (-------) iets api::concurrent_eval::concurrent_eval_matches_sequential_eval675 PASS [ 171.965s] (631/631) iets api::concurrent_eval::concurrent_eval_matches_sequential_eval676------------677 Summary [ 171.972s] 631 tests run: 630 passed (1 slow), 1 failed, 5 skipped678 FAIL [ 12.647s] (628/631) iets lint::fixtures::every_lint_fires_on_its_fixture_only_when_asked679error: test run failed