nixbot

builds

failed iets-nextest-0.1.0 checks.aarch64-linux.test · build #35 · raw

1elastic-arm-4e524f5e: building fx0b50hj0inb2abqh2lgz8232m4mdk3j-iets-nextest-0.1.0.drv
unpackPhase
2unpacking source archive /nix/store/151yqhaf9s7gcg7flw1aqjj7abx71jdq-source3source root is source
patchPhase
4Executing configureCargoCommonVars5decompressing cargo artifacts from /nix/store/n6z06pnzn592dn3d1vvm7inqgvinxw2k-iets-deps-0.1.0/target.tar.zst to target
configurePhase
6will append /build/source/.cargo-home/config.toml with contents of /nix/store/ych65kf134f1wb6yn4fbs8b891iyzv94-vendor-cargo-deps/config.toml7default configurePhase, nothing to do
buildPhase
8+++ command cargo --version9cargo 1.98.0 (797e8a9bc 2026-08-05)10+++ command cargo nextest --version11cargo-nextest 0.9.14312release: 0.9.14313host: aarch64-unknown-linux-gnu
checkPhase
14+++ command cargo nextest run --cargo-profile dev15 Compiling iets v0.1.0 (/build/source)16 Finished `dev` profile [unoptimized + debuginfo] target(s) in 46.98s17------------18 Nextest run ID fad91875-fc94-4494-bd69-f12763513d20 with nextest profile: default19 Starting 507 tests across 11 binaries (5 tests skipped)20 PASS [ 0.016s] ( 1/507) iets api::installable::tests::the_name_a_program_takes_from_a_derivation_name21 PASS [ 0.017s] ( 2/507) iets api::drvshow::tests::inputs_and_structured_attrs22 PASS [ 0.018s] ( 3/507) iets api::drvshow::tests::floats_take_nlohmanns_form23 PASS [ 0.019s] ( 4/507) iets api::drvshow::tests::a_non_canonical_structured_attrs_text_is_renormalised24 PASS [ 0.020s] ( 5/507) iets api::drvshow::tests::a_multi_output_derivation25 PASS [ 0.021s] ( 6/507) iets api::value::tests::attrs_by_name_and_index26 PASS [ 0.020s] ( 7/507) iets api::value::tests::apply_is_lazy27 PASS [ 0.022s] ( 8/507) iets api::run::tests::a_fiber_template_carries_the_configuration28 PASS [ 0.023s] ( 9/507) iets api::fetch::tests::only_a_fixed_output_drv_can_be_prefetched29 PASS [ 0.025s] ( 10/507) iets api::installable::tests::default_and_fragment_attr_paths30 PASS [ 0.028s] ( 11/507) iets api::fetch::tests::the_fake_hash_moves_the_output_and_the_drv31 PASS [ 0.046s] ( 12/507) iets api::drvshow::tests::a_fixed_output_shows_its_content_address_and_no_path32 PASS [ 0.049s] ( 13/507) iets api::drvshow::tests::pretty_matches_serde_json33 PASS [ 0.036s] ( 14/507) iets api::value::tests::construction34 PASS [ 0.029s] ( 15/507) iets argv::tests::every_byte_round_trips35 PASS [ 0.034s] ( 16/507) iets api::value::tests::lists36 PASS [ 0.030s] ( 17/507) iets build::backend::tests::output_specs37 PASS [ 0.009s] ( 18/507) iets build::event::tests::durations38 PASS [ 0.038s] ( 19/507) iets api::value::tests::thunk_reads_as_thunk39 PASS [ 0.012s] ( 20/507) iets build::backend::tests::the_timings_report_with_every_line40 PASS [ 0.042s] ( 21/507) iets api::value::tests::force_deep_forces_the_whole_tree41 PASS [ 0.035s] ( 22/507) iets build::backend::tests::base_names_drop_the_store_dir42 PASS [ 0.009s] ( 23/507) iets build::executor::tests::a_declared_system_filters43 PASS [ 0.009s] ( 24/507) iets build::executor::tests::a_feature_the_place_lacks_rules_it_out44 PASS [ 0.043s] ( 25/507) iets api::value::tests::missing_attribute45 PASS [ 0.011s] ( 26/507) iets build::executor::tests::a_refusal_names_every_place_and_what_it_declared46 PASS [ 0.043s] ( 27/507) iets api::value::tests::wrong_type_is_an_error47 PASS [ 0.008s] ( 28/507) iets build::executor::tests::no_place_at_all_is_a_usage_error48 PASS [ 0.009s] ( 29/507) iets build::executor::tests::one_place_declaring_nothing_takes_everything49 PASS [ 0.067s] ( 30/507) iets api::value::tests::calling_a_function50 PASS [ 0.047s] ( 31/507) iets api::value::tests::strings_and_context51 PASS [ 0.007s] ( 32/507) iets build::fixhash::tests::a_longer_hash_is_not_a_match52 PASS [ 0.011s] ( 33/507) iets build::executor::tests::an_unsupported_url_says_what_is_expected53 PASS [ 0.012s] ( 34/507) iets build::fanout::tests::a_failed_dependency_blocks_its_dependants54 PASS [ 0.013s] ( 35/507) iets build::executor::tests::the_first_place_that_takes_it_wins55 PASS [ 0.009s] ( 36/507) iets build::fixhash::tests::two_matches_are_left_alone56 PASS [ 0.054s] ( 37/507) iets api::value::tests::scalars57 PASS [ 0.014s] ( 38/507) iets build::fanout::tests::dependencies_run_first58 PASS [ 0.010s] ( 39/507) iets build::render::tests::a_stalled_build_that_fails_still_shows_its_cause59 PASS [ 0.010s] ( 40/507) iets build::render::tests::a_failure_after_the_activity_ended_never_claims_a_success60 PASS [ 0.009s] ( 41/507) iets build::render::tests::an_unfolded_success_ends_with_its_verdict61 PASS [ 0.013s] ( 42/507) iets build::render::tests::a_build_log_never_reports_a_mismatch62 PASS [ 0.013s] ( 43/507) iets build::render::tests::a_daemon_failure_message_decides_the_verdict63 PASS [ 0.008s] ( 44/507) iets build::render::tests::drv_paths_of_a_failure_message64 PASS [ 0.009s] ( 45/507) iets build::render::tests::heartbeat_names_running_builds65 PASS [ 0.013s] ( 46/507) iets build::render::tests::an_owned_build_is_verdicted_once_by_its_op66 PASS [ 0.008s] ( 47/507) iets build::render::tests::logs_of_two_builds_do_not_interleave67 PASS [ 0.012s] ( 48/507) iets build::render::tests::ci_folds_a_success_and_never_a_failure68 PASS [ 0.006s] ( 49/507) iets build::tests::targets_become_jobs69 PASS [ 0.010s] ( 50/507) iets build::render::tests::tty_keeps_successful_logs_off_the_screen70 PASS [ 0.007s] ( 51/507) iets builtins::derivation::tests::a_dynamic_output_renders_the_placeholder_nix_renders71 PASS [ 0.008s] ( 52/507) iets build::tests::hash_stripping72 PASS [ 0.006s] ( 53/507) iets builtins::text::fromtoml::tests::inline_tables_stay_on_one_line73 PASS [ 0.009s] ( 54/507) iets builtins::derivation::tests::the_two_placeholders_are_not_the_same74 PASS [ 0.007s] ( 55/507) iets builtins::text::fromtoml::tests::new_escapes_are_refused75 PASS [ 0.008s] ( 56/507) iets builtins::store_hooks::tests::a_relative_path_inside_an_entry_joins_once76 PASS [ 0.006s] ( 57/507) iets builtins::text::regex::tests::names77 PASS [ 0.007s] ( 58/507) iets cachefs::tests::a_directory_that_is_not_ours_is_refused_untouched78 PASS [ 0.012s] ( 59/507) iets builtins::store_hooks::tests::virtual_tree_reads_go_to_the_local_files79 PASS [ 0.007s] ( 60/507) iets cachefs::tests::a_stamp_in_the_future_is_due80 PASS [ 0.017s] ( 61/507) iets build::tests::a_target_with_no_verdict_fails81 PASS [ 0.007s] ( 62/507) iets cachefs::tests::a_store_without_a_version_file_is_wiped_once82 PASS [ 0.007s] ( 63/507) iets cachefs::tests::a_touch_inside_the_interval_writes_nothing83 PASS [ 0.009s] ( 64/507) iets cachefs::tests::a_sweep_runs_once_per_interval84 PASS [ 0.015s] ( 65/507) iets builtins::text::regex::tests::size_limit85 PASS [ 0.008s] ( 66/507) iets cachefs::tests::a_wait_lock_waits_for_its_holder86 PASS [ 0.008s] ( 67/507) iets cachefs::tests::a_wipe_of_the_ir_cache_walks_its_shards87 PASS [ 0.009s] ( 68/507) iets cachefs::tests::a_wipe_keeps_what_iets_did_not_create88 PASS [ 0.007s] ( 69/507) iets cachefs::tests::an_empty_directory_is_ours_to_take89 PASS [ 0.007s] ( 70/507) iets cachefs::tests::sweep_ages_a_root_by_its_link_not_by_what_it_names90 PASS [ 0.008s] ( 71/507) iets cachefs::tests::an_input_store_of_the_spool_layout_is_wiped91 PASS [ 0.008s] ( 72/507) iets cachefs::tests::garbled_stamp_wipes_the_store92 PASS [ 0.008s] ( 73/507) iets cachefs::tests::sweep_drops_old_entries_and_keeps_young_ones93 PASS [ 0.007s] ( 74/507) iets cachefs::tests::sweep_walks_the_shards_of_the_ir_cache94 PASS [ 0.032s] ( 75/507) iets build::tests::a_fan_out_backend_keeps_the_cap_and_the_log_blocks95 PASS [ 0.007s] ( 76/507) iets cli::build::tests::a_failed_build_reports_itself96 PASS [ 0.007s] ( 77/507) iets cachefs::tests::version_mismatch_wipes_the_store97 PASS [ 0.006s] ( 78/507) iets cli::build::tests::a_path_on_stdout_is_silent98 PASS [ 0.007s] ( 79/507) iets cli::build::tests::a_success_with_no_output_path_is_named99 PASS [ 0.008s] ( 80/507) iets cli::build::tests::no_build_result_is_named100 PASS [ 0.009s] ( 81/507) iets cli::build::tests::an_out_flag_that_matches_nothing_is_named101 PASS [ 0.008s] ( 82/507) iets cli::build::tests::no_outcome_at_all_is_named102 PASS [ 0.007s] ( 83/507) iets cli::classic::shell::tests::declares_for_every_bash_shaped_value103 PASS [ 0.007s] ( 84/507) iets cli::classic::shell::tests::outputs_become_placeholders104 PASS [ 0.007s] ( 85/507) iets cli::classic::tests::a_flag_with_no_effect_is_noted_and_one_that_holds_is_not105 PASS [ 0.007s] ( 86/507) iets cli::diff::tests::a_name_ends_at_the_first_dash_before_a_digit106 PASS [ 0.007s] ( 87/507) iets cli::classic::shell::tests::sh_var_names107 PASS [ 0.007s] ( 88/507) iets cli::docs::tests::every_embedded_page_has_a_heading108 PASS [ 0.007s] ( 89/507) iets cli::docs::tests::the_topic_list_fits_80_columns109 PASS [ 0.007s] ( 90/507) iets cli::help::tests::help_fits_80_columns110 PASS [ 0.008s] ( 91/507) iets cli::help::tests::a_mistyped_command_is_suggested111 PASS [ 0.007s] ( 92/507) iets cli::help::tests::messages112 PASS [ 0.010s] ( 93/507) iets cli::docs::tests::topics_resolve_bare_and_qualified113 PASS [ 0.007s] ( 94/507) iets cli::plumbing::tests::a_url_is_the_positional_fetch_takes_itself114 PASS [ 0.007s] ( 95/507) iets cli::render::tests::sizes_render_as_nix_renders_them115 PASS [ 0.009s] ( 96/507) iets cli::plumbing::tests::a_file_url_needs_one_slash_not_three116 PASS [ 0.007s] ( 97/507) iets cli::search::tests::drv_names117 PASS [ 0.012s] ( 98/507) iets cli::help::tests::suggestions_come_from_the_help118 PASS [ 0.009s] ( 99/507) iets cli::render::text::tests::a_long_value_shows_the_lines_that_differ119 PASS [ 0.010s] (100/507) iets cli::search::tests::index_round_trip120 PASS [ 0.010s] (101/507) iets cli::search::tests::merged_highlights121 PASS [ 0.007s] (102/507) iets config::tests::a_classic_name_leaves_an_unimplemented_setting_to_nix122 PASS [ 0.007s] (103/507) iets config::tests::an_alias_is_its_setting123 PASS [ 0.008s] (104/507) iets config::tests::a_setting_with_no_effect_is_noted124 PASS [ 0.013s] (105/507) iets compile::cache::tests::a_malformed_entry_is_a_miss_and_never_a_crash125 PASS [ 0.008s] (106/507) iets config::tests::bad_typed_values_error_where_they_are_set126 PASS [ 0.080s] (107/507) iets build::fanout::tests::at_most_limit_builds_run_at_once127 PASS [ 0.008s] (108/507) iets config::tests::basic_syntax128 PASS [ 0.007s] (109/507) iets config::tests::include_chain129 PASS [ 0.008s] (110/507) iets config::tests::bool_spellings130 PASS [ 0.007s] (111/507) iets config::tests::extra_appends_to_list_settings_only131 PASS [ 0.007s] (112/507) iets config::tests::max_jobs_auto_is_the_cpu_count132 PASS [ 0.007s] (113/507) iets config::tests::missing_include_errors_and_bang_include_does_not133 PASS [ 0.025s] (114/507) iets compile::cache::tests::nesting_past_the_cap_misses134 PASS [ 0.009s] (115/507) iets config::tests::overrides_win_over_files135 PASS [ 0.010s] (116/507) iets config::tests::option_nix_path_replaces_nix_path_and_extra_adds136 PASS [ 0.006s] (117/507) iets config::tests::typed_getters_and_defaults137 PASS [ 0.007s] (118/507) iets config::tests::the_daemon_gets_the_store_settings_set_outside_the_system_file138 PASS [ 0.009s] (119/507) iets config::tests::syntax_errors139 PASS [ 0.067s] (120/507) iets cachefs::tests::a_lock_that_cannot_be_opened_is_not_a_busy_lock140 PASS [ 0.007s] (121/507) iets config::tests::unknown_settings_are_kept141 PASS [ 0.006s] (122/507) iets config::tests::user_conf_files_are_in_precedence_order142 PASS [ 0.012s] (123/507) iets config::tests::the_setting_tables_name_nix_settings143 PASS [ 0.006s] (124/507) iets devenv::tests::cached_result_roundtrip144 PASS [ 0.095s] (125/507) iets build::fixhash::tests::one_match_is_rewritten_in_its_own_spelling145 PASS [ 0.009s] (126/507) iets devenv::tests::non_bash_builder_is_refused146 PASS [ 0.009s] (127/507) iets devenv::tests::json_roundtrip_and_bash_forms147 PASS [ 0.010s] (128/507) iets devenv::tests::get_env_sh_store_path_matches_nix148 PASS [ 0.008s] (129/507) iets devenv::tests::output_checks_are_erased_only_when_present149 PASS [ 0.008s] (130/507) iets devenv::tests::rc_script_rewrites_outputs_and_writes_attrs150 PASS [ 0.007s] (131/507) iets devenv::tests::shell_escaping151 PASS [ 0.012s] (132/507) iets devenv::tests::rewrites_apply_in_map_order_to_every_occurrence152 PASS [ 0.012s] (133/507) iets eval::tests::a_second_pseudo_file_keeps_its_own_positions153 PASS [ 0.012s] (134/507) iets eval::tests::a_function_select_is_a_fresh_slot_when_its_subject_is_forced154 PASS [ 0.071s] (135/507) iets cachefs::tests::the_writer_lock_excludes_one_holder_at_a_time155 PASS [ 0.050s] (136/507) iets compile::cache::tests::a_changed_byte_never_makes_the_evaluator_read_past_its_env156 PASS [ 0.016s] (137/507) iets eval::tests::derivation_wrapper_exists157 PASS [ 0.019s] (138/507) iets eval::tests::an_invalid_regex_fails_before_the_string_is_forced158 PASS [ 0.022s] (139/507) iets eval::tests::equality159 PASS [ 0.023s] (140/507) iets eval::tests::derivation_keeps_env_and_args_that_are_not_utf8160 PASS [ 0.026s] (141/507) iets eval::tests::from_json_and_toml_reject_null_bytes161 PASS [ 0.036s] (142/507) iets eval::tests::arithmetic_and_strings162 PASS [ 0.038s] (143/507) iets eval::tests::attrs_and_lists163 PASS [ 0.030s] (144/507) iets eval::tests::printing164 PASS [ 0.034s] (145/507) iets eval::tests::laziness_and_recursion165 PASS [ 0.034s] (146/507) iets eval::tests::nix_eq_forces_what_the_shortcut_skips166 PASS [ 0.025s] (147/507) iets eval::tests::try_eval_and_errors167 PASS [ 0.033s] (148/507) iets eval::tests::sets_compare_in_the_symbol_order_of_nix168 PASS [ 0.039s] (149/507) iets eval::tests::reading_a_derivation_output_is_unsupported169 PASS [ 0.014s] (150/507) iets fetch::http::tests::credentials_stay_on_the_first_origin170 PASS [ 0.032s] (151/507) iets eval::tests::update_forces_the_right_operand_first171 PASS [ 0.008s] (152/507) iets fetch::http::tests::magic_bytes172 PASS [ 0.019s] (153/507) iets fetch::http::tests::credentials_in_the_url_are_sent_and_never_printed173 PASS [ 0.043s] (154/507) iets eval::tests::scoping174 PASS [ 0.011s] (155/507) iets fetch::http::tests::file_urls_name_a_local_path175 PASS [ 0.009s] (156/507) iets fetch::http::tests::redirects_keep_credentials_only_on_the_same_origin176 PASS [ 0.008s] (157/507) iets fetch::http::tests::redirects_resolve177 PASS [ 0.007s] (158/507) iets fetch::http::tests::urls_split178 PASS [ 0.007s] (159/507) iets fetch::roots::tests::an_empty_nix_ssl_cert_file_hides_ssl_cert_file179 PASS [ 0.008s] (160/507) iets fetch::roots::tests::a_named_file_that_is_missing_or_empty_is_an_error180 PASS [ 0.007s] (161/507) iets fetch::roots::tests::nix_ssl_cert_file_wins_over_ssl_cert_file_and_the_platform181 PASS [ 0.006s] (162/507) iets fetch::roots::tests::no_bundle_anywhere_gives_the_compiled_in_set182 PASS [ 0.011s] (163/507) iets fetch::http::tests::trailing_bytes_and_a_second_layer183 PASS [ 0.007s] (164/507) iets fetch::roots::tests::the_platform_store_wins_over_the_compiled_in_set184 PASS [ 0.008s] (165/507) iets fetch::spool::tests::a_sparse_member_counts_against_the_size_limit185 PASS [ 0.008s] (166/507) iets fetch::spool::tests::an_empty_archive_is_an_empty_directory186 PASS [ 0.009s] (167/507) iets fetch::spool::tests::nar_hash_of_the_fixture187 PASS [ 0.014s] (168/507) iets fetch::spool::tests::a_changed_index_byte_is_a_miss188 PASS [ 0.013s] (169/507) iets fetch::spool::tests::a_stored_tree_dumps_the_spools_nar189 PASS [ 0.014s] (170/507) iets fetch::spool::tests::a_hard_link_never_replaces_a_member190 PASS [ 0.015s] (171/507) iets fetch::spool::tests::archives_the_git_sink_accepts191 PASS [ 0.076s] (172/507) iets eval::tests::pure_eval_answers_like_nix192 PASS [ 0.007s] (173/507) iets fetch::spool::tests::the_scratch_file_never_follows_a_symlink193 PASS [ 0.012s] (174/507) iets fetch::spool::tests::spool_matches_the_tree194 PASS [ 0.010s] (175/507) iets fetch::spool::tests::the_errors_match195 PASS [ 0.014s] (176/507) iets fetch::spool::tests::pax_sparse_members_are_expanded196 PASS [ 0.011s] (177/507) iets fetch::spool::tests::spool_matches_the_tree_on_the_top_level197 PASS [ 0.009s] (178/507) iets fetch::unpack::tests::a_repeated_member_keeps_the_last_copy198 PASS [ 0.010s] (179/507) iets fetch::unpack::tests::an_unsupported_member_type_is_an_error199 PASS [ 0.006s] (180/507) iets fetch::unpack::tests::member_names_are_made_relative_and_cannot_escape200 PASS [ 0.009s] (181/507) iets fetch::unpack::tests::modes_symlinks_and_empty_dirs201 PASS [ 0.013s] (182/507) iets fetch::unpack::tests::keeps_the_root_when_it_is_not_a_single_directory202 PASS [ 0.011s] (183/507) iets fetch::unpack::tests::strips_one_leading_component203 PASS [ 0.012s] (184/507) iets fetch::unpack::tests::nar_hash_of_the_fixture204 PASS [ 0.014s] (185/507) iets flake::fetch::tests::an_entry_of_the_compiled_file_cache_keeps_the_site205 PASS [ 0.012s] (186/507) iets flake::fetch::tests::nix_sees_no_mark206 PASS [ 0.018s] (187/507) iets flake::fetch::tests::the_mark_follows_the_string_like_store_context207 PASS [ 0.009s] (188/507) iets flake::flakeref::tests::errors_and_unsupported208 PASS [ 0.030s] (189/507) iets flake::fetch::tests::a_read_of_the_count_is_one_finding_for_each_tree209 PASS [ 0.031s] (190/507) iets flake::fetch::tests::a_read_that_is_not_a_selection_has_no_site210 PASS [ 0.025s] (191/507) iets flake::fetch::tests::the_first_read_of_a_tree_gives_its_finding211 PASS [ 0.008s] (192/507) iets flake::flakeref::tests::to_string_from_attrs212 PASS [ 0.008s] (193/507) iets flake::flakeref::tests::round_trips213 PASS [ 0.007s] (194/507) iets flake::tests::attr_paths214 PASS [ 0.010s] (195/507) iets flake::flakeref::tests::parses_the_kept_schemes215 PASS [ 0.170s] (196/507) iets compile::cache::tests::a_changed_byte_of_a_stored_entry_is_a_miss216 PASS [ 0.008s] (197/507) iets jobs::line::tests::error_line_round_trip217 PASS [ 0.008s] (198/507) iets jobs::line::tests::split_and_round_trip218 PASS [ 0.013s] (199/507) iets flake::tests::refs_resolve_against_cwd_and_home219 PASS [ 0.038s] (200/507) iets flake::fetch::tests::the_name_on_a_value_that_is_not_a_tree_is_silent220 PASS [ 0.012s] (201/507) iets jobs::constituents::tests::topo_sort_orders_and_detects_cycles221 PASS [ 0.299s] (202/507) iets api::run::tests::the_counters_cover_the_helper_fibers222 PASS [ 0.013s] (203/507) iets jobs::constituents::tests::fnmatch_basics223 PASS [ 0.032s] (204/507) iets flake::fetch::tests::the_tree_decides_the_level224 PASS [ 0.007s] (205/507) iets lint::allow::tests::comment_names225 PASS [ 0.052s] (206/507) iets flake::fetch::tests::a_selection_of_the_count_is_the_site226 PASS [ 0.009s] (207/507) iets lint::site::tests::a_literal_lint_of_nix_has_an_edit227 PASS [ 0.013s] (208/507) iets jobs::tests::a_numeric_name_selects_an_attribute_under_a_set228 PASS [ 0.007s] (209/507) iets lint::tests::keys229 PASS [ 0.007s] (210/507) iets lint::tests::an_unknown_name_is_a_warning_in_a_file_and_an_error_in_a_flag230 PASS [ 0.011s] (211/507) iets lint::allow::tests::lines231 PASS [ 0.009s] (212/507) iets lint::site::tests::the_span_is_the_innermost_node_of_the_kind_of_the_lint232 PASS [ 0.008s] (213/507) iets lint::tests::names_are_unique_kebab_case233 PASS [ 0.008s] (214/507) iets lint::tests::scope_and_inputs234 PASS [ 0.007s] (215/507) iets lint::tests::selectors_and_order235 PASS [ 0.006s] (216/507) iets lint::tests::specificity_inside_a_source_and_order_between_sources236 PASS [ 0.007s] (217/507) iets log::tests::a_coloured_error_is_an_error_record237 PASS [ 0.007s] (218/507) iets lint::tests::toml_table238 PASS [ 0.006s] (219/507) iets log::tests::a_mismatch_reason_keeps_both_hashes239 PASS [ 0.008s] (220/507) iets lint::tests::the_project_file_walk_stops_at_the_project_root240 PASS [ 0.007s] (221/507) iets log::tests::a_forged_mismatch_is_dropped241 PASS [ 0.007s] (222/507) iets log::tests::a_hash_mismatch_names_the_hash_it_got242 PASS [ 0.008s] (223/507) iets log::tests::a_resolved_copy_reports_its_mismatch_as_a_line243 PASS [ 0.010s] (224/507) iets log::tests::a_fixed_hash_has_the_shape_of_a_finding_with_an_edit244 PASS [ 0.007s] (225/507) iets log::tests::a_session_id_is_a_uuid_v7245 PASS [ 0.007s] (226/507) iets log::tests::escapes_are_filtered_the_way_nix_filters_them246 PASS [ 0.007s] (227/507) iets log::tests::ansi_stripping247 PASS [ 0.010s] (228/507) iets log::tests::activity_records_are_nix_json_logger_records248 PASS [ 0.007s] (229/507) iets log::tests::lint_warning_is_a_level_1_record249 PASS [ 0.007s] (230/507) iets log::tests::record_without_position250 PASS [ 0.007s] (231/507) iets nixbin::tests::every_iets_build_is_skipped251 PASS [ 0.009s] (232/507) iets log::tests::exit_status_flags_combine_like_nix252 PASS [ 0.008s] (233/507) iets nixbin::tests::farm_marker_is_found_through_two_hops253 PASS [ 0.007s] (234/507) iets parallel::deque::tests::lifo_owner_fifo_thief254 PASS [ 0.013s] (235/507) iets log::tests::record_is_nix_log_ei_plus_code_and_hint255 PASS [ 0.006s] (236/507) iets parallel::fiber::tests::reservation_is_capped_and_mmap_failure_is_an_error256 PASS [ 0.006s] (237/507) iets parallel::interner::tests::empty_name_misses_the_cache_sentinel257 PASS [ 0.007s] (238/507) iets parallel::interner::tests::intern_is_stable_and_shared258 PASS [ 0.011s] (239/507) iets parallel::fiber::tests::migrates_between_threads259 PASS [ 0.008s] (240/507) iets parallel::sched::tests::a_task_survives_packing_past_the_old_24_bit_start260 PASS [ 0.008s] (241/507) iets parallel::sched::tests::main_parks_and_is_woken_by_helper261 PASS [ 0.017s] (242/507) iets parallel::fiber::tests::large_stack_use_and_release262 PASS [ 0.010s] (243/507) iets parallel::sched::tests::park_and_wake_across_workers263 PASS [ 0.010s] (244/507) iets print::tests::float_formatting_edge_cases264 PASS [ 0.011s] (245/507) iets profile::tests::a_frame_keeps_its_call_site_and_its_name265 PASS [ 0.027s] (246/507) iets parallel::fiber::tests::resume_yield_finish266 PASS [ 0.010s] (247/507) iets profile::tests::a_sample_is_taken_once_per_tick267 FAIL [ 0.022s] (248/507) iets parallel::thunk::tests::deadlocked_fibers_are_cancelled268 stdout ---269270 running 1 test271 test parallel::thunk::tests::deadlocked_fibers_are_cancelled ... FAILED272273 failures:274275 failures:276 parallel::thunk::tests::deadlocked_fibers_are_cancelled277278 test result: FAILED. 0 passed; 1 failed; 0 ignored; 0 measured; 454 filtered out; finished in 0.02s279 280 stderr ---281282 thread 'parallel::thunk::tests::deadlocked_fibers_are_cancelled' (1310) panicked at src/parallel/thunk.rs:372:9:283 resolver did not run284 note: run with `RUST_BACKTRACE=1` environment variable to display a backtrace285286 Cancelling due to test failure: 15 tests still running287 PASS [ 0.026s] (249/507) iets parallel::sched::tests::fan_out_from_main288 PASS [ 0.006s] (250/507) iets progress::tests::a_log_hears_of_a_task_after_first_and_then_every_heartbeat289 PASS [ 0.012s] (251/507) iets profile::tests::a_weight_is_bytes_when_the_profile_asks_for_them290 PASS [ 0.011s] (252/507) iets profile::tests::an_unwind_returns_to_a_depth291 PASS [ 0.011s] (253/507) iets progress::tests::a_download_inside_a_copy_is_part_of_the_copy292 PASS [ 0.178s] (254/507) iets fetch::http::tests::downloads_stop_at_the_size_limit293 PASS [ 0.066s] (255/507) iets parallel::deque::tests::concurrent_sum294 PASS [ 0.062s] (256/507) iets profile::tests::a_deep_stack_is_capped295 PASS [ 0.077s] (257/507) iets parallel::interner::tests::concurrent_intern_agrees296 PASS [ 0.348s] (258/507) iets builtins::text::regex::tests::long_inputs_do_not_recurse297 PASS [ 0.322s] (259/507) iets parallel::thunk::tests::many_fibers_force_one_shared_graph298 PASS [ 0.774s] (260/507) iets fetch::http::tests::a_transient_status_is_retried299 PASS [ 0.913s] (261/507) iets fetch::http::tests::a_decompression_bomb_is_refused300 PASS [ 1.015s] (262/507) iets fetch::http::tests::a_stalled_download_fails301 PASS [ 2.583s] (263/507) iets api::run::tests::helper_fibers_read_the_ir_cache302------------303 Summary [ 2.584s] 263/507 tests run: 262 passed, 1 failed, 5 skipped304 FAIL [ 0.022s] (248/507) iets parallel::thunk::tests::deadlocked_fibers_are_cancelled305warning: 244/507 tests were not run due to test failure (run with --no-fail-fast to run all tests, or run with --max-fail)306error: test run failed