nixbot

builds

cancelled checks.x86_64-linux.classic-e2e build #316 · raw · eval 5.2 s · 470.9 MiB allocated · ·

1these 6 derivations will be built:2  /nix/store/8q5yf2ygyjrhf0p3zxb7wvh1ba44zjyq-iets-0.1.0.drv3  /nix/store/g39zydvhb61m3lji1gv88njiyk6kc1gr-closure-info.drv4  /nix/store/va1qbqaa10137gdhn9m3n12ib5ja1mmd-test-script.drv5  /nix/store/32py8wvmvgl3j975npry22cwannzhg67-driverConfiguration.json.drv6  /nix/store/piai5plm619v2sn0gnvcik4qh02pam95-nixos-test-driver-iets-classic-e2e.drv7  /nix/store/45v394jprzg80s1j3f3cjxf0fv4qq8hf-container-test-run-iets-classic-e2e.drv8building '/nix/store/g39zydvhb61m3lji1gv88njiyk6kc1gr-closure-info.drv'9closure-info> structuredAttrs is enabled10building '/nix/store/va1qbqaa10137gdhn9m3n12ib5ja1mmd-test-script.drv'11test-script> structuredAttrs is enabled12building '/nix/store/32py8wvmvgl3j975npry22cwannzhg67-driverConfiguration.json.drv'13driverConfiguration.json> structuredAttrs is enabled14building '/nix/store/piai5plm619v2sn0gnvcik4qh02pam95-nixos-test-driver-iets-classic-e2e.drv'15nixos-test-driver-iets-classic-e2e> Running type check (enable/disable: config.skipTypeCheck)16nixos-test-driver-iets-classic-e2e> See https://nixos.org/manual/nixos/stable/#test-opt-skipTypeCheck17nixos-test-driver-iets-classic-e2e> All checks passed!18nixos-test-driver-iets-classic-e2e> Linting test script (enable/disable: config.skipLint)19nixos-test-driver-iets-classic-e2e> See https://nixos.org/manual/nixos/stable/#test-opt-skipLint20nixos-test-driver-iets-classic-e2e> All checks passed!21building '/nix/store/45v394jprzg80s1j3f3cjxf0fv4qq8hf-container-test-run-iets-classic-e2e.drv'22container-test-run-iets-classic-e2e> Machine state will be reset. To keep it, pass --keep-machine-state23container-test-run-iets-classic-e2e> start all VLans24container-test-run-iets-classic-e2e> (finished: start all VLans, in 0.00 seconds)25container-test-run-iets-classic-e2e> 26container-test-run-iets-classic-e2e> Test will time out and terminate in 3600.0 seconds27container-test-run-iets-classic-e2e> run the VM test script28container-test-run-iets-classic-e2e> additionally exposed symbols:29container-test-run-iets-classic-e2e>     machine,30container-test-run-iets-classic-e2e>     vlan1,31container-test-run-iets-classic-e2e>     start_all, test_script, machines, machines_qemu, machines_nspawn, vlans, driver, log, os, create_machine, subtest, run_tests, join_all, retry, serial_stdout_off, serial_stdout_on, polling_condition, BaseMachine, QemuMachine, NspawnMachine, t, debug, dump_machine_ssh32container-test-run-iets-classic-e2e> machine: waiting for unit multi-user.target33container-test-run-iets-classic-e2e> machine: systemd-nspawn running (pid 50)34container-test-run-iets-classic-e2e> machine: Waiting for journal at /build/vm-state-machine/var/log/journal...35container-test-run-iets-classic-e2e> nixos-nspawn(machine): TAP vde-tap1 not found; container will be isolated from VDE36container-test-run-iets-classic-e2e> nixos-nspawn(machine): A common reason for this is that /dev/net is not available in the Nix sandbox. Try adding /dev/net to extra-sandbox-paths.37container-test-run-iets-classic-e2e> Note: in a future version of systemd-nspawn the default set of permitted socket address families will be restricted to AF_INET, AF_INET6 and AF_UNIX. Use --restrict-address-families= to configure the set of permitted socket address families, or set RestrictAddressFamilies= in a .nspawn file.38container-test-run-iets-classic-e2e> ░ Spawning container machine on /build/vm-state-machine.39container-test-run-iets-classic-e2e> machine # No journal files were found.40container-test-run-iets-classic-e2e> machine # No journal boot entry found for the specified boot (+0).41container-test-run-iets-classic-e2e> machine # [1682260.539755] machine systemd-journald[57]: Journal started42container-test-run-iets-classic-e2e> machine # [1682260.539823] machine systemd-journald[57]: Runtime Journal (/run/log/journal/2cd8328cc7584174abc77a11291709f3) is 8M, max 2.5G, 2.5G free.43container-test-run-iets-classic-e2e> machine # [1682260.560697] machine systemd[1]: Finished Apply Kernel Variables.44container-test-run-iets-classic-e2e> machine # [1682260.577838] machine systemd[1]: Finished Create Static Device Nodes in /dev gracefully.45container-test-run-iets-classic-e2e> machine # [1682260.594172] machine systemd[1]: Starting Flush Journal to Persistent Storage...46container-test-run-iets-classic-e2e> machine # [1682260.594810] machine systemd[1]: Starting Create Static Device Nodes in /dev...47container-test-run-iets-classic-e2e> machine # [1682260.624677] machine systemd-journald[57]: Time spent on flushing to /var/log/journal/2cd8328cc7584174abc77a11291709f3 is 1.726ms for 6 entries.48container-test-run-iets-classic-e2e> machine # [1682260.624677] machine systemd-journald[57]: System Journal (/var/log/journal/2cd8328cc7584174abc77a11291709f3) is 512B, max 4G, 3.9G free.49container-test-run-iets-classic-e2e> machine # [1682260.641397] machine systemd[1]: Finished Create Static Device Nodes in /dev.50container-test-run-iets-classic-e2e> machine # [1682260.642138] machine systemd[1]: Reached target Preparation for Local File Systems.51container-test-run-iets-classic-e2e> machine # [1682260.642249] machine systemd[1]: Rule-based Manager for Device Events and Files skipped, unmet condition check ConditionPathIsReadWrite=/sys52container-test-run-iets-classic-e2e> machine # [1682260.656968] machine systemd[1]: Finished Flush Journal to Persistent Storage.53container-test-run-iets-classic-e2e> machine # [1682260.685674] machine systemd[1]: Finished Firewall.54container-test-run-iets-classic-e2e> machine # [1682261.590545] machine systemd[1]: Mounting /run/wrappers...55container-test-run-iets-classic-e2e> machine # [1682261.636021] machine systemd[1]: Mounted /run/wrappers.56container-test-run-iets-classic-e2e> machine # [1682261.637307] machine systemd[1]: Reached target Local File Systems.57container-test-run-iets-classic-e2e> machine # [1682261.638133] machine systemd[1]: Listening on Boot Loader Control Service Socket.58container-test-run-iets-classic-e2e> machine # [1682261.639453] machine systemd[1]: Starting Create SUID/SGID Wrappers...59container-test-run-iets-classic-e2e> machine # [1682261.639490] machine systemd[1]: Update Boot Loader Random Seed skipped, unmet condition check ConditionVirtualization=!container60container-test-run-iets-classic-e2e> machine # [1682261.644569] machine systemd[1]: Starting Save Transient machine-id to Disk...61container-test-run-iets-classic-e2e> machine # [1682261.645347] machine systemd[1]: Starting Create System Files and Directories...62container-test-run-iets-classic-e2e> machine # [1682261.665458] machine systemd-tmpfiles[161]: Cannot set file attributes for '/var/empty', value=0x00000010, mask=0x00000010, ignoring: Operation not permitted63container-test-run-iets-classic-e2e> machine # [1682261.665595] machine systemd-tmpfiles[161]: fchmod() of /var/log/journal failed: Operation not permitted64container-test-run-iets-classic-e2e> machine # [1682261.665685] machine systemd-tmpfiles[161]: fchmod() of /var/log/journal/2cd8328cc7584174abc77a11291709f3 failed: Operation not permitted65container-test-run-iets-classic-e2e> machine # [1682261.665804] machine systemd-tmpfiles[161]: fchmod() of /run/log/journal failed: Operation not permitted66container-test-run-iets-classic-e2e> machine # [1682261.670152] machine suid-sgid-wrappers-start[168]: chmod: changing permissions of '/run/wrappers/wrappers.i65FGN2gRt/chsh': Operation not permitted67container-test-run-iets-classic-e2e> machine # [1682261.674356] machine systemd[1]: Finished Create System Files and Directories.68container-test-run-iets-classic-e2e> machine # [1682261.714137] machine systemd[1]: etc-machine\x2did.mount: Deactivated successfully.69container-test-run-iets-classic-e2e> machine # [1682261.734717] machine systemd[1]: suid-sgid-wrappers.service: Main process exited, code=exited, status=1/FAILURE70container-test-run-iets-classic-e2e> machine # [1682261.734810] machine systemd[1]: suid-sgid-wrappers.service: Failed with result 'exit-code'.71container-test-run-iets-classic-e2e> machine # [1682261.782272] machine systemd[1]: Failed to start Create SUID/SGID Wrappers.72container-test-run-iets-classic-e2e> machine # [1682261.782672] machine systemd[1]: Finished Save Transient machine-id to Disk.73container-test-run-iets-classic-e2e> machine # [1682261.788154] machine systemd[1]: Starting Rebuild Journal Catalog...74container-test-run-iets-classic-e2e> machine # [1682261.789159] machine systemd[1]: Starting Record System Boot/Shutdown in UTMP...75container-test-run-iets-classic-e2e> machine # [1682261.804944] machine systemd[1]: Finished Record System Boot/Shutdown in UTMP.76container-test-run-iets-classic-e2e> machine # [1682261.815343] machine systemd[1]: Finished Rebuild Journal Catalog.77container-test-run-iets-classic-e2e> machine # [1682261.816602] machine systemd[1]: Starting Update is Completed...78container-test-run-iets-classic-e2e> machine # [1682261.830853] machine systemd[1]: Finished Update is Completed.79container-test-run-iets-classic-e2e> machine # [1682261.830964] machine systemd[1]: Reached target System Initialization.80container-test-run-iets-classic-e2e> machine # [1682261.831029] machine systemd[1]: Discard unused filesystem blocks once a week skipped, unmet condition check ConditionVirtualization=!container81container-test-run-iets-classic-e2e> machine # [1682261.831051] machine systemd[1]: Started Daily Cleanup of Temporary Directories.82container-test-run-iets-classic-e2e> machine # [1682261.831066] machine systemd[1]: Reached target Timer Units.83container-test-run-iets-classic-e2e> machine # [1682261.831149] machine systemd[1]: Listening on D-Bus System Message Bus Socket.84container-test-run-iets-classic-e2e> machine # [1682261.831217] machine systemd[1]: Listening on Virtual Machine and Container Registration Service Socket.85container-test-run-iets-classic-e2e> machine # [1682261.831231] machine systemd[1]: Reached target Socket Units.86container-test-run-iets-classic-e2e> machine # [1682261.831253] machine systemd[1]: Reached target Basic System.87container-test-run-iets-classic-e2e> machine # [1682261.832815] machine systemd[1]: Starting Import lastlog data into lastlog2 database...88container-test-run-iets-classic-e2e> machine # [1682261.834132] machine systemd[1]: Starting Name Service Cache Daemon (nsncd)...89container-test-run-iets-classic-e2e> machine # [1682261.835782] machine systemd[1]: Starting resolvconf update...90container-test-run-iets-classic-e2e> machine # [1682261.866672] machine systemd[1]: Finished Import lastlog data into lastlog2 database.91container-test-run-iets-classic-e2e> machine # [1682261.901630] machine systemd[1]: nscd.service: Deactivated successfully.92container-test-run-iets-classic-e2e> machine # [1682261.901798] machine systemd[1]: Stopped Name Service Cache Daemon (nsncd).93container-test-run-iets-classic-e2e> machine # [1682261.903516] machine systemd[1]: Starting Name Service Cache Daemon (nsncd)...94container-test-run-iets-classic-e2e> machine # [1682261.909547] machine resolvconf-start[235]: setfacl: /run/resolvconf: Operation not supported95container-test-run-iets-classic-e2e> machine # [1682261.910290] machine systemd[1]: resolvconf.service: Main process exited, code=exited, status=1/FAILURE96container-test-run-iets-classic-e2e> machine # [1682261.910367] machine systemd[1]: resolvconf.service: Failed with result 'exit-code'.97container-test-run-iets-classic-e2e> machine # [1682261.967244] machine systemd[1]: Failed to start resolvconf update.98container-test-run-iets-classic-e2e> machine # [1682261.967517] machine systemd[1]: Reached target Preparation for Network.99container-test-run-iets-classic-e2e> machine # [1682261.968303] machine systemd[1]: Starting Address configuration of eth1...100container-test-run-iets-classic-e2e> machine # [1682261.969113] machine systemd[1]: Starting Extra networking commands....101container-test-run-iets-classic-e2e> machine # [1682261.981660] machine network-addresses-eth1-start[238]: adding address 192.168.1.1/24... done102container-test-run-iets-classic-e2e> machine # [1682261.983591] machine network-addresses-eth1-start[238]: adding address 2001:db8:1::1/64... done103container-test-run-iets-classic-e2e> machine # [1682261.987054] machine systemd[1]: Finished Address configuration of eth1.104container-test-run-iets-classic-e2e> machine # [1682262.014816] machine systemd[1]: Finished Extra networking commands..105container-test-run-iets-classic-e2e> machine # [1682262.014958] machine systemd[1]: Reached target Network.106container-test-run-iets-classic-e2e> machine # [1682262.148136] machine nsncd[230]: Oct 14 10:17:12.878 INFO started, config: Config { ignored_request_types: {}, worker_count: 8, handoff_timeout: 10s }, path: "/var/run/nscd/socket"107container-test-run-iets-classic-e2e> machine # [1682262.148204] machine systemd[1]: Started Name Service Cache Daemon (nsncd).108container-test-run-iets-classic-e2e> machine # [1682262.148272] machine systemd[1]: Reached target Host and Network Name Lookups.109container-test-run-iets-classic-e2e> machine # [1682262.148318] machine systemd[1]: Reached target User and Group Name Lookups.110container-test-run-iets-classic-e2e> machine # [1682262.166034] machine systemd[1]: Starting User Login Management...111container-test-run-iets-classic-e2e> machine # [1682262.166967] machine systemd[1]: Starting Permit User Sessions...112container-test-run-iets-classic-e2e> machine # [1682262.176640] machine systemd[1]: Finished Permit User Sessions.113container-test-run-iets-classic-e2e> machine # [1682262.177884] machine systemd[1]: Started Console Getty.114container-test-run-iets-classic-e2e> machine # [1682262.177918] machine systemd[1]: Getty on tty1 skipped, unmet condition check ConditionPathExists=/dev/tty0115container-test-run-iets-classic-e2e> machine # [1682262.177933] machine systemd[1]: Reached target Login Prompts.116container-test-run-iets-classic-e2e> machine # [1682263.275929] machine systemd-logind[306]: New seat seat0.117container-test-run-iets-classic-e2e> machine # [1682263.277064] machine systemd[1]: Starting D-Bus System Message Bus...118container-test-run-iets-classic-e2e> machine # [1682263.277189] machine systemd[1]: Started User Login Management.119container-test-run-iets-classic-e2e> machine # [1682263.278330] machine systemd[1]: Starting linger-users.service...120container-test-run-iets-classic-e2e> machine # [1682263.313807] machine systemd[1]: linger-users.service: Deactivated successfully.121container-test-run-iets-classic-e2e> machine # [1682263.313999] machine systemd[1]: Finished linger-users.service.122container-test-run-iets-classic-e2e> machine # [1682263.314285] machine systemd[1]: Reached target Multi-User System.123container-test-run-iets-classic-e2e> machine # [1682263.698788] machine dbus-broker-launch[316]: Looking up NSS user entry for 'systemd-timesync'...124container-test-run-iets-classic-e2e> machine # [1682263.700025] machine dbus-broker-launch[316]: NSS returned no entry for 'systemd-timesync'125container-test-run-iets-classic-e2e> machine # [1682263.700025] machine dbus-broker-launch[316]: Invalid user-name in /nix/store/jlg1ir1z4dfm81ya2kccdm1fv06giam6-system-path/share/dbus-1/system.d/org.freedesktop.timesync1.conf +16: user="systemd-timesync"126container-test-run-iets-classic-e2e> machine # [1682263.700775] machine systemd[1]: Started D-Bus System Message Bus.127container-test-run-iets-classic-e2e> machine # [1682263.701109] machine systemd[1]: Startup finished in 3.599s.128container-test-run-iets-classic-e2e> machine # [1682263.709020] machine dbus-broker-launch[316]: Ready129container-test-run-iets-classic-e2e> machine: (finished: waiting for unit multi-user.target, in 4.66 seconds)130container-test-run-iets-classic-e2e> machine: must succeed: /nix/store/phhjngxgfhr1lrzk0w7ms3775mh0pxd5-writable-store /nix/store/w5p7y2yxwl8qp5rdfcmvrrjr7sl43cc6-closure-info131container-test-run-iets-classic-e2e> warning: '--json' without '--json-format' is deprecated; please specify '--json-format 1' or '--json-format 2'. This will become an error in a future release.132container-test-run-iets-classic-e2e> machine: (finished: must succeed: /nix/store/phhjngxgfhr1lrzk0w7ms3775mh0pxd5-writable-store /nix/store/w5p7y2yxwl8qp5rdfcmvrrjr7sl43cc6-closure-info, in 15.56 seconds)133container-test-run-iets-classic-e2e> machine: must succeed: systemctl start nix-daemon.socket134container-test-run-iets-classic-e2e> machine: (finished: must succeed: systemctl start nix-daemon.socket, in 0.01 seconds)135container-test-run-iets-classic-e2e> machine: must succeed: /nix/store/4w5x4f2szvwd1kzhp0xpzgzpvvpmkc4h-leftovers136container-test-run-iets-classic-e2e> machine: (finished: must succeed: /nix/store/4w5x4f2szvwd1kzhp0xpzgzpvvpmkc4h-leftovers, in 0.22 seconds)137container-test-run-iets-classic-e2e> machine: must succeed: cp -r /nix/store/qjdl0n6nxb0jlyq3zibixw2zvahfywfh-source /home/alice/iets && chmod -R u+w /home/alice/iets && chown -R alice /home/alice/iets138container-test-run-iets-classic-e2e> machine # [1682279.770213] machine systemd[1]: Listening on Nix Daemon Socket.139container-test-run-iets-classic-e2e> machine: (finished: must succeed: cp -r /nix/store/qjdl0n6nxb0jlyq3zibixw2zvahfywfh-source /home/alice/iets && chmod -R u+w /home/alice/iets && chown -R alice /home/alice/iets, in 0.18 seconds)140container-test-run-iets-classic-e2e> machine: must succeed: runuser -l alice -c 'cd iets && git init -q && git add -A && git -c user.name=e2e -c user.email=e2e@example.com commit -q -m e2e'141container-test-run-iets-classic-e2e> machine: (finished: must succeed: runuser -l alice -c 'cd iets && git init -q && git add -A && git -c user.name=e2e -c user.email=e2e@example.com commit -q -m e2e', in 0.22 seconds)142container-test-run-iets-classic-e2e> machine: must succeed: runuser -l alice -c 'cd iets && IETS=/nix/store/shpc64di467vvl4wpjj5sgdsiqd8kfw8-iets-0.1.0/bin/iets NIXPKGS=/nix/store/2010s04mqpq7q1kch0ddc9b429s2vh9v-source E2E_OFFLINE=1   nu scripts/classic-e2e.nu' >&2143container-test-run-iets-classic-e2e> machine # [1682280.184848] machine runuser[4980]: pam_unix(runuser-l:session): session opened for user alice(uid=1000) by (uid=0)144container-test-run-iets-classic-e2e> machine # [1682280.393403] machine runuser[4980]: pam_unix(runuser-l:session): session closed for user alice145container-test-run-iets-classic-e2e> machine # [1682280.408788] machine runuser[4993]: pam_unix(runuser-l:session): session opened for user alice(uid=1000) by (uid=0)146container-test-run-iets-classic-e2e> real nix: /nix/store/f0rfa5pcykqbv313j74x7l7wa8nl4bj4-nix-2.34.8/bin147container-test-run-iets-classic-e2e> ok   builtins --impure []: the same names nix has148container-test-run-iets-classic-e2e> ok   builtins --impure [dynamic-derivations]: the same names nix has149container-test-run-iets-classic-e2e> ok   builtins --impure [dynamic-derivations fetch-closure fetch-tree]: the same names nix has150container-test-run-iets-classic-e2e> ok   builtins --pure-eval []: the same names nix has151container-test-run-iets-classic-e2e> ok   builtins --pure-eval [dynamic-derivations]: the same names nix has152container-test-run-iets-classic-e2e> ok   builtins --pure-eval [dynamic-derivations fetch-closure fetch-tree]: the same names nix has153container-test-run-iets-classic-e2e> machine # [1682288.078698] machine systemd[1]: Started Nix Daemon.154container-test-run-iets-classic-e2e> machine # [1682288.172020] machine nix-daemon[5314]: accepted connection from pid 5307, user alice (trusted)155container-test-run-iets-classic-e2e> machine # [1682289.246626] machine nix-daemon[5314]: accepted connection from pid 5431, user alice (trusted)156container-test-run-iets-classic-e2e> ok   instantiate <nixpkgs> -A hello157container-test-run-iets-classic-e2e> machine # [1682290.553741] machine nix-daemon[5314]: accepted connection from pid 5452, user alice (trusted)158container-test-run-iets-classic-e2e> ok   instantiate <nixpkgs> -A glibc (multi-output)159container-test-run-iets-classic-e2e> machine # [1682291.000815] machine nix-daemon[5314]: accepted connection from pid 5463, user alice (trusted)160container-test-run-iets-classic-e2e> machine # [1682292.060844] machine nix-daemon[5314]: accepted connection from pid 5484, user alice (trusted)161container-test-run-iets-classic-e2e> ok   instantiate <nixpkgs> -A glibc.dev (!output suffix)162container-test-run-iets-classic-e2e> machine # [1682292.367708] machine nix-daemon[5314]: accepted connection from pid 5495, user alice (trusted)163container-test-run-iets-classic-e2e> machine # [1682293.642960] machine nix-daemon[5314]: accepted connection from pid 5516, user alice (trusted)164container-test-run-iets-classic-e2e> machine # [1682293.984063] machine nix-daemon[5314]: accepted connection from pid 5527, user alice (trusted)165container-test-run-iets-classic-e2e> ok   instantiate two -A in one run166container-test-run-iets-classic-e2e> machine # [1682295.753454] machine nix-daemon[5314]: accepted connection from pid 5548, user alice (trusted)167container-test-run-iets-classic-e2e> machine # [1682296.095466] machine nix-daemon[5314]: accepted connection from pid 5559, user alice (trusted)168container-test-run-iets-classic-e2e> ok   instantiate two -A that name one derivation169container-test-run-iets-classic-e2e> machine # [1682297.061200] machine nix-daemon[5314]: accepted connection from pid 5580, user alice (trusted)170container-test-run-iets-classic-e2e> ok   instantiate --add-root ''171container-test-run-iets-classic-e2e> machine # [1682297.336421] machine nix-daemon[5314]: accepted connection from pid 5591, user alice (trusted)172container-test-run-iets-classic-e2e> ok   instantiate --eval --strict --json173container-test-run-iets-classic-e2e> ok   instantiate --eval174container-test-run-iets-classic-e2e> ok   instantiate --eval --raw175container-test-run-iets-classic-e2e> ok   instantiate --eval --raw a path176container-test-run-iets-classic-e2e> ok   instantiate --eval --raw an outPath177container-test-run-iets-classic-e2e> ok   instantiate --eval, one --arg name twice178container-test-run-iets-classic-e2e> ok   instantiate --eval, --arg then --argstr of one name179container-test-run-iets-classic-e2e> ok   instantiate --eval, a later expression throws180container-test-run-iets-classic-e2e> ok   instantiate --eval --argstr181container-test-run-iets-classic-e2e> ok   instantiate a custom drv182container-test-run-iets-classic-e2e> machine # [1682299.585371] machine nix-daemon[5314]: accepted connection from pid 5846, user alice (trusted)183container-test-run-iets-classic-e2e> machine # [1682299.660065] machine nix-daemon[5314]: accepted connection from pid 5858, user alice (trusted)184container-test-run-iets-classic-e2e> machine # [1682299.833655] machine nix-daemon[5314]: accepted connection from pid 5879, user alice (trusted)185container-test-run-iets-classic-e2e> machine # [1682299.906561] machine nix-daemon[5314]: accepted connection from pid 5894, user alice (trusted)186container-test-run-iets-classic-e2e> ok   drv closure follows the references of a toFile187container-test-run-iets-classic-e2e> ok   instantiate builtins.outputOf, once and nested188container-test-run-iets-classic-e2e> machine # [1682299.971905] machine nix-daemon[5314]: accepted connection from pid 5915, user alice (trusted)189container-test-run-iets-classic-e2e> machine # [1682300.041243] machine nix-daemon[5314]: accepted connection from pid 5937, user alice (trusted)190container-test-run-iets-classic-e2e> ok   eval builtins.outputOf placeholders191container-test-run-iets-classic-e2e> machine # [1682300.836670] machine nix-daemon[5314]: accepted connection from pid 5958, user alice (trusted)192container-test-run-iets-classic-e2e> machine # [1682300.889802] machine nix-daemon[5314]: accepted connection from pid 5980, user alice (trusted)193container-test-run-iets-classic-e2e> machine # [1682301.283374] machine nix-daemon[5314]: accepted connection from pid 6001, user alice (trusted)194container-test-run-iets-classic-e2e> ok   two consumers of one dynamic producer stay apart195container-test-run-iets-classic-e2e> machine # [1682301.336211] machine nix-daemon[5314]: accepted connection from pid 6023, user alice (trusted)196container-test-run-iets-classic-e2e> ok   instantiate --readonly-mode197container-test-run-iets-classic-e2e> machine # [1682301.897415] machine nix-daemon[5314]: accepted connection from pid 6070, user alice (trusted)198container-test-run-iets-classic-e2e> machine # [1682301.958992] machine nix-daemon[5314]: accepted connection from pid 6093, user alice (trusted)199container-test-run-iets-classic-e2e> ok   --add-root links and registers a gc root200container-test-run-iets-classic-e2e> machine # [1682302.622168] machine nix-daemon[5314]: accepted connection from pid 6114, user alice (trusted)201container-test-run-iets-classic-e2e> machine # [1682302.681658] machine nix-daemon[5314]: accepted connection from pid 6127, user alice (trusted)202container-test-run-iets-classic-e2e> machine # [1682302.743533] machine nix-daemon[5314]: accepted connection from pid 6148, user alice (trusted)203container-test-run-iets-classic-e2e> machine # [1682303.278645] machine nix-daemon[5314]: accepted connection from pid 6198, user alice (trusted)204container-test-run-iets-classic-e2e> machine # [1682303.452930] machine nix-daemon[5314]: accepted connection from pid 6239, user alice (trusted)205container-test-run-iets-classic-e2e> machine # [1682304.254769] machine nix-daemon[5314]: accepted connection from pid 6289, user alice (trusted)206container-test-run-iets-classic-e2e> machine # [1682304.410238] machine nix-daemon[5314]: accepted connection from pid 6332, user alice (trusted)207container-test-run-iets-classic-e2e> machine # [1682305.631731] machine nix-daemon[5314]: accepted connection from pid 6384, user alice (trusted)208container-test-run-iets-classic-e2e> machine # [1682305.781191] machine nix-daemon[5314]: accepted connection from pid 6427, user alice (trusted)209container-test-run-iets-classic-e2e> ok   -o over an existing path acts as Nix does210container-test-run-iets-classic-e2e> machine # [1682306.304638] machine nix-daemon[5314]: accepted connection from pid 6479, user alice (trusted)211container-test-run-iets-classic-e2e> machine # [1682306.492703] machine nix-daemon[5314]: accepted connection from pid 6520, user alice (trusted)212container-test-run-iets-classic-e2e> ok   build a custom drv, default result213container-test-run-iets-classic-e2e> machine # [1682307.712336] machine nix-daemon[5314]: accepted connection from pid 6564, user alice (trusted)214container-test-run-iets-classic-e2e> machine # [1682307.863432] machine nix-daemon[5314]: accepted connection from pid 6599, user alice (trusted)215container-test-run-iets-classic-e2e> ok   build -o link216container-test-run-iets-classic-e2e> machine # [1682309.375908] machine nix-daemon[5314]: accepted connection from pid 6643, user alice (trusted)217container-test-run-iets-classic-e2e> machine # [1682309.557547] machine nix-daemon[5314]: accepted connection from pid 6678, user alice (trusted)218container-test-run-iets-classic-e2e> ok   build --no-out-link219container-test-run-iets-classic-e2e> machine # [1682309.959878] machine nix-daemon[5314]: accepted connection from pid 6722, user alice (trusted)220container-test-run-iets-classic-e2e> machine # [1682310.116639] machine nix-daemon[5314]: accepted connection from pid 6757, user alice (trusted)221container-test-run-iets-classic-e2e> ok   build two outputs of one drv222container-test-run-iets-classic-e2e> machine # [1682310.724933] machine nix-daemon[5314]: accepted connection from pid 6809, user alice (trusted)223container-test-run-iets-classic-e2e> machine # [1682310.796838] machine nix-daemon[5314]: accepted connection from pid 6825, user alice (trusted)224container-test-run-iets-classic-e2e> ok   build two drvs225container-test-run-iets-classic-e2e> machine # [1682311.741729] machine nix-daemon[5314]: accepted connection from pid 6874, user alice (trusted)226container-test-run-iets-classic-e2e> ok   builder = unix://SCRATCH builds there and registers here227container-test-run-iets-classic-e2e> machine # [1682312.904681] machine nix-daemon[5314]: accepted connection from pid 6932, user alice (trusted)228container-test-run-iets-classic-e2e> machine # [1682312.964921] machine nix-daemon[5314]: accepted connection from pid 6969, user alice (trusted)229container-test-run-iets-classic-e2e> machine # [1682313.018600] machine nix-daemon[5314]: accepted connection from pid 6990, user alice (trusted)230container-test-run-iets-classic-e2e> ok   fetchGit of a clean working tree231container-test-run-iets-classic-e2e> machine # [1682314.187151] machine nix-daemon[5314]: accepted connection from pid 7059, user alice (trusted)232container-test-run-iets-classic-e2e> ok   fetchGit of a file URL233container-test-run-iets-classic-e2e> machine # [1682314.770045] machine nix-daemon[5314]: accepted connection from pid 7096, user alice (trusted)234container-test-run-iets-classic-e2e> ok   fetchGit with name, shallow and exportIgnore = false235container-test-run-iets-classic-e2e> machine # [1682315.147296] machine nix-daemon[5314]: accepted connection from pid 7129, user alice (trusted)236container-test-run-iets-classic-e2e> machine # [1682315.384038] machine nix-daemon[5314]: accepted connection from pid 7151, user alice (trusted)237container-test-run-iets-classic-e2e> ok   fetchGit of a rev238container-test-run-iets-classic-e2e> machine # [1682315.488049] machine nix-daemon[5314]: accepted connection from pid 7170, user alice (trusted)239container-test-run-iets-classic-e2e> machine # [1682315.633871] machine nix-daemon[5314]: accepted connection from pid 7192, user alice (trusted)240container-test-run-iets-classic-e2e> machine # [1682315.769908] machine nix-daemon[5314]: accepted connection from pid 7211, user alice (trusted)241container-test-run-iets-classic-e2e> ok   fetchGit of a rev in pure mode242container-test-run-iets-classic-e2e> ok   fetchGit of a ref243container-test-run-iets-classic-e2e> machine # [1682316.042026] machine nix-daemon[5314]: accepted connection from pid 7233, user alice (trusted)244container-test-run-iets-classic-e2e> machine # [1682316.139208] machine nix-daemon[5314]: accepted connection from pid 7254, user alice (trusted)245container-test-run-iets-classic-e2e> ok   fetchGit of an unlocked tree in pure mode246container-test-run-iets-classic-e2e> ok   fetchGit of a ref that is a tag247container-test-run-iets-classic-e2e> machine # [1682316.466457] machine nix-daemon[5314]: accepted connection from pid 7303, user alice (trusted)248container-test-run-iets-classic-e2e> machine # [1682316.587558] machine nix-daemon[5314]: accepted connection from pid 7324, user alice (trusted)249container-test-run-iets-classic-e2e> machine # [1682316.787591] machine nix-daemon[5314]: accepted connection from pid 7346, user alice (trusted)250container-test-run-iets-classic-e2e> ok   fetchGit of a ref that is an annotated tag251container-test-run-iets-classic-e2e> machine # [1682316.885634] machine nix-daemon[5314]: accepted connection from pid 7367, user alice (trusted)252container-test-run-iets-classic-e2e> ok   fetchGit of a branch with an executable, a symlink and a submodule253container-test-run-iets-classic-e2e> machine # [1682317.138179] machine nix-daemon[5314]: accepted connection from pid 7414, user alice (trusted)254container-test-run-iets-classic-e2e> machine # [1682317.329972] machine nix-daemon[5314]: accepted connection from pid 7436, user alice (trusted)255container-test-run-iets-classic-e2e> machine # [1682317.427617] machine nix-daemon[5314]: accepted connection from pid 7455, user alice (trusted)256container-test-run-iets-classic-e2e> ok   fetchGit of a rev and a ref257container-test-run-iets-classic-e2e> ok   fetchGit of a rev with exportIgnore = false258container-test-run-iets-classic-e2e> ok   fetchGit of a ref that names nothing259container-test-run-iets-classic-e2e> machine # [1682317.693985] machine nix-daemon[5314]: accepted connection from pid 7494, user alice (trusted)260container-test-run-iets-classic-e2e> ok   fetchGit { url = "/tmp/iets-classic-e2e.ytKZW9/fetchgit repo"; rev = "244bffbb9d69ed19111102f12633304cdc379987"; } runs no nix261container-test-run-iets-classic-e2e> ok   fetchGit { url = "/tmp/iets-classic-e2e.ytKZW9/fetchgit repo"; ref = "ann"; } runs no nix262container-test-run-iets-classic-e2e> machine # [1682318.166494] machine nix-daemon[5314]: accepted connection from pid 7567, user alice (trusted)263container-test-run-iets-classic-e2e> machine # [1682318.348558] machine nix-daemon[5314]: accepted connection from pid 7586, user alice (trusted)264container-test-run-iets-classic-e2e> ok   fetchGit of a dirty working tree265container-test-run-iets-classic-e2e> machine # [1682319.030168] machine nix-daemon[5314]: accepted connection from pid 7632, user alice (trusted)266container-test-run-iets-classic-e2e> ok   fetchGit of a dirty working tree warns as Nix does267container-test-run-iets-classic-e2e> ok   lib.fileset.gitTracked of a dirty working tree268container-test-run-iets-classic-e2e> machine # [1682320.031132] machine nix-daemon[5314]: accepted connection from pid 7684, user alice (trusted)269container-test-run-iets-classic-e2e> machine # [1682320.081724] machine nix-daemon[5314]: accepted connection from pid 7684, user alice (trusted)270container-test-run-iets-classic-e2e> ok   lib.fileset.gitTracked of a clean working tree271container-test-run-iets-classic-e2e> ok   --parse execs the real nix-instantiate272container-test-run-iets-classic-e2e> machine # [1682320.475841] machine nix-daemon[5314]: accepted connection from pid 7733, user alice (trusted)273container-test-run-iets-classic-e2e> machine # [1682320.515386] machine nix-daemon[5314]: accepted connection from pid 7733, user alice (trusted)274container-test-run-iets-classic-e2e> ok   --iets-option never reaches the fallback nix275container-test-run-iets-classic-e2e> ok   the fallback prints one line on stderr276container-test-run-iets-classic-e2e> ok   IETS_NO_FALLBACK=1 exits 1277container-test-run-iets-classic-e2e> ok   nix-bin-dir full of iets: the fallback stops, it does not loop278container-test-run-iets-classic-e2e> ok   nix eval > /dev/full279container-test-run-iets-classic-e2e> ok   nix-instantiate --eval > /dev/full280container-test-run-iets-classic-e2e> ok   iets version > /dev/full reports, not aborts281container-test-run-iets-classic-e2e> ok   iets parse /tmp/iets-classic-e2e.ytKZW9/case/multi.nix > /dev/full reports, not aborts282container-test-run-iets-classic-e2e> ok   iets --help > /dev/full reports, not aborts283container-test-run-iets-classic-e2e> ok   iets lint list > /dev/full reports, not aborts284container-test-run-iets-classic-e2e> ok   a bad iets.toml and 'iets version'285container-test-run-iets-classic-e2e> ok   a bad iets.toml and 'iets --help'286container-test-run-iets-classic-e2e> ok   a bad iets.toml and 'iets eval -E 1'287container-test-run-iets-classic-e2e> ok   an early error is a record under internal-json288container-test-run-iets-classic-e2e> ok   fetchTarball falls back and prints the real result289container-test-run-iets-classic-e2e> machine # [1682322.074305] machine nix-daemon[5314]: accepted connection from pid 7964, user alice (trusted)290container-test-run-iets-classic-e2e> machine # [1682322.194523] machine nix-daemon[5314]: accepted connection from pid 7990, user alice (trusted)291container-test-run-iets-classic-e2e> ok   fetchMercurial falls back with one 'iets:' prefix292container-test-run-iets-classic-e2e> ok   iets eval fetchMercurial names fetchTree on stderr293container-test-run-iets-classic-e2e> ok   fetchurl with a sha256 has nix's store path294container-test-run-iets-classic-e2e> ok   nix eval reads what fetchurl got295container-test-run-iets-classic-e2e> machine # [1682322.764802] machine nix-daemon[5314]: accepted connection from pid 8036, user alice (trusted)296container-test-run-iets-classic-e2e> machine # [1682322.994086] machine nix-daemon[5314]: accepted connection from pid 8068, user alice (trusted)297container-test-run-iets-classic-e2e> ok   fetchurl without a hash falls back in an impure evaluation298container-test-run-iets-classic-e2e> machine # [1682323.296877] machine nix-daemon[5314]: accepted connection from pid 8091, user alice (trusted)299container-test-run-iets-classic-e2e> machine # [1682323.365410] machine nix-daemon[5314]: accepted connection from pid 8116, user alice (trusted)300container-test-run-iets-classic-e2e> ok   fetchurl without a hash in a pure evaluation301container-test-run-iets-classic-e2e> machine # [1682323.872133] machine nix-daemon[5314]: accepted connection from pid 8164, user alice (trusted)302container-test-run-iets-classic-e2e> ok   fetchurl does not take an invalid path303container-test-run-iets-classic-e2e> machine # [1682324.163150] machine nix-daemon[5314]: accepted connection from pid 8176, user alice (trusted)304container-test-run-iets-classic-e2e> machine # [1682324.388428] machine nix-daemon[5314]: accepted connection from pid 8199, user alice (trusted)305container-test-run-iets-classic-e2e> machine # [1682324.485308] machine nix-daemon[5314]: accepted connection from pid 8211, user alice (trusted)306container-test-run-iets-classic-e2e> ok   fetchurl with a wrong hash does not take an invalid path307container-test-run-iets-classic-e2e> machine # [1682324.701693] machine nix-daemon[5314]: accepted connection from pid 8251, user alice (trusted)308container-test-run-iets-classic-e2e> machine # [1682324.732815] machine nix-daemon[5314]: accepted connection from pid 8251, user alice (trusted)309container-test-run-iets-classic-e2e> machine # [1682324.771922] machine nix-daemon[5314]: accepted connection from pid 8265, user alice (trusted)310container-test-run-iets-classic-e2e> ok   fetchTarball does not take an invalid path311container-test-run-iets-classic-e2e> ok   import from derivation falls back312container-test-run-iets-classic-e2e> machine # [1682325.072723] machine nix-daemon[5314]: accepted connection from pid 8287, user alice (trusted)313container-test-run-iets-classic-e2e> machine # [1682325.158671] machine nix-daemon[5314]: accepted connection from pid 8312, user alice (trusted)314container-test-run-iets-classic-e2e> ok   iets eval refuses import from derivation315container-test-run-iets-classic-e2e> ok   instantiate --eval a non-UTF-8 file name316container-test-run-iets-classic-e2e> ok   iets eval a non-UTF-8 file name317container-test-run-iets-classic-e2e> ok   a non-UTF-8 file name reaches the fallback intact318container-test-run-iets-classic-e2e> ok   the 'nix' name falls back319container-test-run-iets-classic-e2e> ok   nix eval --json .#x320container-test-run-iets-classic-e2e> machine # [1682326.339854] machine nix-daemon[5314]: accepted connection from pid 8444, user alice (trusted)321container-test-run-iets-classic-e2e> ok   nix eval --raw .#x322container-test-run-iets-classic-e2e> machine # [1682326.690080] machine nix-daemon[5314]: accepted connection from pid 8473, user alice (trusted)323container-test-run-iets-classic-e2e> machine # [1682327.056828] machine nix-daemon[5314]: accepted connection from pid 8502, user alice (trusted)324container-test-run-iets-classic-e2e> ok   nix eval .#s (attrset, list, float)325container-test-run-iets-classic-e2e> ok   nix eval .#l326container-test-run-iets-classic-e2e> machine # [1682328.415115] machine nix-daemon[5314]: accepted connection from pid 8531, user alice (trusted)327container-test-run-iets-classic-e2e> ok   nix flake prefetch-inputs, no inputs328container-test-run-iets-classic-e2e> ok   nix flake prefetch-inputs is iets's own329container-test-run-iets-classic-e2e> machine # [1682328.730457] machine nix-daemon[5314]: accepted connection from pid 8557, user alice (trusted)330container-test-run-iets-classic-e2e> ok   nix eval .#x, no flake.lock331container-test-run-iets-classic-e2e> ok   nix eval .#x, no flake.lock is iets's own332container-test-run-iets-classic-e2e> machine # [1682330.125048] machine nix-daemon[5314]: accepted connection from pid 8586, user alice (trusted)333container-test-run-iets-classic-e2e> ok   nix eval .#pkg.drvPath, no flake.lock334container-test-run-iets-classic-e2e> ok   nix eval .#pkg.drvPath, no flake.lock is iets's own335container-test-run-iets-classic-e2e> machine # [1682330.615205] machine nix-daemon[5314]: accepted connection from pid 8615, user alice (trusted)336container-test-run-iets-classic-e2e> ok   nix build .#pkg, no flake.lock337container-test-run-iets-classic-e2e> ok   nix build .#pkg, no flake.lock is iets's own338container-test-run-iets-classic-e2e> ok   no flake.lock: neither side writes one339container-test-run-iets-classic-e2e> machine # [1682331.745054] machine nix-daemon[5314]: accepted connection from pid 8637, user alice (trusted)340container-test-run-iets-classic-e2e> machine # [1682331.884503] machine nix-daemon[5314]: accepted connection from pid 8637, user alice (trusted)341container-test-run-iets-classic-e2e> machine # [1682331.917541] machine nix-daemon[5314]: accepted connection from pid 8674, user alice (trusted)342container-test-run-iets-classic-e2e> ok   nix eval, farm first on PATH, fresh tree343container-test-run-iets-classic-e2e> ok   fallback through the farm marker, real nix off PATH344container-test-run-iets-classic-e2e> machine # [1682334.356538] machine nix-daemon[5314]: accepted connection from pid 8703, user alice (trusted)345container-test-run-iets-classic-e2e> ok   nix eval .#pkg (a derivation)346container-test-run-iets-classic-e2e> machine # [1682335.746726] machine nix-daemon[5314]: accepted connection from pid 8773, user alice (trusted)347container-test-run-iets-classic-e2e> machine # [1682336.328330] machine nix-daemon[5314]: accepted connection from pid 8802, user alice (trusted)348container-test-run-iets-classic-e2e> ok   nix eval . (packages.<system>.default)349container-test-run-iets-classic-e2e> ok   nix eval --expr350container-test-run-iets-classic-e2e> ok   nix eval --expr is pure351container-test-run-iets-classic-e2e> ok   nix eval --impure --expr352container-test-run-iets-classic-e2e> ok   nix --option pure-eval false eval --expr353container-test-run-iets-classic-e2e> ok   nix eval -f is impure354container-test-run-iets-classic-e2e> ok   nix eval .#x is pure355container-test-run-iets-classic-e2e> machine # [1682339.863706] machine nix-daemon[5314]: accepted connection from pid 8964, user alice (trusted)356container-test-run-iets-classic-e2e> ok   nix-instantiate is impure357container-test-run-iets-classic-e2e> ok   nix-instantiate --pure-eval358container-test-run-iets-classic-e2e> ok   nix-instantiate --option pure-eval true359container-test-run-iets-classic-e2e> ok   nix-instantiate --pure-eval refuses a local file360container-test-run-iets-classic-e2e> ok   nix.conf system reaches builtins.currentSystem361container-test-run-iets-classic-e2e> ok   NIX_USER_CONF_FILES empty362container-test-run-iets-classic-e2e> ok   NIX_USER_CONF_FILES unset363container-test-run-iets-classic-e2e> ok   nix eval -f with pure-eval from the system nix.conf364container-test-run-iets-classic-e2e> ok   nix eval -f with pure-eval from a user nix.conf365container-test-run-iets-classic-e2e> ok   nix eval -f with pure-eval from NIX_CONFIG366container-test-run-iets-classic-e2e> ok   nix eval -f with pure-eval from --option367container-test-run-iets-classic-e2e> ok   nix eval -f with pure-eval from --impure368container-test-run-iets-classic-e2e> ok   instantiate -j 4294967296369container-test-run-iets-classic-e2e> ok   instantiate --cores 4294967296370container-test-run-iets-classic-e2e> ok   instantiate -j auto371container-test-run-iets-classic-e2e> ok   instantiate --cores 1K372container-test-run-iets-classic-e2e> ok   instantiate -j 2373container-test-run-iets-classic-e2e> ok   instantiate -Ifoo=/etc374container-test-run-iets-classic-e2e> ok   nix-eval-jobs prints no summary375container-test-run-iets-classic-e2e> ok   iets eval-jobs keeps its summary376container-test-run-iets-classic-e2e> ok   nix.conf 'pure-eval = maybe'377container-test-run-iets-classic-e2e> ok   nix.conf 'show-trace = maybe'378container-test-run-iets-classic-e2e> ok   nix.conf 'sandbox = maybe'379container-test-run-iets-classic-e2e> ok   nix.conf 'eval-cache = 2'380container-test-run-iets-classic-e2e> ok   nix.conf 'connect-timeout = abc'381container-test-run-iets-classic-e2e> ok   nix.conf 'cores = -1'382container-test-run-iets-classic-e2e> ok   nix.conf 'cores = 4294967296'383container-test-run-iets-classic-e2e> ok   nix.conf 'max-jobs = abc'384container-test-run-iets-classic-e2e> ok   nix.conf 'cores = 1K'385container-test-run-iets-classic-e2e> ok   nix.conf 'min-free = 2G'386container-test-run-iets-classic-e2e> ok   nix.conf 'max-jobs = auto'387container-test-run-iets-classic-e2e> ok   nix.conf 'sandbox = relaxed'388container-test-run-iets-classic-e2e> ok   nix eval --expr, a nested error389container-test-run-iets-classic-e2e> ok   nix eval --expr, repeated and empty values390container-test-run-iets-classic-e2e> ok   nix eval --expr, functions391container-test-run-iets-classic-e2e> machine # [1682353.006501] machine nix-daemon[5314]: accepted connection from pid 9805, user alice (trusted)392container-test-run-iets-classic-e2e> ok   symlink: readFile through a copy of the link itself393container-test-run-iets-classic-e2e> machine # [1682353.858018] machine nix-daemon[5314]: accepted connection from pid 9834, user alice (trusted)394container-test-run-iets-classic-e2e> ok   symlink: readFile of a target the filter left out395container-test-run-iets-classic-e2e> machine # [1682354.271788] machine nix-daemon[5314]: accepted connection from pid 9863, user alice (trusted)396container-test-run-iets-classic-e2e> ok   symlink: readDir through a copy of the link itself397container-test-run-iets-classic-e2e> machine # [1682354.689730] machine nix-daemon[5314]: accepted connection from pid 9892, user alice (trusted)398container-test-run-iets-classic-e2e> ok   symlink: hashFile through a copy of the link itself399container-test-run-iets-classic-e2e> machine # [1682355.101018] machine nix-daemon[5314]: accepted connection from pid 9921, user alice (trusted)400container-test-run-iets-classic-e2e> ok   symlink: readFile below a link in a copied tree401container-test-run-iets-classic-e2e> machine # [1682355.470089] machine nix-daemon[5314]: accepted connection from pid 9950, user alice (trusted)402container-test-run-iets-classic-e2e> ok   symlink: readDir of a link in a copied tree403container-test-run-iets-classic-e2e> machine # [1682355.837863] machine nix-daemon[5314]: accepted connection from pid 9979, user alice (trusted)404container-test-run-iets-classic-e2e> ok   symlink: pathExists below a link in a copied tree405container-test-run-iets-classic-e2e> machine # [1682356.117094] machine nix-daemon[5314]: accepted connection from pid 10008, user alice (trusted)406container-test-run-iets-classic-e2e> machine # [1682356.426172] machine nix-daemon[5314]: accepted connection from pid 10037, user alice (trusted)407container-test-run-iets-classic-e2e> ok   symlink: path of a link in a copied tree408container-test-run-iets-classic-e2e> ok   symlink: path of a link, local and copied agree409container-test-run-iets-classic-e2e> machine # [1682357.275302] machine nix-daemon[5314]: accepted connection from pid 10066, user alice (trusted)410container-test-run-iets-classic-e2e> ok   symlink: path of a dangling link411container-test-run-iets-classic-e2e> machine # [1682357.638030] machine nix-daemon[5314]: accepted connection from pid 10095, user alice (trusted)412container-test-run-iets-classic-e2e> machine # [1682357.696628] machine nix-daemon[10115]: unexpected Nix daemon error: error: interrupted by the user413container-test-run-iets-classic-e2e> machine # [1682358.073289] machine nix-daemon[5314]: accepted connection from pid 10124, user alice (trusted)414container-test-run-iets-classic-e2e> ok   symlink: path of a dangling link in a copied tree415container-test-run-iets-classic-e2e> machine # [1682358.091035] machine nix-daemon[10144]: unexpected Nix daemon error: error: interrupted by the user416container-test-run-iets-classic-e2e> ok   symlink: storePath below a link in a copied tree417container-test-run-iets-classic-e2e> ok   symlink: filterSource sees the store path of an unfiltered copy418container-test-run-iets-classic-e2e> machine # [1682358.399568] machine nix-daemon[5314]: accepted connection from pid 10153, user alice (trusted)419container-test-run-iets-classic-e2e> machine # [1682358.627776] machine nix-daemon[5314]: accepted connection from pid 10182, user alice (trusted)420container-test-run-iets-classic-e2e> ok   symlink: path keeps the references of a store path421container-test-run-iets-classic-e2e> machine # [1682359.137348] machine nix-daemon[5314]: accepted connection from pid 10211, user alice (trusted)422container-test-run-iets-classic-e2e> machine # [1682359.240928] machine nix-daemon[5314]: accepted connection from pid 10231, user alice (trusted)423container-test-run-iets-classic-e2e> ok   symlink: path flat refuses a store path with references424container-test-run-iets-classic-e2e> ok   nix eval -f FILE ATTR425container-test-run-iets-classic-e2e> ok   nix eval --json -f FILE ATTR426container-test-run-iets-classic-e2e> machine # [1682359.476096] machine nix-daemon[5314]: accepted connection from pid 10260, user alice (trusted)427container-test-run-iets-classic-e2e> machine # [1682359.531536] machine nix-daemon[5314]: accepted connection from pid 10280, user alice (trusted)428container-test-run-iets-classic-e2e> ok   auto-call a function file, defaults: nix-instantiate429container-test-run-iets-classic-e2e> ok   auto-call a function file, defaults: iets eval430container-test-run-iets-classic-e2e> ok   auto-call a '...' function file, defaults: nix-instantiate431container-test-run-iets-classic-e2e> ok   auto-call a '...' function file, defaults: iets eval432container-test-run-iets-classic-e2e> ok   auto-call a function file, --arg: nix-instantiate433container-test-run-iets-classic-e2e> ok   auto-call a function file, --arg: iets eval434container-test-run-iets-classic-e2e> ok   auto-call a '...' function file, --arg: nix-instantiate435container-test-run-iets-classic-e2e> ok   auto-call a '...' function file, --arg: iets eval436container-test-run-iets-classic-e2e> ok   auto-call a function file, --argstr: nix-instantiate437container-test-run-iets-classic-e2e> ok   auto-call a function file, --argstr: iets eval438container-test-run-iets-classic-e2e> ok   auto-call a '...' function file, --argstr: nix-instantiate439container-test-run-iets-classic-e2e> ok   auto-call a '...' function file, --argstr: iets eval440container-test-run-iets-classic-e2e> ok   a required --arg that is missing: the same first error line everywhere441container-test-run-iets-classic-e2e> ok   nix search, every package442container-test-run-iets-classic-e2e> ok   nix search --json443container-test-run-iets-classic-e2e> ok   nix search --json --pretty444container-test-run-iets-classic-e2e> ok   nix search, two regexes are ANDed445container-test-run-iets-classic-e2e> ok   nix search --exclude446container-test-run-iets-classic-e2e> ok   nix search is case insensitive447container-test-run-iets-classic-e2e> ok   nix search, a bracket expression448container-test-run-iets-classic-e2e> ok   nix search, an alternation449container-test-run-iets-classic-e2e> ok   nix search, no results450container-test-run-iets-classic-e2e> ok   nix search --json, no results451container-test-run-iets-classic-e2e> machine # [1682384.191958] machine nix-daemon[5314]: accepted connection from pid 10972, user alice (trusted)452container-test-run-iets-classic-e2e> ok   nix search nixpkgs --json ^hello$453container-test-run-iets-classic-e2e> machine # [1682423.003456] machine nix-daemon[5314]: accepted connection from pid 11002, user alice (trusted)