nixbot

builds

cancelled checks.x86_64-linux.classic-e2e build #311 · raw · eval 4.2 s · 460.6 MiB allocated · ·

1these 5 derivations will be built:2  /nix/store/234lv78izs1m55fkmxd5ycycrlbn606a-closure-info.drv3  /nix/store/n55sb29kpaxbhgp6v12vjii5yibizdz2-test-script.drv4  /nix/store/wlga0vyzcf21xg4cp7s1sha6yvxzx8qy-driverConfiguration.json.drv5  /nix/store/mk81jclz7rmiybcvn567wc7xndx41llg-nixos-test-driver-iets-classic-e2e.drv6  /nix/store/nacs4yh9jnlrsy0v0wf587v7vg7cgibf-container-test-run-iets-classic-e2e.drv7building '/nix/store/234lv78izs1m55fkmxd5ycycrlbn606a-closure-info.drv'8closure-info> structuredAttrs is enabled9warning: SQLite database '/nix/var/nix/db/db.sqlite' is busy10building '/nix/store/n55sb29kpaxbhgp6v12vjii5yibizdz2-test-script.drv'11test-script> structuredAttrs is enabled12building '/nix/store/wlga0vyzcf21xg4cp7s1sha6yvxzx8qy-driverConfiguration.json.drv'13driverConfiguration.json> structuredAttrs is enabled14building '/nix/store/mk81jclz7rmiybcvn567wc7xndx41llg-nixos-test-driver-iets-classic-e2e.drv'15nixos-test-driver-iets-classic-e2e> Running type check (enable/disable: config.skipTypeCheck)16nixos-test-driver-iets-classic-e2e> See https://nixos.org/manual/nixos/stable/#test-opt-skipTypeCheck17nixos-test-driver-iets-classic-e2e> All checks passed!18nixos-test-driver-iets-classic-e2e> Linting test script (enable/disable: config.skipLint)19nixos-test-driver-iets-classic-e2e> See https://nixos.org/manual/nixos/stable/#test-opt-skipLint20nixos-test-driver-iets-classic-e2e> All checks passed!21building '/nix/store/nacs4yh9jnlrsy0v0wf587v7vg7cgibf-container-test-run-iets-classic-e2e.drv'22container-test-run-iets-classic-e2e> Machine state will be reset. To keep it, pass --keep-machine-state23container-test-run-iets-classic-e2e> start all VLans24container-test-run-iets-classic-e2e> (finished: start all VLans, in 0.01 seconds)25container-test-run-iets-classic-e2e> 26container-test-run-iets-classic-e2e> Test will time out and terminate in 3600.0 seconds27container-test-run-iets-classic-e2e> run the VM test script28container-test-run-iets-classic-e2e> additionally exposed symbols:29container-test-run-iets-classic-e2e>     machine,30container-test-run-iets-classic-e2e>     vlan1,31container-test-run-iets-classic-e2e>     start_all, test_script, machines, machines_qemu, machines_nspawn, vlans, driver, log, os, create_machine, subtest, run_tests, join_all, retry, serial_stdout_off, serial_stdout_on, polling_condition, BaseMachine, QemuMachine, NspawnMachine, t, debug, dump_machine_ssh32container-test-run-iets-classic-e2e> machine: waiting for unit multi-user.target33container-test-run-iets-classic-e2e> machine: systemd-nspawn running (pid 50)34container-test-run-iets-classic-e2e> machine: Waiting for journal at /build/vm-state-machine/var/log/journal...35container-test-run-iets-classic-e2e> nixos-nspawn(machine): TAP vde-tap1 not found; container will be isolated from VDE36container-test-run-iets-classic-e2e> nixos-nspawn(machine): A common reason for this is that /dev/net is not available in the Nix sandbox. Try adding /dev/net to extra-sandbox-paths.37container-test-run-iets-classic-e2e> Note: in a future version of systemd-nspawn the default set of permitted socket address families will be restricted to AF_INET, AF_INET6 and AF_UNIX. Use --restrict-address-families= to configure the set of permitted socket address families, or set RestrictAddressFamilies= in a .nspawn file.38container-test-run-iets-classic-e2e> ░ Spawning container machine on /build/vm-state-machine.39container-test-run-iets-classic-e2e> machine # No journal files were found.40container-test-run-iets-classic-e2e> machine # No journal boot entry found for the specified boot (+0).41container-test-run-iets-classic-e2e> machine # No journal files were found.42container-test-run-iets-classic-e2e> machine # No journal boot entry found for the specified boot (+0).43container-test-run-iets-classic-e2e> machine # [1682452.823626] machine systemd-journald[57]: Journal started44container-test-run-iets-classic-e2e> machine # [1682452.823721] machine systemd-journald[57]: Runtime Journal (/run/log/journal/cad62c2b001d497caf36ca0c58b289e3) is 8M, max 2.5G, 2.5G free.45container-test-run-iets-classic-e2e> machine # [1682452.891816] machine systemd[1]: Listening on Journal Log Access Socket.46container-test-run-iets-classic-e2e> machine # [1682452.893363] machine systemd[1]: Finished Apply Kernel Variables.47container-test-run-iets-classic-e2e> machine # [1682452.942517] machine systemd[1]: Finished Create Static Device Nodes in /dev gracefully.48container-test-run-iets-classic-e2e> machine # [1682453.015342] machine systemd[1]: Starting Flush Journal to Persistent Storage...49container-test-run-iets-classic-e2e> machine # [1682453.045123] machine systemd[1]: Starting Create Static Device Nodes in /dev...50container-test-run-iets-classic-e2e> machine # [1682453.054369] machine systemd-journald[57]: Time spent on flushing to /var/log/journal/cad62c2b001d497caf36ca0c58b289e3 is 1.478ms for 7 entries.51container-test-run-iets-classic-e2e> machine # [1682453.054369] machine systemd-journald[57]: System Journal (/var/log/journal/cad62c2b001d497caf36ca0c58b289e3) is 512B, max 4G, 3.9G free.52container-test-run-iets-classic-e2e> machine # [1682453.127173] machine systemd[1]: Finished Flush Journal to Persistent Storage.53container-test-run-iets-classic-e2e> machine # [1682453.129146] machine systemd[1]: Finished Create Static Device Nodes in /dev.54container-test-run-iets-classic-e2e> machine # [1682453.130331] machine systemd[1]: Reached target Preparation for Local File Systems.55container-test-run-iets-classic-e2e> machine # [1682453.134328] machine systemd[1]: Rule-based Manager for Device Events and Files skipped, unmet condition check ConditionPathIsReadWrite=/sys56container-test-run-iets-classic-e2e> machine # [1682453.263198] machine systemd[1]: Finished Firewall.57container-test-run-iets-classic-e2e> machine # [1682453.873695] machine systemd[1]: Mounting /run/wrappers...58container-test-run-iets-classic-e2e> machine # [1682453.975310] machine systemd[1]: Mounted /run/wrappers.59container-test-run-iets-classic-e2e> machine # [1682453.976466] machine systemd[1]: Reached target Local File Systems.60container-test-run-iets-classic-e2e> machine # [1682453.977568] machine systemd[1]: Listening on Boot Loader Control Service Socket.61container-test-run-iets-classic-e2e> machine # [1682453.990138] machine systemd[1]: Starting Create SUID/SGID Wrappers...62container-test-run-iets-classic-e2e> machine # [1682453.990612] machine systemd[1]: Update Boot Loader Random Seed skipped, unmet condition check ConditionVirtualization=!container63container-test-run-iets-classic-e2e> machine # [1682453.996131] machine systemd[1]: Starting Save Transient machine-id to Disk...64container-test-run-iets-classic-e2e> machine # [1682454.014157] machine systemd[1]: Starting Create System Files and Directories...65container-test-run-iets-classic-e2e> machine # [1682454.038749] machine suid-sgid-wrappers-start[168]: chmod: changing permissions of '/run/wrappers/wrappers.6h6FECmr8v/chsh': Operation not permitted66container-test-run-iets-classic-e2e> machine # [1682454.048523] machine systemd-tmpfiles[161]: Cannot set file attributes for '/var/empty', value=0x00000010, mask=0x00000010, ignoring: Operation not permitted67container-test-run-iets-classic-e2e> machine # [1682454.049495] machine systemd-tmpfiles[161]: fchmod() of /var/log/journal failed: Operation not permitted68container-test-run-iets-classic-e2e> machine # [1682454.049647] machine systemd-tmpfiles[161]: fchmod() of /var/log/journal/cad62c2b001d497caf36ca0c58b289e3 failed: Operation not permitted69container-test-run-iets-classic-e2e> machine # [1682454.049768] machine systemd-tmpfiles[161]: fchmod() of /run/log/journal failed: Operation not permitted70container-test-run-iets-classic-e2e> machine # [1682454.119159] machine systemd[1]: suid-sgid-wrappers.service: Main process exited, code=exited, status=1/FAILURE71container-test-run-iets-classic-e2e> machine # [1682454.119263] machine systemd[1]: suid-sgid-wrappers.service: Failed with result 'exit-code'.72container-test-run-iets-classic-e2e> machine # [1682454.119491] machine systemd[1]: Failed to start Create SUID/SGID Wrappers.73container-test-run-iets-classic-e2e> machine # [1682454.131365] machine systemd[1]: Finished Create System Files and Directories.74container-test-run-iets-classic-e2e> machine # [1682454.295794] machine systemd[1]: Starting Rebuild Journal Catalog...75container-test-run-iets-classic-e2e> machine # [1682454.343189] machine systemd[1]: Starting Record System Boot/Shutdown in UTMP...76container-test-run-iets-classic-e2e> machine # [1682454.343759] machine systemd[1]: Finished Rebuild Journal Catalog.77container-test-run-iets-classic-e2e> machine # [1682454.348765] machine systemd[1]: Starting Update is Completed...78container-test-run-iets-classic-e2e> machine # [1682454.414180] machine systemd[1]: Finished Record System Boot/Shutdown in UTMP.79container-test-run-iets-classic-e2e> machine # [1682454.446420] machine systemd[1]: Finished Update is Completed.80container-test-run-iets-classic-e2e> machine # [1682454.447143] machine systemd[1]: Reached target System Initialization.81container-test-run-iets-classic-e2e> machine # [1682454.447287] machine systemd[1]: Discard unused filesystem blocks once a week skipped, unmet condition check ConditionVirtualization=!container82container-test-run-iets-classic-e2e> machine # [1682454.447336] machine systemd[1]: Started Daily Cleanup of Temporary Directories.83container-test-run-iets-classic-e2e> machine # [1682454.447354] machine systemd[1]: Reached target Timer Units.84container-test-run-iets-classic-e2e> machine # [1682454.447493] machine systemd[1]: Listening on D-Bus System Message Bus Socket.85container-test-run-iets-classic-e2e> machine # [1682454.447582] machine systemd[1]: Listening on Virtual Machine and Container Registration Service Socket.86container-test-run-iets-classic-e2e> machine # [1682454.447600] machine systemd[1]: Reached target Socket Units.87container-test-run-iets-classic-e2e> machine # [1682454.447632] machine systemd[1]: Reached target Basic System.88container-test-run-iets-classic-e2e> machine # [1682454.449439] machine systemd[1]: Starting Import lastlog data into lastlog2 database...89container-test-run-iets-classic-e2e> machine # [1682454.453331] machine systemd[1]: Starting Name Service Cache Daemon (nsncd)...90container-test-run-iets-classic-e2e> machine # [1682454.463229] machine systemd[1]: Starting resolvconf update...91container-test-run-iets-classic-e2e> machine # [1682454.535438] machine systemd[1]: Finished Import lastlog data into lastlog2 database.92container-test-run-iets-classic-e2e> machine # [1682454.772999] machine systemd[1]: nscd.service: Deactivated successfully.93container-test-run-iets-classic-e2e> machine # [1682454.773210] machine systemd[1]: Stopped Name Service Cache Daemon (nsncd).94container-test-run-iets-classic-e2e> machine # [1682454.781234] machine systemd[1]: Starting Name Service Cache Daemon (nsncd)...95container-test-run-iets-classic-e2e> machine # [1682454.781617] machine resolvconf-start[233]: setfacl: /run/resolvconf: Operation not supported96container-test-run-iets-classic-e2e> machine # [1682454.783148] machine systemd[1]: resolvconf.service: Main process exited, code=exited, status=1/FAILURE97container-test-run-iets-classic-e2e> machine # [1682454.783259] machine systemd[1]: resolvconf.service: Failed with result 'exit-code'.98container-test-run-iets-classic-e2e> machine # [1682454.783459] machine systemd[1]: Failed to start resolvconf update.99container-test-run-iets-classic-e2e> machine # [1682454.783671] machine systemd[1]: Reached target Preparation for Network.100container-test-run-iets-classic-e2e> machine # [1682454.785187] machine systemd[1]: Starting Address configuration of eth1...101container-test-run-iets-classic-e2e> machine # [1682454.787421] machine systemd[1]: Starting Extra networking commands....102container-test-run-iets-classic-e2e> machine # [1682454.807636] machine network-addresses-eth1-start[236]: adding address 192.168.1.1/24... done103container-test-run-iets-classic-e2e> machine # [1682454.810517] machine network-addresses-eth1-start[236]: adding address 2001:db8:1::1/64... done104container-test-run-iets-classic-e2e> machine # [1682454.815476] machine systemd[1]: Finished Address configuration of eth1.105container-test-run-iets-classic-e2e> machine # [1682454.862225] machine systemd[1]: Finished Extra networking commands..106container-test-run-iets-classic-e2e> machine # [1682454.862330] machine systemd[1]: Reached target Network.107container-test-run-iets-classic-e2e> machine # [1682455.401339] machine nsncd[234]: Oct 14 10:20:26.131 INFO started, config: Config { ignored_request_types: {}, worker_count: 8, handoff_timeout: 10s }, path: "/var/run/nscd/socket"108container-test-run-iets-classic-e2e> machine # [1682455.401512] machine systemd[1]: Started Name Service Cache Daemon (nsncd).109container-test-run-iets-classic-e2e> machine # [1682455.401594] machine systemd[1]: Reached target Host and Network Name Lookups.110container-test-run-iets-classic-e2e> machine # [1682455.401638] machine systemd[1]: Reached target User and Group Name Lookups.111container-test-run-iets-classic-e2e> machine # [1682455.409286] machine systemd[1]: Starting User Login Management...112container-test-run-iets-classic-e2e> machine # [1682455.413115] machine systemd[1]: Starting Permit User Sessions...113container-test-run-iets-classic-e2e> machine # [1682455.426762] machine systemd[1]: Finished Permit User Sessions.114container-test-run-iets-classic-e2e> machine # [1682455.427859] machine systemd[1]: Started Console Getty.115container-test-run-iets-classic-e2e> machine # [1682455.427898] machine systemd[1]: Getty on tty1 skipped, unmet condition check ConditionPathExists=/dev/tty0116container-test-run-iets-classic-e2e> machine # [1682455.427918] machine systemd[1]: Reached target Login Prompts.117container-test-run-iets-classic-e2e> machine # [1682455.995914] machine systemd[1]: etc-machine\x2did.mount: Deactivated successfully.118container-test-run-iets-classic-e2e> machine # [1682455.997613] machine systemd[1]: Finished Save Transient machine-id to Disk.119container-test-run-iets-classic-e2e> machine: still waiting for container 'machine' to reach ready state...120container-test-run-iets-classic-e2e> machine # [1682460.079675] machine systemd-logind[305]: New seat seat0.121container-test-run-iets-classic-e2e> machine # [1682460.080705] machine systemd[1]: Starting D-Bus System Message Bus...122container-test-run-iets-classic-e2e> machine # [1682460.080824] machine systemd[1]: Started User Login Management.123container-test-run-iets-classic-e2e> machine # [1682460.082411] machine systemd[1]: Starting linger-users.service...124container-test-run-iets-classic-e2e> machine # [1682460.103988] machine systemd[1]: linger-users.service: Deactivated successfully.125container-test-run-iets-classic-e2e> machine # [1682460.104191] machine systemd[1]: Finished linger-users.service.126container-test-run-iets-classic-e2e> machine # [1682460.104335] machine systemd[1]: Reached target Multi-User System.127container-test-run-iets-classic-e2e> machine: (finished: waiting for unit multi-user.target, in 10.68 seconds)128container-test-run-iets-classic-e2e> machine: must succeed: /nix/store/phhjngxgfhr1lrzk0w7ms3775mh0pxd5-writable-store /nix/store/aj4lf5wvsza1wr6296m0rim884yb1fx9-closure-info129container-test-run-iets-classic-e2e> machine # [1682460.778934] machine dbus-broker-launch[316]: Looking up NSS user entry for 'systemd-timesync'...130container-test-run-iets-classic-e2e> machine # [1682460.780769] machine dbus-broker-launch[316]: NSS returned no entry for 'systemd-timesync'131container-test-run-iets-classic-e2e> machine # [1682460.780769] machine dbus-broker-launch[316]: Invalid user-name in /nix/store/jlg1ir1z4dfm81ya2kccdm1fv06giam6-system-path/share/dbus-1/system.d/org.freedesktop.timesync1.conf +16: user="systemd-timesync"132container-test-run-iets-classic-e2e> machine # [1682460.781082] machine systemd[1]: Started D-Bus System Message Bus.133container-test-run-iets-classic-e2e> machine # [1682460.782066] machine systemd[1]: Startup finished in 9.517s.134container-test-run-iets-classic-e2e> machine # [1682460.791013] machine dbus-broker-launch[316]: Ready135container-test-run-iets-classic-e2e> warning: '--json' without '--json-format' is deprecated; please specify '--json-format 1' or '--json-format 2'. This will become an error in a future release.136container-test-run-iets-classic-e2e> machine: (finished: must succeed: /nix/store/phhjngxgfhr1lrzk0w7ms3775mh0pxd5-writable-store /nix/store/aj4lf5wvsza1wr6296m0rim884yb1fx9-closure-info, in 26.44 seconds)137container-test-run-iets-classic-e2e> machine: must succeed: systemctl start nix-daemon.socket138container-test-run-iets-classic-e2e> machine: (finished: must succeed: systemctl start nix-daemon.socket, in 0.09 seconds)139container-test-run-iets-classic-e2e> machine: must succeed: /nix/store/4w5x4f2szvwd1kzhp0xpzgzpvvpmkc4h-leftovers140container-test-run-iets-classic-e2e> machine # [1682487.576916] machine systemd[1]: Listening on Nix Daemon Socket.141container-test-run-iets-classic-e2e> machine: (finished: must succeed: /nix/store/4w5x4f2szvwd1kzhp0xpzgzpvvpmkc4h-leftovers, in 0.37 seconds)142container-test-run-iets-classic-e2e> machine: must succeed: cp -r /nix/store/vlf6aj8qdy45375y3g6f8gmamx5qxcwd-source /home/alice/iets && chmod -R u+w /home/alice/iets && chown -R alice /home/alice/iets143container-test-run-iets-classic-e2e> machine: (finished: must succeed: cp -r /nix/store/vlf6aj8qdy45375y3g6f8gmamx5qxcwd-source /home/alice/iets && chmod -R u+w /home/alice/iets && chown -R alice /home/alice/iets, in 0.14 seconds)144container-test-run-iets-classic-e2e> machine: must succeed: runuser -l alice -c 'cd iets && git init -q && git add -A && git -c user.name=e2e -c user.email=e2e@example.com commit -q -m e2e'145container-test-run-iets-classic-e2e> machine # [1682488.187924] machine runuser[4980]: pam_unix(runuser-l:session): session opened for user alice(uid=1000) by (uid=0)146container-test-run-iets-classic-e2e> machine # [1682488.448134] machine runuser[4980]: pam_unix(runuser-l:session): session closed for user alice147container-test-run-iets-classic-e2e> machine: (finished: must succeed: runuser -l alice -c 'cd iets && git init -q && git add -A && git -c user.name=e2e -c user.email=e2e@example.com commit -q -m e2e', in 0.36 seconds)148container-test-run-iets-classic-e2e> machine: must succeed: runuser -l alice -c 'cd iets && IETS=/nix/store/ihjjzqwln95rhis82p6ih661v8zlv4vy-iets-0.1.0/bin/iets NIXPKGS=/nix/store/2010s04mqpq7q1kch0ddc9b429s2vh9v-source E2E_OFFLINE=1   nu scripts/classic-e2e.nu' >&2149container-test-run-iets-classic-e2e> machine # [1682488.467853] machine runuser[4993]: pam_unix(runuser-l:session): session opened for user alice(uid=1000) by (uid=0)150container-test-run-iets-classic-e2e> real nix: /nix/store/f0rfa5pcykqbv313j74x7l7wa8nl4bj4-nix-2.34.8/bin151container-test-run-iets-classic-e2e> ok   builtins --impure []: the same names nix has152container-test-run-iets-classic-e2e> ok   builtins --impure [dynamic-derivations]: the same names nix has153container-test-run-iets-classic-e2e> ok   builtins --impure [dynamic-derivations fetch-closure fetch-tree]: the same names nix has154container-test-run-iets-classic-e2e> ok   builtins --pure-eval []: the same names nix has155container-test-run-iets-classic-e2e> ok   builtins --pure-eval [dynamic-derivations]: the same names nix has156container-test-run-iets-classic-e2e> ok   builtins --pure-eval [dynamic-derivations fetch-closure fetch-tree]: the same names nix has157container-test-run-iets-classic-e2e> machine # [1682498.529313] machine systemd[1]: Started Nix Daemon.158container-test-run-iets-classic-e2e> machine # [1682498.773652] machine nix-daemon[5314]: accepted connection from pid 5307, user alice (trusted)159container-test-run-iets-classic-e2e> ok   instantiate <nixpkgs> -A hello160container-test-run-iets-classic-e2e> machine # [1682500.596868] machine nix-daemon[5314]: accepted connection from pid 5431, user alice (trusted)161container-test-run-iets-classic-e2e> machine # [1682509.064020] machine nix-daemon[5314]: accepted connection from pid 5452, user alice (trusted)162container-test-run-iets-classic-e2e> ok   instantiate <nixpkgs> -A glibc (multi-output)163container-test-run-iets-classic-e2e> machine # [1682509.622513] machine nix-daemon[5314]: accepted connection from pid 5463, user alice (trusted)164container-test-run-iets-classic-e2e> machine # [1682511.211121] machine nix-daemon[5314]: accepted connection from pid 5484, user alice (trusted)165container-test-run-iets-classic-e2e> ok   instantiate <nixpkgs> -A glibc.dev (!output suffix)166container-test-run-iets-classic-e2e> machine # [1682511.535545] machine nix-daemon[5314]: accepted connection from pid 5495, user alice (trusted)167container-test-run-iets-classic-e2e> machine # [1682514.522632] machine nix-daemon[5314]: accepted connection from pid 5516, user alice (trusted)168container-test-run-iets-classic-e2e> machine # [1682514.864409] machine nix-daemon[5314]: accepted connection from pid 5527, user alice (trusted)169container-test-run-iets-classic-e2e> ok   instantiate two -A in one run170container-test-run-iets-classic-e2e> machine # [1682518.272988] machine nix-daemon[5314]: accepted connection from pid 5548, user alice (trusted)171container-test-run-iets-classic-e2e> machine # [1682518.848022] machine nix-daemon[5314]: accepted connection from pid 5559, user alice (trusted)172container-test-run-iets-classic-e2e> ok   instantiate two -A that name one derivation173container-test-run-iets-classic-e2e> machine # [1682534.753411] machine nix-daemon[5314]: accepted connection from pid 5580, user alice (trusted)174container-test-run-iets-classic-e2e> machine # [1682535.244031] machine nix-daemon[5314]: accepted connection from pid 5591, user alice (trusted)175container-test-run-iets-classic-e2e> ok   instantiate --add-root ''176container-test-run-iets-classic-e2e> ok   instantiate --eval --strict --json177container-test-run-iets-classic-e2e> ok   instantiate --eval178container-test-run-iets-classic-e2e> ok   instantiate --eval --raw179container-test-run-iets-classic-e2e> ok   instantiate --eval --raw a path180container-test-run-iets-classic-e2e> ok   instantiate --eval --raw an outPath181container-test-run-iets-classic-e2e> ok   instantiate --eval, one --arg name twice182container-test-run-iets-classic-e2e> ok   instantiate --eval, --arg then --argstr of one name183container-test-run-iets-classic-e2e> ok   instantiate --eval, a later expression throws184container-test-run-iets-classic-e2e> ok   instantiate --eval --argstr185container-test-run-iets-classic-e2e> ok   instantiate a custom drv186container-test-run-iets-classic-e2e> machine # [1682547.276157] machine nix-daemon[5314]: accepted connection from pid 5846, user alice (trusted)187container-test-run-iets-classic-e2e> machine # [1682547.453023] machine nix-daemon[5314]: accepted connection from pid 5858, user alice (trusted)188container-test-run-iets-classic-e2e> machine # [1682550.733104] machine nix-daemon[5314]: accepted connection from pid 5879, user alice (trusted)189container-test-run-iets-classic-e2e> machine # [1682550.972043] machine nix-daemon[5314]: accepted connection from pid 5894, user alice (trusted)190container-test-run-iets-classic-e2e> ok   drv closure follows the references of a toFile191container-test-run-iets-classic-e2e> ok   instantiate builtins.outputOf, once and nested192container-test-run-iets-classic-e2e> machine # [1682551.253049] machine nix-daemon[5314]: accepted connection from pid 5915, user alice (trusted)193container-test-run-iets-classic-e2e> machine # [1682551.386036] machine nix-daemon[5314]: accepted connection from pid 5937, user alice (trusted)194container-test-run-iets-classic-e2e> ok   eval builtins.outputOf placeholders195container-test-run-iets-classic-e2e> machine # [1682551.599273] machine nix-daemon[5314]: accepted connection from pid 5958, user alice (trusted)196container-test-run-iets-classic-e2e> machine # [1682551.800034] machine nix-daemon[5314]: accepted connection from pid 5980, user alice (trusted)197container-test-run-iets-classic-e2e> ok   two consumers of one dynamic producer stay apart198container-test-run-iets-classic-e2e> machine # [1682552.061846] machine nix-daemon[5314]: accepted connection from pid 6001, user alice (trusted)199container-test-run-iets-classic-e2e> machine # [1682552.169220] machine nix-daemon[5314]: accepted connection from pid 6023, user alice (trusted)200container-test-run-iets-classic-e2e> ok   instantiate --readonly-mode201container-test-run-iets-classic-e2e> machine # [1682553.166448] machine nix-daemon[5314]: accepted connection from pid 6070, user alice (trusted)202container-test-run-iets-classic-e2e> machine # [1682553.288019] machine nix-daemon[5314]: accepted connection from pid 6093, user alice (trusted)203container-test-run-iets-classic-e2e> ok   --add-root links and registers a gc root204container-test-run-iets-classic-e2e> machine # [1682556.451452] machine nix-daemon[5314]: accepted connection from pid 6114, user alice (trusted)205container-test-run-iets-classic-e2e> machine # [1682556.583906] machine nix-daemon[5314]: accepted connection from pid 6127, user alice (trusted)206container-test-run-iets-classic-e2e> machine # [1682556.709820] machine nix-daemon[5314]: accepted connection from pid 6148, user alice (trusted)207container-test-run-iets-classic-e2e> machine # [1682557.820561] machine nix-daemon[5314]: accepted connection from pid 6198, user alice (trusted)208container-test-run-iets-classic-e2e> machine # [1682558.037033] machine nix-daemon[5314]: accepted connection from pid 6239, user alice (trusted)209container-test-run-iets-classic-e2e> machine # [1682559.953449] machine nix-daemon[5314]: accepted connection from pid 6289, user alice (trusted)210container-test-run-iets-classic-e2e> machine # [1682560.139728] machine nix-daemon[5314]: accepted connection from pid 6332, user alice (trusted)211container-test-run-iets-classic-e2e> machine # [1682562.322021] machine nix-daemon[5314]: accepted connection from pid 6384, user alice (trusted)212container-test-run-iets-classic-e2e> machine # [1682562.711706] machine nix-daemon[5314]: accepted connection from pid 6427, user alice (trusted)213container-test-run-iets-classic-e2e> machine # [1682564.366943] machine nix-daemon[5314]: accepted connection from pid 6479, user alice (trusted)214container-test-run-iets-classic-e2e> ok   -o over an existing path acts as Nix does215container-test-run-iets-classic-e2e> machine # [1682565.129918] machine nix-daemon[5314]: accepted connection from pid 6520, user alice (trusted)216container-test-run-iets-classic-e2e> machine # [1682565.731957] machine nix-daemon[5314]: accepted connection from pid 6564, user alice (trusted)217container-test-run-iets-classic-e2e> ok   build a custom drv, default result218container-test-run-iets-classic-e2e> machine # [1682566.146579] machine nix-daemon[5314]: accepted connection from pid 6599, user alice (trusted)219container-test-run-iets-classic-e2e> ok   build -o link220container-test-run-iets-classic-e2e> machine # [1682567.166827] machine nix-daemon[5314]: accepted connection from pid 6643, user alice (trusted)221container-test-run-iets-classic-e2e> machine # [1682567.494732] machine nix-daemon[5314]: accepted connection from pid 6678, user alice (trusted)222container-test-run-iets-classic-e2e> machine # [1682569.876772] machine nix-daemon[5314]: accepted connection from pid 6722, user alice (trusted)223container-test-run-iets-classic-e2e> ok   build --no-out-link224container-test-run-iets-classic-e2e> machine # [1682570.283943] machine nix-daemon[5314]: accepted connection from pid 6757, user alice (trusted)225container-test-run-iets-classic-e2e> ok   build two outputs of one drv226container-test-run-iets-classic-e2e> machine # [1682572.911037] machine nix-daemon[5314]: accepted connection from pid 6809, user alice (trusted)227container-test-run-iets-classic-e2e> machine # [1682573.127031] machine nix-daemon[5314]: accepted connection from pid 6825, user alice (trusted)228container-test-run-iets-classic-e2e> ok   build two drvs229container-test-run-iets-classic-e2e> machine # [1682575.007427] machine nix-daemon[5314]: accepted connection from pid 6874, user alice (trusted)230container-test-run-iets-classic-e2e> machine # [1682576.188030] machine nix-daemon[5314]: accepted connection from pid 6932, user alice (trusted)231container-test-run-iets-classic-e2e> ok   builder = unix://SCRATCH builds there and registers here232container-test-run-iets-classic-e2e> machine # [1682576.629985] machine nix-daemon[5314]: accepted connection from pid 6969, user alice (trusted)233container-test-run-iets-classic-e2e> machine # [1682576.842932] machine nix-daemon[5314]: accepted connection from pid 6990, user alice (trusted)234container-test-run-iets-classic-e2e> ok   fetchGit of a clean working tree235container-test-run-iets-classic-e2e> machine # [1682578.109793] machine nix-daemon[5314]: accepted connection from pid 7059, user alice (trusted)236container-test-run-iets-classic-e2e> ok   fetchGit of a file URL237container-test-run-iets-classic-e2e> machine # [1682578.700564] machine nix-daemon[5314]: accepted connection from pid 7096, user alice (trusted)238container-test-run-iets-classic-e2e> ok   fetchGit with name, shallow and exportIgnore = false239container-test-run-iets-classic-e2e> machine # [1682579.269022] machine nix-daemon[5314]: accepted connection from pid 7129, user alice (trusted)240container-test-run-iets-classic-e2e> ok   fetchGit of a rev241container-test-run-iets-classic-e2e> machine # [1682579.899104] machine nix-daemon[5314]: accepted connection from pid 7151, user alice (trusted)242container-test-run-iets-classic-e2e> machine # [1682580.104825] machine nix-daemon[5314]: accepted connection from pid 7170, user alice (trusted)243container-test-run-iets-classic-e2e> machine # [1682582.279017] machine nix-daemon[5314]: accepted connection from pid 7192, user alice (trusted)244container-test-run-iets-classic-e2e> ok   fetchGit of a rev in pure mode245container-test-run-iets-classic-e2e> machine # [1682582.541874] machine nix-daemon[5314]: accepted connection from pid 7211, user alice (trusted)246container-test-run-iets-classic-e2e> ok   fetchGit of a ref247container-test-run-iets-classic-e2e> machine # [1682584.999270] machine nix-daemon[5314]: accepted connection from pid 7233, user alice (trusted)248container-test-run-iets-classic-e2e> machine # [1682585.240821] machine nix-daemon[5314]: accepted connection from pid 7254, user alice (trusted)249container-test-run-iets-classic-e2e> ok   fetchGit of an unlocked tree in pure mode250container-test-run-iets-classic-e2e> machine # [1682587.486523] machine nix-daemon[5314]: accepted connection from pid 7303, user alice (trusted)251container-test-run-iets-classic-e2e> machine # [1682587.777220] machine nix-daemon[5314]: accepted connection from pid 7324, user alice (trusted)252container-test-run-iets-classic-e2e> ok   fetchGit of a ref that is a tag253container-test-run-iets-classic-e2e> ok   fetchGit of a ref that is an annotated tag254container-test-run-iets-classic-e2e> machine # [1682588.318526] machine nix-daemon[5314]: accepted connection from pid 7346, user alice (trusted)255container-test-run-iets-classic-e2e> machine # [1682588.505033] machine nix-daemon[5314]: accepted connection from pid 7367, user alice (trusted)256container-test-run-iets-classic-e2e> ok   fetchGit of a branch with an executable, a symlink and a submodule257container-test-run-iets-classic-e2e> machine # [1682589.320879] machine nix-daemon[5314]: accepted connection from pid 7414, user alice (trusted)258container-test-run-iets-classic-e2e> machine # [1682589.769123] machine nix-daemon[5314]: accepted connection from pid 7436, user alice (trusted)259container-test-run-iets-classic-e2e> machine # [1682590.002971] machine nix-daemon[5314]: accepted connection from pid 7455, user alice (trusted)260container-test-run-iets-classic-e2e> ok   fetchGit of a rev and a ref261container-test-run-iets-classic-e2e> ok   fetchGit of a rev with exportIgnore = false262container-test-run-iets-classic-e2e> machine # [1682590.443021] machine nix-daemon[5314]: accepted connection from pid 7494, user alice (trusted)263container-test-run-iets-classic-e2e> ok   fetchGit of a ref that names nothing264container-test-run-iets-classic-e2e> ok   fetchGit { url = "/tmp/iets-classic-e2e.sx5fGy/fetchgit repo"; rev = "35caab02e0e41c7cb5ddce345e61211a7c1e0dfb"; } runs no nix265container-test-run-iets-classic-e2e> machine # [1682591.244049] machine nix-daemon[5314]: accepted connection from pid 7567, user alice (trusted)266container-test-run-iets-classic-e2e> ok   fetchGit { url = "/tmp/iets-classic-e2e.sx5fGy/fetchgit repo"; ref = "ann"; } runs no nix267container-test-run-iets-classic-e2e> machine # [1682593.287124] machine nix-daemon[5314]: accepted connection from pid 7586, user alice (trusted)268container-test-run-iets-classic-e2e> ok   fetchGit of a dirty working tree269container-test-run-iets-classic-e2e> machine # [1682594.545451] machine nix-daemon[5314]: accepted connection from pid 7632, user alice (trusted)270container-test-run-iets-classic-e2e> ok   fetchGit of a dirty working tree warns as Nix does271container-test-run-iets-classic-e2e> ok   lib.fileset.gitTracked of a dirty working tree272container-test-run-iets-classic-e2e> machine # [1682595.622025] machine nix-daemon[5314]: accepted connection from pid 7684, user alice (trusted)273container-test-run-iets-classic-e2e> machine # [1682595.668959] machine nix-daemon[5314]: accepted connection from pid 7684, user alice (trusted)274container-test-run-iets-classic-e2e> ok   lib.fileset.gitTracked of a clean working tree275container-test-run-iets-classic-e2e> ok   --parse execs the real nix-instantiate276container-test-run-iets-classic-e2e> machine # [1682596.250537] machine nix-daemon[5314]: accepted connection from pid 7733, user alice (trusted)277container-test-run-iets-classic-e2e> machine # [1682596.305321] machine nix-daemon[5314]: accepted connection from pid 7733, user alice (trusted)278container-test-run-iets-classic-e2e> ok   --iets-option never reaches the fallback nix279container-test-run-iets-classic-e2e> ok   the fallback prints one line on stderr280container-test-run-iets-classic-e2e> ok   IETS_NO_FALLBACK=1 exits 1281container-test-run-iets-classic-e2e> ok   nix-bin-dir full of iets: the fallback stops, it does not loop282container-test-run-iets-classic-e2e> ok   nix eval > /dev/full283container-test-run-iets-classic-e2e> ok   nix-instantiate --eval > /dev/full284container-test-run-iets-classic-e2e> ok   iets version > /dev/full reports, not aborts285container-test-run-iets-classic-e2e> ok   iets parse /tmp/iets-classic-e2e.sx5fGy/case/multi.nix > /dev/full reports, not aborts286container-test-run-iets-classic-e2e> ok   iets --help > /dev/full reports, not aborts287container-test-run-iets-classic-e2e> ok   iets lint list > /dev/full reports, not aborts288container-test-run-iets-classic-e2e> ok   a bad iets.toml and 'iets version'289container-test-run-iets-classic-e2e> ok   a bad iets.toml and 'iets --help'290container-test-run-iets-classic-e2e> ok   a bad iets.toml and 'iets eval -E 1'291container-test-run-iets-classic-e2e> ok   an early error is a record under internal-json292container-test-run-iets-classic-e2e> ok   fetchTarball falls back and prints the real result293container-test-run-iets-classic-e2e> ok   fetchMercurial falls back with one 'iets:' prefix294container-test-run-iets-classic-e2e> machine # [1682597.643013] machine nix-daemon[5314]: accepted connection from pid 7964, user alice (trusted)295container-test-run-iets-classic-e2e> machine # [1682597.741060] machine nix-daemon[5314]: accepted connection from pid 7990, user alice (trusted)296container-test-run-iets-classic-e2e> ok   iets eval fetchMercurial names fetchTree on stderr297container-test-run-iets-classic-e2e> ok   fetchurl with a sha256 has nix's store path298container-test-run-iets-classic-e2e> ok   nix eval reads what fetchurl got299container-test-run-iets-classic-e2e> machine # [1682598.603951] machine nix-daemon[5314]: accepted connection from pid 8036, user alice (trusted)300container-test-run-iets-classic-e2e> machine # [1682598.850051] machine nix-daemon[5314]: accepted connection from pid 8068, user alice (trusted)301container-test-run-iets-classic-e2e> ok   fetchurl without a hash falls back in an impure evaluation302container-test-run-iets-classic-e2e> ok   fetchurl without a hash in a pure evaluation303container-test-run-iets-classic-e2e> machine # [1682599.089399] machine nix-daemon[5314]: accepted connection from pid 8091, user alice (trusted)304container-test-run-iets-classic-e2e> machine # [1682599.166100] machine nix-daemon[5314]: accepted connection from pid 8116, user alice (trusted)305container-test-run-iets-classic-e2e> ok   fetchurl does not take an invalid path306container-test-run-iets-classic-e2e> machine # [1682599.588602] machine nix-daemon[5314]: accepted connection from pid 8164, user alice (trusted)307container-test-run-iets-classic-e2e> machine # [1682599.673976] machine nix-daemon[5314]: accepted connection from pid 8176, user alice (trusted)308container-test-run-iets-classic-e2e> ok   fetchurl with a wrong hash does not take an invalid path309container-test-run-iets-classic-e2e> machine # [1682599.907552] machine nix-daemon[5314]: accepted connection from pid 8199, user alice (trusted)310container-test-run-iets-classic-e2e> machine # [1682599.995314] machine nix-daemon[5314]: accepted connection from pid 8211, user alice (trusted)311container-test-run-iets-classic-e2e> ok   fetchTarball does not take an invalid path312container-test-run-iets-classic-e2e> machine # [1682600.275767] machine nix-daemon[5314]: accepted connection from pid 8251, user alice (trusted)313container-test-run-iets-classic-e2e> machine # [1682600.325434] machine nix-daemon[5314]: accepted connection from pid 8251, user alice (trusted)314container-test-run-iets-classic-e2e> machine # [1682600.395155] machine nix-daemon[5314]: accepted connection from pid 8265, user alice (trusted)315container-test-run-iets-classic-e2e> ok   import from derivation falls back316container-test-run-iets-classic-e2e> ok   iets eval refuses import from derivation317container-test-run-iets-classic-e2e> machine # [1682600.679594] machine nix-daemon[5314]: accepted connection from pid 8287, user alice (trusted)318container-test-run-iets-classic-e2e> machine # [1682600.749515] machine nix-daemon[5314]: accepted connection from pid 8312, user alice (trusted)319container-test-run-iets-classic-e2e> ok   instantiate --eval a non-UTF-8 file name320container-test-run-iets-classic-e2e> ok   iets eval a non-UTF-8 file name321container-test-run-iets-classic-e2e> ok   a non-UTF-8 file name reaches the fallback intact322container-test-run-iets-classic-e2e> ok   the 'nix' name falls back323container-test-run-iets-classic-e2e> ok   nix eval --json .#x324container-test-run-iets-classic-e2e> machine # [1682601.674226] machine nix-daemon[5314]: accepted connection from pid 8444, user alice (trusted)325container-test-run-iets-classic-e2e> machine # [1682601.948613] machine nix-daemon[5314]: accepted connection from pid 8473, user alice (trusted)326container-test-run-iets-classic-e2e> ok   nix eval --raw .#x327container-test-run-iets-classic-e2e> ok   nix eval .#s (attrset, list, float)328container-test-run-iets-classic-e2e> machine # [1682602.222880] machine nix-daemon[5314]: accepted connection from pid 8502, user alice (trusted)329container-test-run-iets-classic-e2e> ok   nix eval .#l330container-test-run-iets-classic-e2e> ok   nix flake prefetch-inputs, no inputs331container-test-run-iets-classic-e2e> ok   nix flake prefetch-inputs is iets's own332container-test-run-iets-classic-e2e> machine # [1682603.079216] machine nix-daemon[5314]: accepted connection from pid 8531, user alice (trusted)333container-test-run-iets-classic-e2e> machine # [1682603.183348] machine nix-daemon[5314]: accepted connection from pid 8557, user alice (trusted)334container-test-run-iets-classic-e2e> machine # [1682603.498578] machine nix-daemon[5314]: accepted connection from pid 8586, user alice (trusted)335container-test-run-iets-classic-e2e> ok   nix eval .#x, no flake.lock336container-test-run-iets-classic-e2e> ok   nix eval .#x, no flake.lock is iets's own337container-test-run-iets-classic-e2e> ok   nix eval .#pkg.drvPath, no flake.lock338container-test-run-iets-classic-e2e> ok   nix eval .#pkg.drvPath, no flake.lock is iets's own339container-test-run-iets-classic-e2e> machine # [1682603.735164] machine nix-daemon[5314]: accepted connection from pid 8615, user alice (trusted)340container-test-run-iets-classic-e2e> ok   nix build .#pkg, no flake.lock341container-test-run-iets-classic-e2e> ok   nix build .#pkg, no flake.lock is iets's own342container-test-run-iets-classic-e2e> ok   no flake.lock: neither side writes one343container-test-run-iets-classic-e2e> machine # [1682603.963491] machine nix-daemon[5314]: accepted connection from pid 8637, user alice (trusted)344container-test-run-iets-classic-e2e> machine # [1682604.081374] machine nix-daemon[5314]: accepted connection from pid 8637, user alice (trusted)345container-test-run-iets-classic-e2e> machine # [1682604.134946] machine nix-daemon[5314]: accepted connection from pid 8674, user alice (trusted)346container-test-run-iets-classic-e2e> ok   nix eval, farm first on PATH, fresh tree347container-test-run-iets-classic-e2e> ok   fallback through the farm marker, real nix off PATH348container-test-run-iets-classic-e2e> ok   nix eval .#pkg (a derivation)349container-test-run-iets-classic-e2e> machine # [1682604.326837] machine nix-daemon[5314]: accepted connection from pid 8703, user alice (trusted)350container-test-run-iets-classic-e2e> machine # [1682604.557809] machine nix-daemon[5314]: accepted connection from pid 8773, user alice (trusted)351container-test-run-iets-classic-e2e> machine # [1682604.712820] machine nix-daemon[5314]: accepted connection from pid 8802, user alice (trusted)352container-test-run-iets-classic-e2e> ok   nix eval . (packages.<system>.default)353container-test-run-iets-classic-e2e> ok   nix eval --expr354container-test-run-iets-classic-e2e> ok   nix eval --expr is pure355container-test-run-iets-classic-e2e> ok   nix eval --impure --expr356container-test-run-iets-classic-e2e> ok   nix --option pure-eval false eval --expr357container-test-run-iets-classic-e2e> ok   nix eval -f is impure358container-test-run-iets-classic-e2e> ok   nix eval .#x is pure359container-test-run-iets-classic-e2e> ok   nix-instantiate is impure360container-test-run-iets-classic-e2e> ok   nix-instantiate --pure-eval361container-test-run-iets-classic-e2e> machine # [1682605.599669] machine nix-daemon[5314]: accepted connection from pid 8964, user alice (trusted)362container-test-run-iets-classic-e2e> ok   nix-instantiate --option pure-eval true363container-test-run-iets-classic-e2e> ok   nix-instantiate --pure-eval refuses a local file364container-test-run-iets-classic-e2e> ok   nix.conf system reaches builtins.currentSystem365container-test-run-iets-classic-e2e> ok   NIX_USER_CONF_FILES empty366container-test-run-iets-classic-e2e> ok   NIX_USER_CONF_FILES unset367container-test-run-iets-classic-e2e> ok   nix eval -f with pure-eval from the system nix.conf368container-test-run-iets-classic-e2e> ok   nix eval -f with pure-eval from a user nix.conf369container-test-run-iets-classic-e2e> ok   nix eval -f with pure-eval from NIX_CONFIG370container-test-run-iets-classic-e2e> ok   nix eval -f with pure-eval from --option371container-test-run-iets-classic-e2e> ok   nix eval -f with pure-eval from --impure372container-test-run-iets-classic-e2e> ok   instantiate -j 4294967296373container-test-run-iets-classic-e2e> ok   instantiate --cores 4294967296374container-test-run-iets-classic-e2e> ok   instantiate -j auto375container-test-run-iets-classic-e2e> ok   instantiate --cores 1K376container-test-run-iets-classic-e2e> ok   instantiate -j 2377container-test-run-iets-classic-e2e> ok   instantiate -Ifoo=/etc378container-test-run-iets-classic-e2e> ok   nix-eval-jobs prints no summary379container-test-run-iets-classic-e2e> ok   iets eval-jobs keeps its summary380container-test-run-iets-classic-e2e> ok   nix.conf 'pure-eval = maybe'381container-test-run-iets-classic-e2e> ok   nix.conf 'show-trace = maybe'382container-test-run-iets-classic-e2e> ok   nix.conf 'sandbox = maybe'383container-test-run-iets-classic-e2e> ok   nix.conf 'eval-cache = 2'384container-test-run-iets-classic-e2e> ok   nix.conf 'connect-timeout = abc'385container-test-run-iets-classic-e2e> ok   nix.conf 'cores = -1'386container-test-run-iets-classic-e2e> ok   nix.conf 'cores = 4294967296'387container-test-run-iets-classic-e2e> ok   nix.conf 'max-jobs = abc'388container-test-run-iets-classic-e2e> ok   nix.conf 'cores = 1K'389container-test-run-iets-classic-e2e> ok   nix.conf 'min-free = 2G'390container-test-run-iets-classic-e2e> ok   nix.conf 'max-jobs = auto'391container-test-run-iets-classic-e2e> ok   nix.conf 'sandbox = relaxed'392container-test-run-iets-classic-e2e> ok   nix eval --expr, a nested error393container-test-run-iets-classic-e2e> ok   nix eval --expr, repeated and empty values394container-test-run-iets-classic-e2e> ok   nix eval --expr, functions395container-test-run-iets-classic-e2e> machine # [1682617.589819] machine nix-daemon[5314]: accepted connection from pid 9805, user alice (trusted)396container-test-run-iets-classic-e2e> ok   symlink: readFile through a copy of the link itself397container-test-run-iets-classic-e2e> machine # [1682617.873444] machine nix-daemon[5314]: accepted connection from pid 9834, user alice (trusted)398container-test-run-iets-classic-e2e> ok   symlink: readFile of a target the filter left out399container-test-run-iets-classic-e2e> ok   symlink: readDir through a copy of the link itself400container-test-run-iets-classic-e2e> machine # [1682618.130223] machine nix-daemon[5314]: accepted connection from pid 9863, user alice (trusted)401container-test-run-iets-classic-e2e> machine # [1682618.347448] machine nix-daemon[5314]: accepted connection from pid 9892, user alice (trusted)402container-test-run-iets-classic-e2e> ok   symlink: hashFile through a copy of the link itself403container-test-run-iets-classic-e2e> ok   symlink: readFile below a link in a copied tree404container-test-run-iets-classic-e2e> machine # [1682618.496112] machine nix-daemon[5314]: accepted connection from pid 9921, user alice (trusted)405container-test-run-iets-classic-e2e> machine # [1682618.703976] machine nix-daemon[5314]: accepted connection from pid 9950, user alice (trusted)406container-test-run-iets-classic-e2e> ok   symlink: readDir of a link in a copied tree407container-test-run-iets-classic-e2e> ok   symlink: pathExists below a link in a copied tree408container-test-run-iets-classic-e2e> machine # [1682618.966665] machine nix-daemon[5314]: accepted connection from pid 9979, user alice (trusted)409container-test-run-iets-classic-e2e> machine # [1682619.134564] machine nix-daemon[5314]: accepted connection from pid 10008, user alice (trusted)410container-test-run-iets-classic-e2e> ok   symlink: path of a link in a copied tree411container-test-run-iets-classic-e2e> ok   symlink: path of a link, local and copied agree412container-test-run-iets-classic-e2e> machine # [1682619.307848] machine nix-daemon[5314]: accepted connection from pid 10037, user alice (trusted)413container-test-run-iets-classic-e2e> machine # [1682619.542187] machine nix-daemon[5314]: accepted connection from pid 10066, user alice (trusted)414container-test-run-iets-classic-e2e> ok   symlink: path of a dangling link415container-test-run-iets-classic-e2e> ok   symlink: path of a dangling link in a copied tree416container-test-run-iets-classic-e2e> machine # [1682619.724635] machine nix-daemon[5314]: accepted connection from pid 10095, user alice (trusted)417container-test-run-iets-classic-e2e> machine # [1682619.759012] machine nix-daemon[10115]: unexpected Nix daemon error: error: interrupted by the user418container-test-run-iets-classic-e2e> machine # [1682619.889633] machine nix-daemon[5314]: accepted connection from pid 10124, user alice (trusted)419container-test-run-iets-classic-e2e> machine # [1682619.899485] machine nix-daemon[10144]: unexpected Nix daemon error: error: interrupted by the user420container-test-run-iets-classic-e2e> machine # [1682620.037042] machine nix-daemon[5314]: accepted connection from pid 10153, user alice (trusted)421container-test-run-iets-classic-e2e> ok   symlink: storePath below a link in a copied tree422container-test-run-iets-classic-e2e> ok   symlink: filterSource sees the store path of an unfiltered copy423container-test-run-iets-classic-e2e> machine # [1682621.285504] machine nix-daemon[5314]: accepted connection from pid 10182, user alice (trusted)424container-test-run-iets-classic-e2e> ok   symlink: path keeps the references of a store path425container-test-run-iets-classic-e2e> machine # [1682622.403314] machine nix-daemon[5314]: accepted connection from pid 10211, user alice (trusted)426container-test-run-iets-classic-e2e> machine # [1682622.440716] machine nix-daemon[5314]: accepted connection from pid 10231, user alice (trusted)427container-test-run-iets-classic-e2e> ok   symlink: path flat refuses a store path with references428container-test-run-iets-classic-e2e> ok   nix eval -f FILE ATTR429container-test-run-iets-classic-e2e> machine # [1682622.927321] machine nix-daemon[5314]: accepted connection from pid 10260, user alice (trusted)430container-test-run-iets-classic-e2e> machine # [1682622.964823] machine nix-daemon[5314]: accepted connection from pid 10280, user alice (trusted)431container-test-run-iets-classic-e2e> ok   nix eval --json -f FILE ATTR432container-test-run-iets-classic-e2e> ok   auto-call a function file, defaults: nix-instantiate433container-test-run-iets-classic-e2e> ok   auto-call a function file, defaults: iets eval434container-test-run-iets-classic-e2e> ok   auto-call a '...' function file, defaults: nix-instantiate435container-test-run-iets-classic-e2e> ok   auto-call a '...' function file, defaults: iets eval436container-test-run-iets-classic-e2e> ok   auto-call a function file, --arg: nix-instantiate437container-test-run-iets-classic-e2e> ok   auto-call a function file, --arg: iets eval438container-test-run-iets-classic-e2e> ok   auto-call a '...' function file, --arg: nix-instantiate439container-test-run-iets-classic-e2e> ok   auto-call a '...' function file, --arg: iets eval440container-test-run-iets-classic-e2e> ok   auto-call a function file, --argstr: nix-instantiate441container-test-run-iets-classic-e2e> ok   auto-call a function file, --argstr: iets eval442container-test-run-iets-classic-e2e> ok   auto-call a '...' function file, --argstr: nix-instantiate443container-test-run-iets-classic-e2e> ok   auto-call a '...' function file, --argstr: iets eval444container-test-run-iets-classic-e2e> ok   a required --arg that is missing: the same first error line everywhere445container-test-run-iets-classic-e2e> ok   nix search, every package446container-test-run-iets-classic-e2e> ok   nix search --json447container-test-run-iets-classic-e2e> ok   nix search --json --pretty448container-test-run-iets-classic-e2e> ok   nix search, two regexes are ANDed449container-test-run-iets-classic-e2e> ok   nix search --exclude450container-test-run-iets-classic-e2e> ok   nix search is case insensitive451container-test-run-iets-classic-e2e> ok   nix search, a bracket expression452container-test-run-iets-classic-e2e> ok   nix search, an alternation453container-test-run-iets-classic-e2e> ok   nix search, no results454container-test-run-iets-classic-e2e> ok   nix search --json, no results455container-test-run-iets-classic-e2e> machine # [1682649.688629] machine nix-daemon[5314]: accepted connection from pid 10972, user alice (trusted)