iets-test-0.1.0
checks.x86_64-linux.test
· build #25
· raw
unpackPhase
1unpacking source archive /nix/store/5allhzl6a6bn809f714c4bin1p28z8w7-source2source root is source3Executing cargoSetupPostUnpackHook4Finished cargoSetupPostUnpackHookpatchPhase
5Executing cargoSetupPostPatchHook6Validating consistency between /build/source/Cargo.lock and /build/cargo-vendor-dir/Cargo.lock7Finished cargoSetupPostPatchHookbuildPhase
8 Compiling libc v0.2.1899 Compiling proc-macro2 v1.0.10710 Compiling quote v1.0.4711 Compiling unicode-ident v1.0.2412 Compiling cfg-if v1.0.413 Compiling shlex v2.0.114 Compiling find-msvc-tools v0.1.1215 Compiling bytes v1.12.116 Compiling fnv v1.0.717 Compiling version_check v0.9.518 Compiling regex-syntax v0.8.1119 Compiling hashbrown v0.17.120 Compiling pin-project-lite v0.2.1721 Compiling equivalent v1.0.222 Compiling memchr v2.8.323 Compiling anyhow v1.0.10424 Compiling typenum v1.20.125 Compiling either v1.18.026 Compiling futures-core v0.3.3427 Compiling once_cell v1.21.428 Compiling semver v1.0.2829 Compiling itoa v1.0.1830 Compiling zeroize v1.9.031 Compiling slab v0.4.1232 Compiling futures-sink v0.3.3433 Compiling log v0.4.3434 Compiling bitflags v2.13.235 Compiling pulldown-cmark v0.13.436 Compiling prettyplease v0.2.3737 Compiling rustix v1.1.538 Compiling getrandom v0.4.339 Compiling httparse v1.10.140 Compiling lazy_static v1.5.041 Compiling beef v0.5.242 Compiling atomic-waker v1.1.243 Compiling pkg-config v0.3.3444 Compiling try-lock v0.2.545 Compiling foldhash v0.1.546 Compiling unicode-width v0.1.1447 Compiling futures-task v0.3.3448 Compiling untrusted v0.9.049 Compiling unicase v2.9.050 Compiling thiserror v2.0.2051 Compiling linux-raw-sys v0.12.152 Compiling serde_core v1.0.22953 Compiling httpdate v1.0.354 Compiling rustls v0.23.4555 Compiling fixedbitset v0.5.756 Compiling smallvec v1.16.157 Compiling tower-service v0.3.358 Compiling cpufeatures v0.2.1759 Compiling want v0.3.160 Compiling fastrand v2.5.061 Compiling futures-channel v0.3.3462 Compiling tracing-core v0.1.3663 Compiling rustls-pki-types v1.15.164 Compiling multimap v0.10.165 Compiling heck v0.5.066 Compiling rustc_version v0.4.167 Compiling futures-util v0.3.3468 Compiling subtle v2.6.169 Compiling zstd-safe v7.3.070 Compiling sync_wrapper v1.0.271 Compiling zmij v1.0.2372 Compiling tower-layer v0.3.373 Compiling itertools v0.14.074 Compiling const-oid v0.10.275 Compiling cpufeatures v0.3.176 Compiling crc32fast v1.5.277 Compiling simd-adler32 v0.3.1078 Compiling adler2 v2.0.179 Compiling base64 v0.22.180 Compiling hashbrown v0.15.581 Compiling serde_json v1.0.15182 Compiling percent-encoding v2.3.283 Compiling cty v0.2.284 Compiling winnow v1.0.485 Compiling toml_writer v1.1.2+spec-1.1.086 Compiling arrayvec v0.7.887 Compiling openssl-probe v0.2.188 Compiling constant_time_eq v0.4.289 Compiling libbz2-rs-sys v0.2.590 Compiling lz4_flex v0.11.691 Compiling logos-codegen v0.15.192 Compiling rustls-native-certs v0.8.493 Compiling webpki-roots v1.0.994 Compiling miniz_oxide v0.9.195 Compiling http v1.5.096 Compiling generic-array v0.14.797 Compiling aho-corasick v1.1.598 Compiling toml_parser v1.1.3+spec-1.1.099 Compiling indexmap v2.14.2100 Compiling bzip2 v0.6.1101 Compiling hybrid-array v0.4.15102 Compiling flate2 v1.1.10103 Compiling syn v2.0.119104 Compiling syn v3.0.5105 Compiling jobserver v0.1.35106 Compiling mio v1.2.3107 Compiling socket2 v0.6.5108 Compiling getrandom v0.2.17109 Compiling filetime v0.2.29110 Compiling crypto-common v0.1.7111 Compiling block-buffer v0.10.4112 Compiling tar v0.4.46113 Compiling digest v0.10.7114 Compiling crypto-common v0.2.2115 Compiling block-buffer v0.12.1116 Compiling petgraph v0.8.3117 Compiling cc v1.4.5118 Compiling sha2 v0.10.9119 Compiling pulldown-cmark-to-cmark v22.0.1120 Compiling http-body v1.1.0121 Compiling http-body-util v0.1.5122 Compiling md-5 v0.10.6123 Compiling sha1 v0.10.7124 Compiling tempfile v3.27.0125 Compiling regex-automata v0.4.18126 Compiling digest v0.11.3127 Compiling sha2 v0.11.0128 Compiling ring v0.17.14129 Compiling zstd-sys v2.1.0+zstd.1.5.7130 Compiling libmimalloc-sys v0.1.49131 Compiling blake3 v1.8.7132 Compiling serde_spanned v1.1.1133 Compiling toml_datetime v1.1.1+spec-1.1.0134 Compiling toml v1.1.6+spec-1.1.0135 Compiling lzma-rust2 v0.16.5136 Compiling tokio-macros v2.7.2137 Compiling thiserror-impl v2.0.20138 Compiling async-trait v0.1.92139 Compiling mimalloc v0.1.52140 Compiling tokio v1.53.1141 Compiling prost-derive v0.14.4142 Compiling tracing-attributes v0.1.31143 Compiling miette-derive v7.6.0144 Compiling pin-project-internal v1.1.13145 Compiling tonic-build v0.14.6146 Compiling rustls-webpki v0.103.15147 Compiling logos-derive v0.15.1148 Compiling logos-codegen v0.16.1149 Compiling regex v1.13.1150 Compiling zstd v0.13.3151 Compiling pin-project v1.1.13152 Compiling miette v7.6.0153 Compiling tracing v0.1.44154 Compiling logos v0.15.1155 Compiling prost v0.14.4156 Compiling logos-derive v0.16.1157 Compiling prost-types v0.14.4158 Compiling logos v0.16.1159 Compiling protox-parse v0.9.0160 Compiling prost-reflect v0.16.5161 Compiling prost-build v0.14.4162 Compiling tonic-prost-build v0.14.6163 Compiling tokio-util v0.7.19164 Compiling tokio-stream v0.1.19165 Compiling h2 v0.4.19166 Compiling tower v0.5.3167 Compiling tokio-rustls v0.26.5168 Compiling protox v0.9.1169 Compiling iets v0.1.0 (/build/source)170 Compiling hyper v1.11.1171 Compiling hyper-util v0.1.20172 Compiling hyper-timeout v0.5.2173 Compiling tonic v0.14.6174 Compiling tonic-prost v0.14.6175 Finished `test` profile [unoptimized + debuginfo] target(s) in 1m 20s176 Running unittests src/lib.rs (target/debug/deps/iets-08e813ea55a8333b)177178running 454 tests179test api::installable::tests::default_and_fragment_attr_paths ... ok180test api::installable::tests::the_name_a_program_takes_from_a_derivation_name ... ok181test api::drvshow::tests::pretty_matches_serde_json ... ok182test api::drvshow::tests::floats_take_nlohmanns_form ... ok183test api::drvshow::tests::a_fixed_output_shows_its_content_address_and_no_path ... ok184test api::drvshow::tests::a_multi_output_derivation ... ok185test api::drvshow::tests::a_non_canonical_structured_attrs_text_is_renormalised ... ok186test api::drvshow::tests::inputs_and_structured_attrs ... ok187test build::event::tests::durations ... ok188test build::backend::tests::base_names_drop_the_store_dir ... ok189test build::backend::tests::the_timings_report_with_every_line ... ok190test build::executor::tests::no_place_at_all_is_a_usage_error ... ok191test argv::tests::every_byte_round_trips ... ok192test build::executor::tests::an_unsupported_url_says_what_is_expected ... ok193test build::executor::tests::one_place_declaring_nothing_takes_everything ... ok194test build::executor::tests::a_declared_system_filters ... ok195test build::executor::tests::the_first_place_that_takes_it_wins ... ok196test build::executor::tests::a_feature_the_place_lacks_rules_it_out ... ok197test build::executor::tests::a_refusal_names_every_place_and_what_it_declared ... ok198test build::backend::tests::output_specs ... ok199test build::fixhash::tests::a_longer_hash_is_not_a_match ... ok200test build::render::tests::drv_paths_of_a_failure_message ... ok201test builtins::derivation::tests::the_two_placeholders_are_not_the_same ... ok202test build::tests::targets_become_jobs ... ok203test build::fixhash::tests::two_matches_are_left_alone ... ok204test builtins::text::regex::tests::regex_bench ... ignored205test builtins::derivation::tests::a_dynamic_output_renders_the_placeholder_nix_renders ... ok206test builtins::store_hooks::tests::a_relative_path_inside_an_entry_joins_once ... ok207test cachefs::tests::a_wipe_keeps_what_iets_did_not_create ... ok208test builtins::text::fromtoml::tests::new_escapes_are_refused ... ok209test builtins::text::regex::tests::names ... ok210test cachefs::tests::a_sweep_runs_once_per_interval ... ok211test build::tests::hash_stripping ... ok212test api::fetch::tests::only_a_fixed_output_drv_can_be_prefetched ... ok213test builtins::text::fromtoml::tests::inline_tables_stay_on_one_line ... ok214test cachefs::tests::a_wipe_of_the_ir_cache_walks_its_shards ... ok215test api::fetch::tests::the_fake_hash_moves_the_output_and_the_drv ... ok216test cachefs::tests::a_store_without_a_version_file_is_wiped_once ... ok217test cachefs::tests::an_empty_directory_is_ours_to_take ... ok218test cachefs::tests::a_directory_that_is_not_ours_is_refused_untouched ... ok219test cachefs::tests::a_stamp_in_the_future_is_due ... ok220test cachefs::tests::a_touch_inside_the_interval_writes_nothing ... ok221test cachefs::tests::garbled_stamp_wipes_the_store ... ok222test cachefs::tests::a_lock_that_cannot_be_opened_is_not_a_busy_lock ... ok223test build::fanout::tests::dependencies_run_first ... ok224test cli::build::tests::no_outcome_at_all_is_named ... ok225test cli::build::tests::a_success_with_no_output_path_is_named ... ok226test cli::build::tests::an_out_flag_that_matches_nothing_is_named ... ok227test cli::build::tests::a_failed_build_reports_itself ... ok228test cachefs::tests::a_wait_lock_waits_for_its_holder ... ok229test build::fanout::tests::at_most_limit_builds_run_at_once ... ok230test cli::classic::shell::tests::sh_var_names ... ok231test cachefs::tests::sweep_drops_old_entries_and_keeps_young_ones ... ok232test cli::build::tests::no_build_result_is_named ... ok233test cachefs::tests::version_mismatch_wipes_the_store ... ok234test cli::classic::shell::tests::outputs_become_placeholders ... ok235test build::fanout::tests::a_failed_dependency_blocks_its_dependants ... ok236test build::render::tests::an_unfolded_success_ends_with_its_verdict ... ok237test build::render::tests::a_stalled_build_that_fails_still_shows_its_cause ... ok238test build::render::tests::an_owned_build_is_verdicted_once_by_its_op ... ok239test build::render::tests::ci_folds_a_success_and_never_a_failure ... ok240test build::render::tests::a_failure_after_the_activity_ended_never_claims_a_success ... ok241test build::render::tests::logs_of_two_builds_do_not_interleave ... ok242test build::render::tests::tty_keeps_successful_logs_off_the_screen ... ok243test cachefs::tests::sweep_walks_the_shards_of_the_ir_cache ... ok244test cachefs::tests::an_input_store_of_the_spool_layout_is_wiped ... ok245test build::render::tests::a_daemon_failure_message_decides_the_verdict ... ok246test cli::plumbing::tests::a_url_is_the_positional_fetch_takes_itself ... ok247test cli::diff::tests::a_name_ends_at_the_first_dash_before_a_digit ... ok248test cli::render::tests::sizes_render_as_nix_renders_them ... ok249test cli::docs::tests::topics_resolve_bare_and_qualified ... ok250test builtins::text::regex::tests::size_limit ... ok251test cli::search::tests::drv_names ... ok252test cli::search::tests::index_round_trip ... ok253test cli::plumbing::tests::a_file_url_needs_one_slash_not_three ... ok254test cachefs::tests::sweep_ages_a_root_by_its_link_not_by_what_it_names ... ok255test cli::classic::shell::tests::declares_for_every_bash_shaped_value ... ok256test cli::build::tests::a_path_on_stdout_is_silent ... ok257test build::render::tests::heartbeat_names_running_builds ... ok258test api::value::tests::lists ... ok259test api::value::tests::attrs_by_name_and_index ... ok260test cli::search::tests::merged_highlights ... ok261test cli::help::tests::messages ... ok262test config::tests::syntax_errors ... ok263test config::tests::max_jobs_auto_is_the_cpu_count ... ok264test config::tests::missing_include_errors_and_bang_include_does_not ... ok265test api::value::tests::apply_is_lazy ... ok266test api::value::tests::thunk_reads_as_thunk ... ok267test cli::render::text::tests::a_long_value_shows_the_lines_that_differ ... ok268test cli::classic::tests::a_flag_with_no_effect_is_noted_and_one_that_holds_is_not ... ok269test build::render::tests::a_build_log_never_reports_a_mismatch ... ok270test config::tests::bool_spellings ... ok271test api::value::tests::force_deep_forces_the_whole_tree ... ok272test api::value::tests::construction ... ok273test api::value::tests::wrong_type_is_an_error ... ok274test config::tests::user_conf_files_are_in_precedence_order ... ok275test devenv::tests::env_derivation_matches_nix ... ignored, needs the devShell input .drv closure in /nix/store276test config::tests::include_chain ... ok277test cli::help::tests::help_fits_80_columns ... ok278test api::run::tests::a_fiber_template_carries_the_configuration ... ok279test config::tests::typed_getters_and_defaults ... ok280test config::tests::a_classic_name_leaves_an_unimplemented_setting_to_nix ... ok281test cli::help::tests::a_mistyped_command_is_suggested ... ok282test cachefs::tests::the_writer_lock_excludes_one_holder_at_a_time ... ok283test config::tests::an_alias_is_its_setting ... ok284test config::tests::bad_typed_values_error_where_they_are_set ... ok285test config::tests::overrides_win_over_files ... ok286test config::tests::basic_syntax ... ok287test config::tests::a_setting_with_no_effect_is_noted ... ok288test config::tests::the_setting_tables_name_nix_settings ... ok289test cli::help::tests::suggestions_come_from_the_help ... ok290test devenv::tests::shell_escaping ... ok291test config::tests::unknown_settings_are_kept ... ok292test devenv::tests::get_env_sh_store_path_matches_nix ... ok293test devenv::tests::non_bash_builder_is_refused ... ok294test devenv::tests::rewrites_apply_in_map_order_to_every_occurrence ... ok295test cli::docs::tests::every_embedded_page_has_a_heading ... ok296test config::tests::the_daemon_gets_the_store_settings_set_outside_the_system_file ... ok297test devenv::tests::cached_result_roundtrip ... ok298test api::value::tests::calling_a_function ... ok299test config::tests::option_nix_path_replaces_nix_path_and_extra_adds ... ok300test devenv::tests::output_checks_are_erased_only_when_present ... ok301test config::tests::extra_appends_to_list_settings_only ... ok302test api::value::tests::missing_attribute ... ok303test fetch::http::tests::file_urls_name_a_local_path ... ok304test fetch::http::tests::magic_bytes ... ok305test cli::docs::tests::the_topic_list_fits_80_columns ... ok306test builtins::store_hooks::tests::virtual_tree_reads_go_to_the_local_files ... ok307test build::tests::a_fan_out_backend_keeps_the_cap_and_the_log_blocks ... ok308test build::tests::a_target_with_no_verdict_fails ... ok309test fetch::http::tests::redirects_keep_credentials_only_on_the_same_origin ... ok310test fetch::http::tests::urls_split ... ok311test devenv::tests::rc_script_rewrites_outputs_and_writes_attrs ... ok312test fetch::roots::tests::no_bundle_anywhere_gives_the_compiled_in_set ... ok313test devenv::tests::json_roundtrip_and_bash_forms ... ok314test fetch::http::tests::redirects_resolve ... ok315test fetch::roots::tests::a_named_file_that_is_missing_or_empty_is_an_error ... ok316test build::fixhash::tests::one_match_is_rewritten_in_its_own_spelling ... ok317test fetch::spool::tests::the_scratch_file_never_follows_a_symlink ... ok318test eval::tests::derivation_wrapper_exists ... ok319test api::value::tests::strings_and_context ... ok320test fetch::spool::tests::a_sparse_member_counts_against_the_size_limit ... ok321test fetch::http::tests::trailing_bytes_and_a_second_layer ... ok322test fetch::spool::tests::an_empty_archive_is_an_empty_directory ... ok323test compile::cache::tests::nesting_past_the_cap_misses ... ok324test fetch::unpack::tests::an_unsupported_member_type_is_an_error ... ok325test fetch::unpack::tests::member_names_are_made_relative_and_cannot_escape ... ok326test fetch::unpack::tests::keeps_the_root_when_it_is_not_a_single_directory ... ok327test fetch::spool::tests::the_errors_match ... ok328test fetch::http::tests::downloads_stop_at_the_size_limit ... ok329test compile::cache::tests::a_malformed_entry_is_a_miss_and_never_a_crash ... ok330test fetch::spool::tests::nar_hash_of_the_fixture ... ok331test compile::cache::tests::a_changed_byte_of_a_stored_entry_is_a_miss ... ok332test eval::tests::a_second_pseudo_file_keeps_its_own_positions ... ok333test fetch::spool::tests::spool_matches_the_tree_on_the_top_level ... ok334test fetch::spool::tests::archives_the_git_sink_accepts ... ok335test fetch::roots::tests::the_platform_store_wins_over_the_compiled_in_set ... ok336test fetch::roots::tests::an_empty_nix_ssl_cert_file_hides_ssl_cert_file ... ok337test fetch::roots::tests::nix_ssl_cert_file_wins_over_ssl_cert_file_and_the_platform ... ok338test fetch::spool::tests::a_changed_index_byte_is_a_miss ... ok339test eval::tests::an_invalid_regex_fails_before_the_string_is_forced ... ok340test fetch::unpack::tests::nar_hash_of_the_fixture ... ok341test eval::tests::sets_compare_in_the_symbol_order_of_nix ... ok342test fetch::unpack::tests::modes_symlinks_and_empty_dirs ... ok343test fetch::spool::tests::pax_sparse_members_are_expanded ... ok344test builtins::text::regex::tests::long_inputs_do_not_recurse ... ok345test flake::tests::attr_paths ... ok346test fetch::spool::tests::a_stored_tree_dumps_the_spools_nar ... ok347test jobs::constituents::tests::fnmatch_basics ... ok348test fetch::unpack::tests::strips_one_leading_component ... ok349test fetch::unpack::tests::a_repeated_member_keeps_the_last_copy ... ok350test flake::flakeref::tests::errors_and_unsupported ... ok351test lint::allow::tests::lines ... ok352test lint::allow::tests::comment_names ... ok353test fetch::spool::tests::spool_matches_the_tree ... ok354test flake::flakeref::tests::to_string_from_attrs ... ok355test flake::tests::refs_resolve_against_cwd_and_home ... ok356test jobs::constituents::tests::topo_sort_orders_and_detects_cycles ... ok357test flake::flakeref::tests::round_trips ... ok358test flake::fetch::tests::nix_sees_no_mark ... ok359test lint::tests::keys ... ok360test eval::tests::derivation_keeps_env_and_args_that_are_not_utf8 ... ok361test log::tests::a_coloured_error_is_an_error_record ... ok362test log::tests::a_forged_mismatch_is_dropped ... ok363test flake::flakeref::tests::parses_the_kept_schemes ... ok364test lint::tests::selectors_and_order ... ok365test lint::tests::the_project_file_walk_stops_at_the_project_root ... ok366test lint::site::tests::a_literal_lint_of_nix_has_an_edit ... ok367test lint::tests::names_are_unique_kebab_case ... ok368test log::tests::a_hash_mismatch_names_the_hash_it_got ... ok369test flake::fetch::tests::an_entry_of_the_compiled_file_cache_keeps_the_site ... ok370test log::tests::a_fixed_hash_has_the_shape_of_a_finding_with_an_edit ... ok371test log::tests::a_mismatch_reason_keeps_both_hashes ... ok372test log::tests::ansi_stripping ... ok373test eval::tests::update_forces_the_right_operand_first ... ok374test log::tests::record_is_nix_log_ei_plus_code_and_hint ... ok375test log::tests::a_session_id_is_a_uuid_v7 ... ok376test log::tests::activity_records_are_nix_json_logger_records ... ok377test log::tests::escapes_are_filtered_the_way_nix_filters_them ... ok378test log::tests::exit_status_flags_combine_like_nix ... ok379test log::tests::lint_warning_is_a_level_1_record ... ok380test fetch::spool::tests::a_hard_link_never_replaces_a_member ... ok381test jobs::line::tests::error_line_round_trip ... ok382test log::tests::a_resolved_copy_reports_its_mismatch_as_a_line ... ok383test jobs::line::tests::split_and_round_trip ... ok384test log::tests::record_without_position ... ok385test nixbin::tests::every_iets_build_is_skipped ... ok386test fetch::http::tests::credentials_stay_on_the_first_origin ... ok387test parallel::deque::tests::lifo_owner_fifo_thief ... ok388test parallel::fiber::tests::resume_yield_finish ... ok389test parallel::sched::tests::a_task_survives_packing_past_the_old_24_bit_start ... ok390test parallel::fiber::tests::reservation_is_capped_and_mmap_failure_is_an_error ... ok391test lint::tests::scope_and_inputs ... ok392test parallel::interner::tests::intern_is_stable_and_shared ... ok393test lint::tests::an_unknown_name_is_a_warning_in_a_file_and_an_error_in_a_flag ... ok394test lint::tests::toml_table ... ok395test flake::fetch::tests::the_mark_follows_the_string_like_store_context ... ok396test lint::tests::specificity_inside_a_source_and_order_between_sources ... ok397test profile::tests::an_unwind_returns_to_a_depth ... ok398test parallel::interner::tests::empty_name_misses_the_cache_sentinel ... ok399test profile::tests::a_frame_keeps_its_call_site_and_its_name ... ok400test profile::tests::a_sample_is_taken_once_per_tick ... ok401test print::tests::float_formatting_edge_cases ... ok402test eval::tests::arithmetic_and_strings ... ok403test eval::tests::try_eval_and_errors ... ok404test profile::tests::a_weight_is_bytes_when_the_profile_asks_for_them ... ok405test fetch::http::tests::credentials_in_the_url_are_sent_and_never_printed ... ok406test project::tests::a_config_file_never_shrinks_the_root ... ok407test compile::cache::tests::a_changed_byte_never_makes_the_evaluator_read_past_its_env ... ok408test nixbin::tests::farm_marker_is_found_through_two_hops ... ok409test progress::tests::store_hashes_are_left_out ... ok410test project::tests::a_working_tree_wins_over_a_file_marker_below_it ... ok411test parallel::fiber::tests::migrates_between_threads ... ok412test lint::site::tests::the_span_is_the_innermost_node_of_the_kind_of_the_lint ... ok413test progress::tests::several_of_a_kind_are_counted ... ok414test progress::tests::a_download_inside_a_copy_is_part_of_the_copy ... ok415test provenance::tests::a_path_followed_by_a_colour_escape_still_matches ... ok416test provenance::tests::locate_takes_the_longest_prefix ... ok417test provenance::tests::locate_without_a_match_is_none ... ok418test provenance::tests::rewrite_leaves_unknown_text_alone ... ok419test parallel::deque::tests::concurrent_sum ... ok420test eval::tests::nix_eq_forces_what_the_shortcut_skips ... ok421test remote::grpc::build::tests::topo_sort_puts_references_first ... ok422test eval::tests::equality ... ok423test remote::grpc::build::tests::reschedules_back_off_past_a_dead_worker ... ok424test parallel::sched::tests::main_parks_and_is_woken_by_helper ... ok425test progress::tests::a_transfer_that_does_not_move_says_so ... ok426test remote::grpc::build::tests::the_timings_report_with_every_line ... ok427test remote::grpc::build::tests::required_features_come_from_the_env_or_structured_attrs ... ok428test parallel::sched::tests::park_and_wake_across_workers ... ok429test eval::tests::laziness_and_recursion ... ok430test provenance::tests::rewrite_replaces_every_known_path_in_a_line ... ok431test remote::grpc::build::tests::a_self_reference_does_not_loop ... ok432test remote::grpc::build::tests::a_local_upload_failure_beats_the_stream_ended_status ... ok433test progress::tests::a_log_hears_of_a_task_after_first_and_then_every_heartbeat ... ok434test provenance::tests::a_tree_copied_from_a_store_tree_resolves_to_the_local_one ... ok435test provenance::tests::failed_line_names_the_attribute_and_the_position ... ok436test project::tests::the_nearest_flake_wins_without_a_working_tree ... ok437test remote::grpc::tests::a_token_needs_tls_and_unknown_parameters_are_errors ... ok438test remote::grpc::drvwire::tests::an_unresolvable_input_output_is_an_error ... ok439test remote::grpc::tests::percent_escapes_decode_in_values ... ok440test remote::grpc::health::tests::an_unknown_address_is_usable ... ok441test remote::grpc::health::tests::a_passed_cooldown_lets_one_caller_through ... ok442test remote::grpc::health::tests::one_address_does_not_refuse_another ... ok443test remote::grpc::health::tests::a_completed_build_clears_the_history ... ok444test remote::grpc::health::tests::one_bounce_does_not_refuse_an_address ... ok445test remote::grpc::health::tests::the_cooldown_grows_and_stops_at_30s ... ok446test remote::grpc::health::tests::two_bounces_refuse_it ... ok447test remote::worker::tests::a_status_over_a_byte_is_not_a_success ... ok448test jobs::tests::a_numeric_name_selects_an_attribute_under_a_set ... ok449test remote::grpc::drvwire::tests::path_info_round_trips ... ok450test remote::grpc::drvwire::tests::build_result_round_trips_a_daemon_reply ... ok451test parallel::fiber::tests::large_stack_use_and_release ... ok452test remote::plan::tests::hash_source_matches_nar_hash ... ok453test remote::grpc::drvwire::tests::a_failure_keeps_its_message ... ok454test remote::grpc::tests::every_parameter_parses ... ok455test remote::grpc::tests::insecure_is_a_bare_flag_or_a_boolean ... ok456test remote::grpc::tests::mtls_needs_both_halves ... ok457test api::value::tests::scalars ... ok458test remote::grpc::tests::defaults_match_the_cxx_settings ... ok459test project::tests::each_marker_is_a_root ... ok460test runtime::value::layout::a_primop_pays_nothing_for_its_symbol ... ok461test remote::worker::wire::tests::strings_are_padded ... ok462test remote::worker::tests::nix_sshopts_split_like_a_shell ... ok463test runtime::value::alloc_tests::a_list_too_long_to_address_has_no_size ... ok464test remote::worker::tests::an_ssh_host_is_never_an_option ... ok465test remote::plan::tests::memory_source_matches_dump_string ... ok466test fetch::http::tests::a_transient_status_is_retried ... ok467test settings::tests::a_settings_file_may_hold_lint_and_the_other_sources_may_not ... ok468test remote::worker::tests::transport_from_url ... ok469test remote::worker::wire::tests::framed_sink_frames_and_terminates ... ok470test parallel::thunk::tests::deadlocked_fibers_are_cancelled ... ok471test settings::tests::a_flag_carries_several_places_separated_by_a_semicolon ... ok472test session::tests::two_sessions_share_no_state ... ok473test remote::worker::tests::ssh_argv_puts_the_host_first ... ok474test settings::tests::a_missing_file_is_skipped_and_the_defaults_hold ... ok475test remote::grpc::drvwire::tests::basic_derivation_matches_the_cxx_field_order ... ok476test remote::worker::wire::tests::replies_are_read_as_nix_reads_them ... ok477test remote::worker::wire::tests::build_results_are_read_as_nix_reads_them ... ok478test parallel::interner::tests::concurrent_intern_agrees ... ok479test runtime::value::alloc_tests::a_speculated_thunk_is_forced_but_not_demanded ... ok480test settings::tests::the_file_is_the_users ... ok481test settings::tests::the_flag_leaves_the_argv ... ok482test fetch::http::tests::a_stalled_download_fails ... ok483test settings::tests::unknown_key_names_the_file ... ok484test settings::tests::the_user_file_turns_purity_off ... ok485test runtime::value::tests::union_lookup_agrees_with_iteration ... ok486test settings::tests::builder_reads_all_three_forms ... ok487test source::remote::tests::nix_literal_escapes ... ok488test settings::tests::a_project_file_holds_lint_and_nothing_else ... ok489test settings::tests::the_flag_pairs_are_kept_for_a_second_iets ... ok490test settings::tests::each_source_wins_over_the_one_before ... ok491test settings::tests::source_map_adds_up_and_every_other_key_replaces ... ok492test source::local::tests::only_a_content_addressed_store_path_names_its_content ... ok493test settings::tests::the_flag_value_is_toml_when_it_reads_as_toml ... ok494test settings::tests::the_environment_wins_over_the_file ... ok495test source::local::tests::accepted_set_adds_parent_directories ... ok496test source::lock::tests::complete_lock_passes ... ok497test source::local::tests::max_mtime_covers_root_and_children ... ok498test source::remote::tests::substitution_costs_less_than_the_subprocess ... ignored499test source::remote::tests::access_tokens_match_the_longest_prefix ... ok500test settings::tests::a_wrong_type_names_the_key_and_the_file ... ok501test store::drv::tests::fixtures_output_paths_recompute_from_store ... ignored, needs the input .drv closures in /nix/store502test store::drv::tests::string_escapes_roundtrip ... ok503test store::drv::tests::masked_unparse_blanks_output_paths_and_env ... ok504test source::remote::tests::download_urls_match_the_fetchers ... ok505test source::scm::git::tests::a_directory_in_a_repository_is_found ... ok506test source::tests::dates ... ok507test store::drv::tests::an_env_key_named_json_is_refused ... ok508test store::drv::tests::fixed_output_from_scratch ... ok509test eval::tests::printing ... ok510test store::drv::tests::input_addressed_multi_output_from_scratch ... ok511test source::remote::tests::only_the_archive_types_are_fetched_by_iets ... ok512test store::drv::tests::input_drvs_hash_modulo_from_scratch ... ok513test parallel::sched::tests::fan_out_from_main ... ok514test source::scm::ledger::tests::a_directory_in_a_working_tree_is_found ... ok515test store::drvdiff::tests::the_same_derivation_is_empty ... ok516test store::hash::tests::base64_roundtrip ... ok517test store::drv::tests::a_dynamic_input_writes_the_versioned_aterm_and_parses_back ... ok518test store::drvdiff::tests::an_input_source_an_added_input_drv_and_a_fixed_output_show_up ... ok519test store::drvdiff::tests::json_names_what_differs ... ok520test store::drvdiff::tests::the_depth_limit_names_the_input_without_walking_it ... ok521test store::drvdiff::tests::a_changed_input_drv_is_paired_by_name_and_recursed_into ... ok522test eval::tests::from_json_and_toml_reject_null_bytes ... ok523test store::drvdiff::tests::env_name_shows_only_when_it_is_not_the_derivation_name ... ok524test source::lock::tests::incomplete_locks_fail ... ok525test store::drvdiff::tests::the_local_fields_the_env_and_an_absent_value ... ok526test profile::tests::a_deep_stack_is_capped ... ok527test store::hash::tests::compress_hash_xors ... ok528test store::hash::tests::empty_sha256 ... ok529test store::hash::tests::streaming_matches_oneshot ... ok530test store::hash::tests::sha256_nix32 ... ok531test store::hash::tests::parse_any_all_formats ... ok532test store::hash::tests::sha256_sri ... ok533test store::path::tests::output_names ... ok534test store::hash::tests::nix32_roundtrip_and_reject ... ok535test store::nar::tests::directory_nar ... ok536test store::path::tests::parse_and_accessors ... ok537test store::path::tests::fixed_flat_sha256 ... ok538test store::path::tests::fixed_recursive_sha256 ... ok539test store::path::tests::fixed_flat_sha1 ... ok540test store::path::tests::a_multibyte_char_across_the_hash_part_is_an_error ... ok541test store::nar::tests::executable_file_nar ... ok542test store::path::tests::path_copy_directory ... ok543test store::path::tests::path_with_name ... ok544test store::nar::tests::directory_nar_hash_formats ... ok545test store::nar::tests::filter_sees_types_and_paths ... ok546test store::path::tests::placeholder ... ok547test store::nar::tests::symlink_nar ... ok548test store::path::tests::to_file_with_reference ... ok549test store::path::tests::to_file ... ok550test store::hash::tests::md5_nix32 ... ok551test store::path::tests::check_name_rules ... ok552test store::nar::tests::restore_rejects_garbage ... ok553test store::nar::tests::readers_refuse_what_nix_refuses ... ok554test store::nar::tests::regular_file_nar ... ok555test syntax::tests::differential_strings_against_nix ... ignored, needs nix on PATH and takes a few seconds556test store::path::tests::path_copy_file ... ok557test source::scm::ledger::tests::the_metadata_has_the_mark_of_its_tree ... ok558test trace::key::tests::key_is_order_and_value_sensitive ... ok559test store::hash::tests::sha1_nix32 ... ok560test eval::tests::attrs_and_lists ... ok561test syntax::tests::line_col_counts_bytes ... ok562test store::path::tests::filter_source ... ok563test eval::tests::reading_a_derivation_output_is_unsupported ... ok564test syntax::tests::a_line_ends_at_cr_lf_and_lone_cr ... ok565test store::nar::tests::restore_roundtrip ... ok566test store::hash::tests::sha512_nix32_base64 ... ok567test syntax::tests::spans_cover_tokens ... ok568test flake::fetch::tests::the_first_read_of_a_tree_gives_its_finding ... ok569test trace::store::tests::bytes_that_are_not_an_entry_are_bad_not_a_panic ... ok570test trace::store::tests::a_reader_of_one_generation_never_sees_the_next ... ok571test trace::store::tests::one_rename_publishes_every_part ... ok572test syntax::tests::end_of_file_inside_a_path_is_at_its_last_token ... ok573test syntax::tests::the_error_reported_is_the_one_nix_meets_first ... ok574test trace::tests::fingerprint_changes_with_content_size_and_seen_entries ... ok575test trace::validate::dir_hash_tests::dir_hash_agrees_with_dir_listing_hash ... ok576test fetch::http::tests::a_decompression_bomb_is_refused ... ok577test trace::tests::dedupe_keeps_conflicting_values ... ok578test store::drv::tests::fixtures_output_paths_recompute ... ok579test trace::tests::dump_fingerprint_matches_the_separate_walk ... ok580test trace::watch::tests::only_the_paths_an_mtime_can_speak_for ... ok581test store::drv::tests::fixtures_drv_path_matches_store_path ... ok582test source::scm::ledger::tests::the_tracked_files_and_the_metadata_are_the_tree ... ok583test flake::fetch::tests::the_tree_decides_the_level ... ok584test trace::key::tests::relative_path_detection ... ok585test store::drv::tests::fixtures_roundtrip_byte_exact ... ok586test source::scm::ledger::tests::an_untracked_file_is_the_error_of_nix ... ok587test syntax::tests::an_interpolated_name_is_static_when_nix_has_one_string_node ... ok588test syntax::tests::allow_comments ... ok589test treestore::tests::a_tree_is_named_by_its_nar_hash ... ok590test trace::validate::tests::a_copy_in_place_that_keeps_the_stat_still_misses ... ok591test trace::wire::tests::readset_roundtrip ... ok592test treestore::tests::a_staged_directory_goes_when_it_is_dropped ... ok593test treestore::pack::tests::a_set_finds_objects_across_packs_and_drops_a_broken_one ... ok594test treestore::pack::tests::a_pack_reads_back_what_was_written ... ok595test treestore::pack::tests::an_empty_writer_leaves_no_file ... ok596test trace::validate::tests::dir_stat_env_checks ... ok597test source::scm::ledger::tests::the_count_is_lazy_and_kept_by_revision ... ok598test treestore::pack::tests::a_changed_index_byte_is_not_a_pack ... ok599test trace::tests::dedupe_of_many_repeats_is_linear ... ok600test treestore::pack::tests::a_reader_sees_a_pack_written_after_it_listed ... ok601test trace::validate::tests::file_touch_refreshes_edit_misses ... ok602test treestore::pack::tests::collect_removes_dead_packs_and_compacts_mostly_dead_ones ... ok603test trace::tests::only_a_named_query_is_an_observation ... ok604test syntax::tests::comments_and_misc ... ok605test syntax::tests::json_gives_every_node_its_kind_and_span ... ok606test trace::wire::tests::drvs_sources_roots_roundtrip ... ok607test eval::tests::scoping ... ok608test source::scm::ledger::tests::a_change_of_the_ledger_is_a_change_of_the_working_tree ... ok609test syntax::tests::indented_string_stripping ... ok610test syntax::tests::string_escapes_and_interpolation ... ok611test flake::fetch::tests::a_read_of_the_count_is_one_finding_for_each_tree ... ok612test syntax::tests::nul_in_string_literals ... ok613test syntax::tests::lambdas ... ok614test syntax::tests::paths ... ok615test flake::fetch::tests::a_read_that_is_not_a_selection_has_no_site ... ok616test treestore::tests::a_stored_input_reads_back_and_a_wrong_hash_is_refused ... ok617test syntax::tests::numbers ... ok618test treestore::tests::two_inputs_share_their_common_files ... ok619test treestore::tests::a_put_after_a_collection_brings_its_own_objects ... ok620test treestore::tests::collect_keeps_what_an_entry_names ... ok621test flake::fetch::tests::the_name_on_a_value_that_is_not_a_tree_is_silent ... ok622test syntax::tests::attrs_and_bindings ... ok623test syntax::tests::operator_precedence ... ok624test parallel::thunk::tests::many_fibers_force_one_shared_graph ... ok625test trace::validate::tests::the_lowest_failing_observation_is_the_one_reported ... ok626test api::run::tests::helper_fibers_read_the_ir_cache ... ok627test flake::fetch::tests::a_selection_of_the_count_is_the_site ... ok628test eval::tests::pure_eval_answers_like_nix ... ok629test api::run::tests::the_counters_cover_the_helper_fibers ... ok630test runtime::value::tests::union_iteration_merges_like_a_fold ... ok631test syntax::tests::lang_corpus ... ok632test syntax::tests::deep_nesting_ends_with_an_error ... ok633634test result: ok. 449 passed; 0 failed; 5 ignored; 0 measured; 0 filtered out; finished in 29.50s635636 Running unittests src/main.rs (target/debug/deps/iets-0520dcce3ae94ffb)637638running 0 tests639640test result: ok. 0 passed; 0 failed; 0 ignored; 0 measured; 0 filtered out; finished in 0.00s641642 Running tests/aterm_crosscheck.rs (target/debug/deps/aterm_crosscheck-5b36e883a255e009)643644running 14 tests645test malformed_aterm_is_an_error ... ok646test bytes_that_are_not_utf8_roundtrip ... ok647test upstream_bad_drvs_are_rejected ... ok648test harmonia_cases_roundtrip ... ok649test fixed_output_path_is_recomputed_not_trusted ... ok650test upstream_invariants_input_addressed_kept_or_rejected ... ok651test masked_and_unmasked_hashes_differ_once_filled ... ok652test floating_ca_defers_itself_and_downstream ... ok653test upstream_invariants_ca_floating_dependency ... ok654test upstream_invariants_fill_in_deferred ... ok655test upstream_input_addressed_paths_recompute ... ok656test fixed_output_inputs_hide_their_provenance ... ok657test upstream_drvs_roundtrip_byte_exact ... ok658test upstream_bench_drvs_parse_and_reprint_stably ... ok659660test result: ok. 14 passed; 0 failed; 0 ignored; 0 measured; 0 filtered out; finished in 0.00s661662 Running tests/cache_hygiene.rs (target/debug/deps/cache_hygiene-f25f7a90d313f3b8)663664running 10 tests665test crash_writer_child ... ok666test input_touch_child ... ok667test an_entry_that_is_not_a_plain_file_is_refused ... ok668test a_cache_is_private_to_its_owner ... ok669test a_corrupt_entry_is_dropped_and_a_corrupt_store_is_wiped ... ok670671running 1 test672test an_input_observation_marks_its_entry_as_used ... ok673test a_changed_byte_or_a_copied_entry_is_a_miss ... ok674675running 1 test676677running 1 test678test cache_gc_removes_entries_past_the_ttl ... ok679680running 1 test681test concurrent_readers_and_writers_never_see_a_torn_entry ... FAILED682683running 1 test684685running 1 test686test a_killed_writer_leaves_the_store_usable ... ok687688failures:689690---- concurrent_readers_and_writers_never_see_a_torn_entry stdout ----691692thread '<unnamed>' (6068) panicked at tests/cache_hygiene.rs:82:24:693a published entry parses694note: run with `RUST_BACKTRACE=1` environment variable to display a backtrace695696thread 'concurrent_readers_and_writers_never_see_a_torn_entry' (6058) panicked at tests/cache_hygiene.rs:121:5:697a scoped thread panicked698699700failures:701 concurrent_readers_and_writers_never_see_a_torn_entry702703test result: FAILED. 9 passed; 1 failed; 0 ignored; 0 measured; 0 filtered out; finished in 0.31s704705error: test failed, to rerun pass `--test cache_hygiene`