nixbot

builds

succeeded setup checks.x86_64-linux.test · build #25 · raw

1this derivation will be built:2 /nix/store/491gxr6hbjcx5z96bdx2sym019xxp7ba-iets-test-0.1.0.drv3error: Cannot build '/nix/store/491gxr6hbjcx5z96bdx2sym019xxp7ba-iets-test-0.1.0.drv'.4 Reason: builder failed with exit code 101.5 Output paths:6 /nix/store/wjx62s253q6jnyzb47vwk8hcv0mz1v19-iets-test-0.1.07 Last 25 log lines:8 > test concurrent_readers_and_writers_never_see_a_torn_entry ... FAILED9 >10 > running 1 test11 >12 > running 1 test13 > test a_killed_writer_leaves_the_store_usable ... ok14 >15 > failures:16 >17 > ---- concurrent_readers_and_writers_never_see_a_torn_entry stdout ----18 >19 > thread '<unnamed>' (6068) panicked at tests/cache_hygiene.rs:82:24:20 > a published entry parses21 > note: run with `RUST_BACKTRACE=1` environment variable to display a backtrace22 >23 > thread 'concurrent_readers_and_writers_never_see_a_torn_entry' (6058) panicked at tests/cache_hygiene.rs:121:5:24 > a scoped thread panicked25 >26 >27 > failures:28 > concurrent_readers_and_writers_never_see_a_torn_entry29 >30 > test result: FAILED. 9 passed; 1 failed; 0 ignored; 0 measured; 0 filtered out; finished in 0.31s31 >32 > error: test failed, to rerun pass `--test cache_hygiene`33 For full logs, run:34 nix log /nix/store/491gxr6hbjcx5z96bdx2sym019xxp7ba-iets-test-0.1.0.drv