iets-nextest-0.1.0
checks.x86_64-linux.test
· build #244
· raw
unpackPhase
1unpacking source archive /nix/store/hmnaalqz7cqq04lnqlwng2ldgj5bmn9w-source2source root is sourcepatchPhase
3Executing configureCargoCommonVars4decompressing cargo artifacts from /nix/store/4ag17s7r3x70qan6yhkvb308lflc1jrh-iets-deps-0.1.0/target.tar.zst to targetconfigurePhase
5will append /build/source/.cargo-home/config.toml with contents of /nix/store/a8si5lqcnsxaa7nv2zfpl0vi6iqck9mw-vendor-cargo-deps/config.toml6default configurePhase, nothing to dobuildPhase
7+++ command cargo --version8cargo 1.98.0 (797e8a9bc 2026-08-05)9+++ command cargo nextest --version10cargo-nextest 0.9.14611release: 0.9.14612host: x86_64-unknown-linux-gnucheckPhase
13+++ command cargo nextest run --cargo-profile dev14 Compiling iets v0.1.0 (/build/source)15 Finished `dev` profile [unoptimized + debuginfo] target(s) in 52.98s16------------17 Nextest run ID 0f4f81ed-6675-45b1-a348-99ab1ac17ccf with nextest profile: default18 Starting 601 tests across 12 binaries (5 tests skipped)19 PASS [ 0.012s] ( 1/601) iets api::installable::tests::the_name_a_program_takes_from_a_derivation_name20 PASS [ 0.012s] ( 2/601) iets api::installable::tests::default_and_fragment_attr_paths21 PASS [ 0.013s] ( 3/601) iets api::drvshow::tests::pretty_matches_serde_json22 PASS [ 0.013s] ( 4/601) iets build::render::tests::a_build_log_never_reports_a_mismatch23 PASS [ 0.013s] ( 5/601) iets build::backend::tests::output_specs24 PASS [ 0.015s] ( 6/601) iets api::fetch::tests::only_a_fixed_output_drv_can_be_prefetched25 PASS [ 0.016s] ( 7/601) iets build::executor::tests::no_place_at_all_is_a_usage_error26 PASS [ 0.017s] ( 8/601) iets api::drvshow::tests::a_non_canonical_structured_attrs_text_is_renormalised27 PASS [ 0.007s] ( 9/601) iets build::render::tests::a_stalled_build_that_fails_still_shows_its_cause28 PASS [ 0.010s] ( 10/601) iets build::render::tests::an_owned_build_is_verdicted_once_by_its_op29 PASS [ 0.033s] ( 11/601) iets api::drvshow::tests::a_fixed_output_shows_its_content_address_and_no_path30 PASS [ 0.032s] ( 12/601) iets build::event::tests::durations31 PASS [ 0.020s] ( 13/601) iets build::render::tests::an_unfolded_success_ends_with_its_verdict32 PASS [ 0.033s] ( 14/601) iets build::render::tests::a_failure_shows_a_short_extract33 PASS [ 0.033s] ( 15/601) iets build::render::tests::a_build_the_backend_saw_succeed_is_verdicted_at_once34 PASS [ 0.033s] ( 16/601) iets api::drvshow::tests::floats_take_nlohmanns_form35 PASS [ 0.033s] ( 17/601) iets build::backend::tests::base_names_drop_the_store_dir36 PASS [ 0.033s] ( 18/601) iets build::render::tests::a_daemon_failure_message_decides_the_verdict37 PASS [ 0.018s] ( 19/601) iets build::render::tests::heartbeat_names_running_builds38 PASS [ 0.014s] ( 20/601) iets build::render::tests::the_live_region_spins_and_counts39 PASS [ 0.032s] ( 21/601) iets argv::tests::every_byte_round_trips40 PASS [ 0.032s] ( 22/601) iets build::fixhash::tests::two_matches_are_left_alone41 PASS [ 0.020s] ( 23/601) iets build::render::tests::ci_folds_a_success_and_never_a_failure42 PASS [ 0.032s] ( 24/601) iets build::executor::tests::the_first_place_that_takes_it_wins43 PASS [ 0.032s] ( 25/601) iets build::fixhash::tests::one_match_is_rewritten_in_its_own_spelling44 PASS [ 0.032s] ( 26/601) iets build::fanout::tests::dependencies_run_first45 PASS [ 0.032s] ( 27/601) iets build::executor::tests::a_declared_system_filters46 PASS [ 0.033s] ( 28/601) iets api::drvshow::tests::a_multi_output_derivation47 PASS [ 0.017s] ( 29/601) iets build::render::tests::logs_of_two_builds_do_not_interleave48 PASS [ 0.033s] ( 30/601) iets build::render::tests::a_failure_after_the_activity_ended_never_claims_a_success49 PASS [ 0.032s] ( 31/601) iets build::backend::tests::the_timings_report_with_every_line50 PASS [ 0.033s] ( 32/601) iets build::fixhash::tests::a_longer_hash_is_not_a_match51 PASS [ 0.034s] ( 33/601) iets build::executor::tests::one_place_declaring_nothing_takes_everything52 PASS [ 0.035s] ( 34/601) iets build::executor::tests::a_refusal_names_every_place_and_what_it_declared53 PASS [ 0.035s] ( 35/601) iets build::render::tests::a_long_attribute_keeps_its_ends54 PASS [ 0.033s] ( 36/601) iets api::fetch::tests::the_fake_hash_moves_the_output_and_the_drv55 PASS [ 0.036s] ( 37/601) iets build::executor::tests::an_unsupported_url_says_what_is_expected56 PASS [ 0.023s] ( 38/601) iets build::render::tests::drv_paths_of_a_failure_message57 PASS [ 0.020s] ( 39/601) iets build::render::tests::one_build_needs_no_summary58 PASS [ 0.036s] ( 40/601) iets build::executor::tests::a_feature_the_place_lacks_rules_it_out59 PASS [ 0.037s] ( 41/601) iets api::drvshow::tests::inputs_and_structured_attrs60 PASS [ 0.042s] ( 42/601) iets build::fanout::tests::a_failed_dependency_blocks_its_dependants61 PASS [ 0.016s] ( 43/601) iets build::render::tests::the_summary_follows_more_than_one_build62 PASS [ 0.020s] ( 44/601) iets cachefs::tests::a_store_without_a_version_file_is_wiped_once63 PASS [ 0.040s] ( 45/601) iets build::tests::hash_stripping64 PASS [ 0.041s] ( 46/601) iets builtins::fetch_git::tests::a_working_tree_is_a_file_url_of_an_absolute_path65 PASS [ 0.041s] ( 47/601) iets builtins::derivation::tests::a_dynamic_output_renders_the_placeholder_nix_renders66 PASS [ 0.042s] ( 48/601) iets builtins::fetch_git::tests::only_a_plain_rev_or_ref_is_read_by_iets67 PASS [ 0.042s] ( 49/601) iets builtins::text::fromtoml::tests::inline_tables_stay_on_one_line68 PASS [ 0.040s] ( 50/601) iets cachefs::tests::a_touch_inside_the_interval_writes_nothing69 PASS [ 0.050s] ( 51/601) iets cachefs::tests::a_directory_that_is_not_ours_is_refused_untouched70 PASS [ 0.050s] ( 52/601) iets build::render::tests::tty_keeps_successful_logs_off_the_screen71 PASS [ 0.050s] ( 53/601) iets builtins::text::regex::tests::names72 PASS [ 0.049s] ( 54/601) iets builtins::derivation::tests::the_two_placeholders_are_not_the_same73 PASS [ 0.049s] ( 55/601) iets builtins::store_hooks::tests::a_relative_path_inside_an_entry_joins_once74 PASS [ 0.049s] ( 56/601) iets cachefs::tests::a_sweep_runs_once_per_interval75 PASS [ 0.049s] ( 57/601) iets build::tests::a_fan_out_backend_keeps_the_cap_and_the_log_blocks76 PASS [ 0.051s] ( 58/601) iets builtins::text::fromtoml::tests::new_escapes_are_refused77 PASS [ 0.051s] ( 59/601) iets build::tests::targets_become_jobs78 PASS [ 0.089s] ( 60/601) iets build::fanout::tests::at_most_limit_builds_run_at_once79 PASS [ 0.048s] ( 61/601) iets build::render::tests::the_status_line_takes_the_colours_of_the_rows_above80 PASS [ 0.050s] ( 62/601) iets builtins::text::regex::tests::size_limit81 PASS [ 0.058s] ( 63/601) iets cachefs::tests::a_stamp_in_the_future_is_due82 PASS [ 0.014s] ( 64/601) iets cachefs::tests::sweep_walks_the_shards_of_the_ir_cache83 PASS [ 0.013s] ( 65/601) iets cli::build::tests::out_links_are_named_as_nix_build_names_them84 PASS [ 0.020s] ( 66/601) iets cachefs::tests::a_wipe_of_the_ir_cache_walks_its_shards85 PASS [ 0.070s] ( 67/601) iets build::tests::a_target_with_no_verdict_fails86 PASS [ 0.060s] ( 68/601) iets cachefs::tests::a_wait_lock_waits_for_its_holder87 PASS [ 0.026s] ( 69/601) iets cachefs::tests::garbled_stamp_wipes_the_store88 PASS [ 0.025s] ( 70/601) iets cli::build::tests::a_failed_build_reports_itself89 PASS [ 0.025s] ( 71/601) iets cli::build::tests::a_success_with_no_output_path_is_named90 PASS [ 0.029s] ( 72/601) iets cli::build::tests::no_build_result_is_named91 PASS [ 0.038s] ( 73/601) iets cachefs::tests::an_input_store_of_the_spool_layout_is_wiped92 PASS [ 0.092s] ( 74/601) iets cachefs::tests::a_lock_that_cannot_be_opened_is_not_a_busy_lock93 PASS [ 0.045s] ( 75/601) iets cachefs::tests::version_mismatch_wipes_the_store94 PASS [ 0.044s] ( 76/601) iets cli::build::tests::no_outcome_at_all_is_named95 PASS [ 0.045s] ( 77/601) iets cli::build::tests::a_path_on_stdout_is_silent96 PASS [ 0.046s] ( 78/601) iets cachefs::tests::sweep_ages_a_root_by_its_link_not_by_what_it_names97 PASS [ 0.053s] ( 79/601) iets cachefs::tests::sweep_drops_old_entries_and_keeps_young_ones98 PASS [ 0.049s] ( 80/601) iets cli::classic::shell::tests::declares_for_every_bash_shaped_value99 PASS [ 0.025s] ( 81/601) iets cli::classic::tests::a_flag_with_no_effect_is_noted_and_one_that_holds_is_not100 PASS [ 0.045s] ( 82/601) iets cli::classic::shell::tests::sh_var_names101 PASS [ 0.028s] ( 83/601) iets cli::diff::tests::a_name_ends_at_the_first_dash_before_a_digit102 PASS [ 0.060s] ( 84/601) iets cachefs::tests::an_empty_directory_is_ours_to_take103 PASS [ 0.009s] ( 85/601) iets cli::render::tests::sizes_render_as_nix_renders_them104 PASS [ 0.034s] ( 86/601) iets cli::complete::tests::flags_complete_after_a_dash105 PASS [ 0.059s] ( 87/601) iets cli::build::tests::an_out_flag_that_matches_nothing_is_named106 PASS [ 0.036s] ( 88/601) iets cli::complete::tests::every_script_asks_the_binary107 PASS [ 0.037s] ( 89/601) iets cli::complete::tests::a_flag_value_completes_by_its_placeholder108 PASS [ 0.041s] ( 90/601) iets cli::complete::tests::a_positional_is_left_to_the_shell109 PASS [ 0.097s] ( 91/601) iets cachefs::tests::a_wipe_keeps_what_iets_did_not_create110 PASS [ 0.014s] ( 92/601) iets cli::search::tests::drv_names111 PASS [ 0.041s] ( 93/601) iets cli::docs::tests::every_embedded_page_has_a_heading112 PASS [ 0.035s] ( 94/601) iets cli::docs::tests::topics_resolve_bare_and_qualified113 PASS [ 0.030s] ( 95/601) iets cli::plumbing::tests::a_file_url_needs_one_slash_not_three114 PASS [ 0.067s] ( 96/601) iets cli::docs::tests::the_topic_list_fits_80_columns115 PASS [ 0.049s] ( 97/601) iets cli::search::tests::index_round_trip116 PASS [ 0.107s] ( 98/601) iets cli::classic::shell::tests::outputs_become_placeholders117 PASS [ 0.056s] ( 99/601) iets cli::search::tests::merged_highlights118 PASS [ 0.095s] (100/601) iets cli::complete::tests::commands_complete_with_their_summary119 PASS [ 0.116s] (101/601) iets cachefs::tests::the_writer_lock_excludes_one_holder_at_a_time120 PASS [ 0.072s] (102/601) iets cli::help::tests::a_mistyped_command_is_suggested121 PASS [ 0.044s] (103/601) iets config::tests::bool_spellings122 PASS [ 0.055s] (104/601) iets config::tests::a_setting_with_no_effect_is_noted123 PASS [ 0.075s] (105/601) iets cli::help::tests::help_fits_80_columns124 PASS [ 0.050s] (106/601) iets config::tests::bad_typed_values_error_where_they_are_set125 PASS [ 0.067s] (107/601) iets cli::render::text::tests::a_long_value_shows_the_lines_that_differ126 PASS [ 0.078s] (108/601) iets cli::help::tests::messages127 PASS [ 0.055s] (109/601) iets config::tests::an_alias_is_its_setting128 PASS [ 0.018s] (110/601) iets config::tests::extra_appends_to_list_settings_only129 PASS [ 0.048s] (111/601) iets config::tests::basic_syntax130 PASS [ 0.058s] (112/601) iets config::tests::a_classic_name_leaves_an_unimplemented_setting_to_nix131 PASS [ 0.016s] (113/601) iets config::tests::max_jobs_auto_is_the_cpu_count132 PASS [ 0.018s] (114/601) iets config::tests::include_chain133 PASS [ 0.103s] (115/601) iets cli::complete::tests::subcommands_and_topics134 PASS [ 0.084s] (116/601) iets cli::help::tests::suggestions_come_from_the_help135 PASS [ 0.042s] (117/601) iets config::tests::user_conf_files_are_in_precedence_order136 PASS [ 0.116s] (118/601) iets cli::plumbing::tests::a_url_is_the_positional_fetch_takes_itself137 PASS [ 0.040s] (119/601) iets devenv::tests::shell_escaping138 PASS [ 0.048s] (120/601) iets devenv::tests::cached_result_roundtrip139 PASS [ 0.057s] (121/601) iets devenv::tests::output_checks_are_erased_only_when_present140 PASS [ 0.059s] (122/601) iets display::tests::a_frame_is_one_synchronized_write141 PASS [ 0.070s] (123/601) iets devenv::tests::get_env_sh_store_path_matches_nix142 PASS [ 0.079s] (124/601) iets config::tests::syntax_errors143 PASS [ 0.079s] (125/601) iets devenv::tests::non_bash_builder_is_refused144 PASS [ 0.099s] (126/601) iets config::tests::overrides_win_over_files145 PASS [ 0.090s] (127/601) iets devenv::tests::rewrites_apply_in_map_order_to_every_occurrence146 PASS [ 0.093s] (128/601) iets devenv::tests::json_roundtrip_and_bash_forms147 PASS [ 0.104s] (129/601) iets config::tests::missing_include_errors_and_bang_include_does_not148 PASS [ 0.100s] (130/601) iets config::tests::unknown_settings_are_kept149 PASS [ 0.106s] (131/601) iets config::tests::option_nix_path_replaces_nix_path_and_extra_adds150 PASS [ 0.105s] (132/601) iets config::tests::the_setting_tables_name_nix_settings151 PASS [ 0.089s] (133/601) iets display::tests::colour_and_width152 PASS [ 0.185s] (134/601) iets config::tests::typed_getters_and_defaults153 PASS [ 0.124s] (135/601) iets display::tests::output_starts_at_the_origin154 PASS [ 0.163s] (136/601) iets display::tests::a_full_width_line_keeps_its_last_column155 PASS [ 0.159s] (137/601) iets display::tests::a_region_that_grows_and_shrinks_loses_no_output156 PASS [ 0.206s] (138/601) iets config::tests::the_daemon_gets_the_store_settings_set_outside_the_system_file157 PASS [ 0.133s] (139/601) iets display::tests::growth_does_not_eat_output158 PASS [ 0.216s] (140/601) iets devenv::tests::rc_script_rewrites_outputs_and_writes_attrs159 PASS [ 0.146s] (141/601) iets display::tests::output_scrolls_and_the_region_stays_at_the_bottom160 PASS [ 0.127s] (142/601) iets display::tests::the_region_comes_down_on_close161 PASS [ 0.131s] (143/601) iets display::tests::the_region_keeps_its_rows_until_a_smaller_size_lasts162 PASS [ 0.131s] (144/601) iets display::tests::wrapped_output_does_not_corrupt_the_region163 PASS [ 0.175s] (145/601) iets display::tests::a_resize_keeps_one_region164 PASS [ 0.185s] (146/601) iets display::tests::a_resize_burst_never_erases165 PASS [ 0.238s] (147/601) iets display::tests::a_region_taller_than_the_screen_is_clamped166 PASS [ 0.567s] (148/601) iets api::value::tests::lists167 PASS [ 0.533s] (149/601) iets builtins::text::regex::tests::long_inputs_do_not_recurse168 PASS [ 0.282s] (150/601) iets eval::tests::a_function_select_is_a_fresh_slot_when_its_subject_is_forced169 PASS [ 0.594s] (151/601) iets api::value::tests::apply_is_lazy170 PASS [ 0.593s] (152/601) iets api::value::tests::attrs_by_name_and_index171 PASS [ 0.570s] (153/601) iets builtins::fetch::tests::nix_sees_no_mark172 PASS [ 0.478s] (154/601) iets compile::cache::tests::nesting_past_the_cap_misses173 PASS [ 0.016s] (155/601) iets fetch::http::tests::credentials_stay_on_the_first_origin174 PASS [ 0.615s] (156/601) iets builtins::fetch::tests::the_mark_follows_the_string_like_store_context175 PASS [ 0.055s] (157/601) iets fetch::http::tests::credentials_in_the_url_are_sent_and_never_printed176 PASS [ 0.011s] (158/601) iets fetch::http::tests::file_urls_name_a_local_path177 PASS [ 0.010s] (159/601) iets fetch::http::tests::magic_bytes178 PASS [ 0.012s] (160/601) iets fetch::http::tests::redirects_keep_credentials_only_on_the_same_origin179 PASS [ 0.006s] (161/601) iets fetch::http::tests::redirects_resolve180 PASS [ 0.005s] (162/601) iets fetch::http::tests::urls_split181 PASS [ 0.008s] (163/601) iets fetch::http::tests::trailing_bytes_and_a_second_layer182 PASS [ 0.006s] (164/601) iets fetch::roots::tests::a_named_file_that_is_missing_or_empty_is_an_error183 PASS [ 0.693s] (165/601) iets api::value::tests::force_deep_forces_the_whole_tree184 PASS [ 0.697s] (166/601) iets api::value::tests::construction185 PASS [ 0.008s] (167/601) iets fetch::roots::tests::an_empty_nix_ssl_cert_file_hides_ssl_cert_file186 PASS [ 0.660s] (168/601) iets builtins::fetch::tests::an_entry_of_the_compiled_file_cache_keeps_the_site187 PASS [ 0.008s] (169/601) iets fetch::roots::tests::nix_ssl_cert_file_wins_over_ssl_cert_file_and_the_platform188 PASS [ 0.007s] (170/601) iets fetch::spool::tests::a_sparse_member_counts_against_the_size_limit189 PASS [ 0.016s] (171/601) iets fetch::roots::tests::no_bundle_anywhere_gives_the_compiled_in_set190 PASS [ 0.019s] (172/601) iets fetch::spool::tests::a_changed_index_byte_is_a_miss191 PASS [ 0.019s] (173/601) iets fetch::spool::tests::a_stored_tree_dumps_the_spools_nar192 PASS [ 0.692s] (174/601) iets builtins::store_hooks::tests::virtual_tree_reads_go_to_the_local_files193 PASS [ 0.045s] (175/601) iets fetch::spool::tests::an_empty_archive_is_an_empty_directory194 PASS [ 0.064s] (176/601) iets fetch::roots::tests::the_platform_store_wins_over_the_compiled_in_set195 PASS [ 0.125s] (177/601) iets fetch::http::tests::downloads_stop_at_the_size_limit196 PASS [ 0.062s] (178/601) iets fetch::spool::tests::nar_hash_of_the_fixture197 PASS [ 0.064s] (179/601) iets fetch::spool::tests::pax_sparse_members_are_expanded198 PASS [ 0.124s] (180/601) iets fetch::spool::tests::archives_the_git_sink_accepts199 PASS [ 0.111s] (181/601) iets fetch::spool::tests::spool_matches_the_tree_on_the_top_level200 PASS [ 0.090s] (182/601) iets fetch::spool::tests::the_scratch_file_never_follows_a_symlink201 PASS [ 0.116s] (183/601) iets fetch::spool::tests::the_errors_match202 PASS [ 0.101s] (184/601) iets fetch::unpack::tests::a_repeated_member_keeps_the_last_copy203 PASS [ 0.067s] (185/601) iets fetch::unpack::tests::an_unsupported_member_type_is_an_error204 PASS [ 0.040s] (186/601) iets fetch::unpack::tests::keeps_the_root_when_it_is_not_a_single_directory205 PASS [ 0.030s] (187/601) iets fetch::unpack::tests::member_names_are_made_relative_and_cannot_escape206 PASS [ 0.228s] (188/601) iets fetch::spool::tests::a_hard_link_never_replaces_a_member207 PASS [ 0.925s] (189/601) iets api::value::tests::thunk_reads_as_thunk208 PASS [ 0.036s] (190/601) iets fetch::unpack::tests::nar_hash_of_the_fixture209 PASS [ 0.934s] (191/601) iets api::value::tests::wrong_type_is_an_error210 PASS [ 0.010s] (192/601) iets flake::flakeref::tests::refuses_a_github_ref_named_twice211 PASS [ 0.013s] (193/601) iets flake::flakeref::tests::parses_the_kept_schemes212 PASS [ 0.035s] (194/601) iets fetch::unpack::tests::strips_one_leading_component213 PASS [ 0.026s] (195/601) iets flake::flakeref::tests::git_urls_are_fixed_like_nix214 PASS [ 0.037s] (196/601) iets flake::flakeref::tests::errors_and_unsupported215 PASS [ 0.017s] (197/601) iets flake::tests::a_pinned_checkout_is_its_revision216 PASS [ 0.022s] (198/601) iets flake::flakeref::tests::to_string_from_attrs217 PASS [ 0.022s] (199/601) iets flake::flakeref::tests::round_trips218 PASS [ 0.020s] (200/601) iets jobs::constituents::tests::fnmatch_basics219 PASS [ 0.966s] (201/601) iets api::run::tests::a_fiber_template_carries_the_configuration220 PASS [ 0.012s] (202/601) iets jobs::line::tests::error_line_round_trip221 PASS [ 0.026s] (203/601) iets flake::tests::attr_paths222 PASS [ 0.019s] (204/601) iets jobs::constituents::tests::topo_sort_orders_and_detects_cycles223 PASS [ 0.010s] (205/601) iets jobs::line::tests::stats_survive_the_collector224 PASS [ 0.014s] (206/601) iets lint::allow::tests::comment_names225 PASS [ 0.227s] (207/601) iets fetch::spool::tests::spool_matches_the_tree226 PASS [ 0.042s] (208/601) iets flake::tests::refs_resolve_against_cwd_and_home227 PASS [ 0.027s] (209/601) iets jobs::line::tests::split_and_round_trip228 PASS [ 0.023s] (210/601) iets lint::site::tests::a_literal_lint_of_nix_has_an_edit229 PASS [ 0.029s] (211/601) iets lint::tests::an_unknown_name_is_a_warning_in_a_file_and_an_error_in_a_flag230 PASS [ 0.025s] (212/601) iets lint::tests::names_are_unique_kebab_case231 PASS [ 0.704s] (213/601) iets eval::tests::an_invalid_regex_fails_before_the_string_is_forced232 PASS [ 0.050s] (214/601) iets lint::site::tests::the_span_is_the_innermost_node_of_the_kind_of_the_lint233 PASS [ 0.874s] (215/601) iets compile::cache::tests::a_changed_byte_of_a_stored_entry_is_a_miss234 PASS [ 0.041s] (216/601) iets lint::tests::scope_and_inputs235 PASS [ 0.045s] (217/601) iets lint::tests::selectors_and_order236 PASS [ 1.029s] (218/601) iets api::value::tests::missing_attribute237 PASS [ 0.032s] (219/601) iets lint::tests::toml_table238 PASS [ 0.073s] (220/601) iets lint::allow::tests::lines239 PASS [ 0.152s] (221/601) iets fetch::unpack::tests::modes_symlinks_and_empty_dirs240 PASS [ 1.044s] (222/601) iets api::value::tests::calling_a_function241 PASS [ 0.069s] (223/601) iets lint::tests::keys242 PASS [ 0.030s] (224/601) iets log::tests::a_mismatch_reason_keeps_both_hashes243 PASS [ 0.015s] (225/601) iets log::tests::a_session_id_is_a_uuid_v7244 PASS [ 0.027s] (226/601) iets log::tests::a_pause_takes_the_view_down_for_a_prompt245 PASS [ 0.090s] (227/601) iets lint::tests::specificity_inside_a_source_and_order_between_sources246 PASS [ 0.041s] (228/601) iets log::tests::a_region_stays_under_the_output_that_scrolls_above_it247 PASS [ 0.032s] (229/601) iets log::tests::ansi_stripping248 PASS [ 0.075s] (230/601) iets log::tests::a_forged_mismatch_is_dropped249 PASS [ 0.053s] (231/601) iets log::tests::a_resolved_copy_reports_its_mismatch_as_a_line250 PASS [ 0.077s] (232/601) iets log::tests::a_fixed_hash_has_the_shape_of_a_finding_with_an_edit251 PASS [ 0.072s] (233/601) iets log::tests::a_half_line_waits_for_its_newline252 PASS [ 0.042s] (234/601) iets log::tests::activity_records_are_nix_json_logger_records253 PASS [ 0.063s] (235/601) iets log::tests::a_resize_redraws_the_region_once254 PASS [ 0.022s] (236/601) iets log::tests::lint_warning_is_a_level_1_record255 PASS [ 0.071s] (237/601) iets log::tests::a_hash_mismatch_names_the_hash_it_got256 PASS [ 0.037s] (238/601) iets log::tests::escapes_are_filtered_the_way_nix_filters_them257 PASS [ 0.087s] (239/601) iets log::tests::a_coloured_error_is_an_error_record258 PASS [ 0.104s] (240/601) iets lint::tests::the_project_file_walk_stops_at_the_project_root259 PASS [ 0.040s] (241/601) iets log::tests::exit_status_flags_combine_like_nix260 PASS [ 0.029s] (242/601) iets log::tests::record_is_nix_log_ei_plus_code_and_hint261 PASS [ 0.029s] (243/601) iets log::tests::the_status_line_goes_under_the_region262 PASS [ 0.719s] (244/601) iets eval::tests::derivation_wrapper_exists263 PASS [ 1.135s] (245/601) iets api::value::tests::strings_and_context264 PASS [ 0.032s] (246/601) iets parallel::fiber::tests::migrates_between_threads265 PASS [ 0.035s] (247/601) iets nixbin::tests::farm_marker_is_found_through_two_hops266 PASS [ 0.720s] (248/601) iets eval::tests::fetch_mercurial_names_a_way_out267 PASS [ 0.021s] (249/601) iets parallel::fiber::tests::resume_yield_finish268 PASS [ 0.579s] (250/601) iets eval::tests::update_forces_the_right_operand_first269 PASS [ 0.028s] (251/601) iets parallel::interner::tests::empty_name_misses_the_cache_sentinel270 PASS [ 0.060s] (252/601) iets nixbin::tests::every_iets_build_is_skipped271 PASS [ 0.060s] (253/601) iets parallel::deque::tests::lifo_owner_fifo_thief272 PASS [ 0.073s] (254/601) iets log::tests::text_shows_the_hint_of_an_unsupported_error273 PASS [ 0.080s] (255/601) iets log::tests::record_without_position274 PASS [ 0.217s] (256/601) iets jobs::tests::a_numeric_name_selects_an_attribute_under_a_set275 PASS [ 0.098s] (257/601) iets log::tests::without_a_terminal_output_is_plain276 PASS [ 0.081s] (258/601) iets parallel::fiber::tests::reservation_is_capped_and_mmap_failure_is_an_error277 PASS [ 0.055s] (259/601) iets parallel::sched::tests::park_and_wake_across_workers278 PASS [ 0.025s] (260/601) iets profile::tests::a_sample_is_taken_once_per_tick279 PASS [ 0.066s] (261/601) iets parallel::sched::tests::main_parks_and_is_woken_by_helper280 PASS [ 0.036s] (262/601) iets profile::tests::a_frame_keeps_its_call_site_and_its_name281 PASS [ 0.070s] (263/601) iets parallel::sched::tests::a_task_survives_packing_past_the_old_24_bit_start282 PASS [ 0.075s] (264/601) iets parallel::sched::tests::fan_out_from_main283 PASS [ 0.649s] (265/601) iets eval::tests::try_eval_and_errors284 PASS [ 0.037s] (266/601) iets profile::tests::a_weight_is_bytes_when_the_profile_asks_for_them285 PASS [ 0.018s] (267/601) iets progress::tests::a_log_hears_of_a_task_after_first_and_then_every_heartbeat286 PASS [ 0.053s] (268/601) iets print::tests::float_formatting_edge_cases287 PASS [ 0.116s] (269/601) iets parallel::fiber::tests::a_freed_stack_frees_its_guard_entry288 PASS [ 0.910s] (270/601) iets eval::tests::a_second_pseudo_file_keeps_its_own_positions289 PASS [ 0.088s] (271/601) iets parallel::interner::tests::intern_is_stable_and_shared290 PASS [ 0.017s] (272/601) iets progress::tests::store_hashes_are_left_out291 PASS [ 0.023s] (273/601) iets progress::tests::a_transfer_that_does_not_move_says_so292 PASS [ 0.076s] (274/601) iets parallel::thunk::tests::deadlocked_fibers_are_cancelled293 PASS [ 0.123s] (275/601) iets parallel::fiber::tests::large_stack_use_and_release294 PASS [ 0.020s] (276/601) iets project::tests::a_config_file_never_shrinks_the_root295 PASS [ 0.033s] (277/601) iets profile::tests::an_unwind_returns_to_a_depth296 PASS [ 0.126s] (278/601) iets parallel::deque::tests::concurrent_sum297 PASS [ 0.018s] (279/601) iets project::tests::a_working_tree_wins_over_a_file_marker_below_it298 PASS [ 0.017s] (280/601) iets project::tests::each_marker_is_a_root299 PASS [ 0.030s] (281/601) iets progress::tests::several_of_a_kind_are_counted300 PASS [ 0.648s] (282/601) iets fetch::http::tests::a_decompression_bomb_is_refused301 PASS [ 0.114s] (283/601) iets parallel::interner::tests::concurrent_intern_agrees302 PASS [ 0.009s] (284/601) iets remote::grpc::backend::tests::a_cold_store_is_asked_the_rest_in_one_call303 PASS [ 0.017s] (285/601) iets provenance::tests::an_input_file_is_labelled_by_its_lock_node304 PASS [ 0.009s] (286/601) iets remote::grpc::build::tests::a_local_upload_failure_beats_the_stream_ended_status305 PASS [ 0.042s] (287/601) iets progress::tests::a_download_inside_a_copy_is_part_of_the_copy306 PASS [ 0.017s] (288/601) iets provenance::tests::a_path_followed_by_a_colour_escape_still_matches307 PASS [ 0.020s] (289/601) iets provenance::tests::a_tree_copied_from_a_store_tree_resolves_to_the_local_one308 PASS [ 0.018s] (290/601) iets remote::grpc::backend::tests::a_built_root_asks_nothing_below_it309 PASS [ 0.023s] (291/601) iets provenance::tests::locate_without_a_match_is_none310 PASS [ 0.016s] (292/601) iets remote::grpc::backend::tests::an_input_below_a_built_one_is_not_built311 PASS [ 0.029s] (293/601) iets provenance::tests::a_shared_position_is_left_off_the_started_line_only312 PASS [ 0.020s] (294/601) iets remote::grpc::build::tests::required_features_come_from_the_env_or_structured_attrs313 PASS [ 0.036s] (295/601) iets provenance::tests::locate_takes_the_longest_prefix314 PASS [ 0.017s] (296/601) iets remote::grpc::build::tests::topo_sort_puts_references_first315 PASS [ 0.033s] (297/601) iets provenance::tests::rewrite_leaves_unknown_text_alone316 PASS [ 0.017s] (298/601) iets remote::grpc::drvwire::tests::path_info_round_trips317 PASS [ 0.021s] (299/601) iets remote::grpc::drvwire::tests::build_result_round_trips_a_daemon_reply318 PASS [ 0.044s] (300/601) iets project::tests::the_nearest_flake_wins_without_a_working_tree319 PASS [ 0.041s] (301/601) iets remote::grpc::drvwire::tests::basic_derivation_matches_the_cxx_field_order320 PASS [ 0.058s] (302/601) iets provenance::tests::rewrite_replaces_every_known_path_in_a_line321 PASS [ 0.120s] (303/601) iets profile::tests::a_deep_stack_is_capped322 PASS [ 0.028s] (304/601) iets remote::grpc::health::tests::one_address_does_not_refuse_another323 PASS [ 0.046s] (305/601) iets remote::grpc::build::tests::reschedules_back_off_past_a_dead_worker324 PASS [ 0.017s] (306/601) iets remote::grpc::tests::every_parameter_parses325 PASS [ 0.021s] (307/601) iets remote::grpc::tests::a_token_needs_tls_and_unknown_parameters_are_errors326 PASS [ 0.035s] (308/601) iets remote::grpc::health::tests::a_completed_build_clears_the_history327 PASS [ 0.042s] (309/601) iets remote::grpc::drvwire::tests::a_failure_keeps_its_message328 PASS [ 0.042s] (310/601) iets remote::grpc::drvwire::tests::an_unresolvable_input_output_is_an_error329 PASS [ 0.018s] (311/601) iets remote::grpc::tests::defaults_match_the_cxx_settings330 PASS [ 0.061s] (312/601) iets provenance::tests::failed_line_names_the_attribute_and_the_position331 PASS [ 0.050s] (313/601) iets remote::grpc::build::tests::the_timings_report_with_every_line332 PASS [ 0.031s] (314/601) iets remote::grpc::health::tests::the_cooldown_grows_and_stops_at_30s333 PASS [ 0.057s] (315/601) iets remote::grpc::build::tests::a_self_reference_does_not_loop334 PASS [ 0.041s] (316/601) iets remote::grpc::health::tests::a_passed_cooldown_lets_one_caller_through335 PASS [ 0.067s] (317/601) iets remote::grpc::backend::tests::a_built_input_stops_the_walk336 PASS [ 0.043s] (318/601) iets remote::grpc::health::tests::an_unknown_address_is_usable337 PASS [ 0.010s] (319/601) iets remote::plan::tests::an_answered_root_is_not_asked_again338 PASS [ 0.029s] (320/601) iets remote::plan::tests::a_held_input_answers_for_its_closure339 PASS [ 0.829s] (321/601) iets eval::tests::sets_compare_in_the_symbol_order_of_nix340 PASS [ 0.035s] (322/601) iets remote::plan::tests::a_held_root_answers_for_its_closure341 PASS [ 0.898s] (323/601) iets eval::tests::equality342 PASS [ 0.042s] (324/601) iets remote::grpc::tests::mtls_needs_both_halves343 PASS [ 0.036s] (325/601) iets remote::worker::tests::ssh_argv_puts_the_host_first344 PASS [ 0.068s] (326/601) iets remote::grpc::health::tests::two_bounces_refuse_it345 PASS [ 0.068s] (327/601) iets remote::grpc::health::tests::one_bounce_does_not_refuse_an_address346 PASS [ 0.042s] (328/601) iets remote::plan::tests::memory_source_matches_dump_string347 PASS [ 0.041s] (329/601) iets remote::worker::tests::a_status_over_a_byte_is_not_a_success348 PASS [ 0.046s] (330/601) iets remote::worker::counts_tests::each_change_is_a_verdict_in_order349 PASS [ 0.050s] (331/601) iets remote::grpc::tests::insecure_is_a_bare_flag_or_a_boolean350 PASS [ 0.046s] (332/601) iets remote::worker::tests::an_ssh_host_is_never_an_option351 PASS [ 0.055s] (333/601) iets remote::worker::counts_tests::a_repeated_update_claims_nothing352 PASS [ 0.051s] (334/601) iets remote::worker::wire::tests::build_results_are_read_as_nix_reads_them353 PASS [ 0.033s] (335/601) iets runtime::heap::tests::release_tombstones_every_chunk354 PASS [ 0.018s] (336/601) iets runtime::value::layout::a_primop_pays_nothing_for_its_symbol355 PASS [ 0.066s] (337/601) iets remote::plan::tests::hash_source_matches_nar_hash356 PASS [ 0.962s] (338/601) iets eval::tests::derivation_keeps_env_and_args_that_are_not_utf8357 PASS [ 0.063s] (339/601) iets remote::worker::wire::tests::replies_are_read_as_nix_reads_them358 PASS [ 0.037s] (340/601) iets session::tests::two_sessions_share_no_state359 PASS [ 0.089s] (341/601) iets remote::plan::tests::a_cold_store_is_asked_the_rest_in_one_call360 PASS [ 0.784s] (342/601) iets fetch::http::tests::a_transient_status_is_retried361 PASS [ 0.024s] (343/601) iets settings::tests::a_project_file_holds_lint_and_nothing_else362 PASS [ 0.018s] (344/601) iets settings::tests::each_source_wins_over_the_one_before363 PASS [ 0.055s] (345/601) iets runtime::value::alloc_tests::a_list_too_long_to_address_has_no_size364 PASS [ 0.028s] (346/601) iets settings::tests::builder_reads_all_three_forms365 PASS [ 0.012s] (347/601) iets settings::tests::source_map_adds_up_and_every_other_key_replaces366 PASS [ 0.014s] (348/601) iets settings::tests::the_environment_wins_over_the_file367 PASS [ 0.075s] (349/601) iets remote::worker::wire::tests::strings_are_padded368 PASS [ 0.097s] (350/601) iets remote::worker::wire::tests::framed_sink_frames_and_terminates369 PASS [ 0.014s] (351/601) iets settings::tests::the_flag_value_is_toml_when_it_reads_as_toml370 PASS [ 0.113s] (352/601) iets remote::grpc::tests::percent_escapes_decode_in_values371 PASS [ 0.106s] (353/601) iets remote::worker::tests::transport_from_url372 PASS [ 0.051s] (354/601) iets settings::tests::a_settings_file_may_hold_lint_and_the_other_sources_may_not373 PASS [ 0.055s] (355/601) iets settings::tests::a_wrong_type_names_the_key_and_the_file374 PASS [ 0.061s] (356/601) iets settings::tests::a_missing_file_is_skipped_and_the_defaults_hold375 PASS [ 0.120s] (357/601) iets remote::worker::tests::nix_sshopts_split_like_a_shell376 PASS [ 0.019s] (358/601) iets source::local::tests::only_a_content_addressed_store_path_names_its_content377 PASS [ 0.038s] (359/601) iets settings::tests::the_flag_pairs_are_kept_for_a_second_iets378 PASS [ 0.017s] (360/601) iets source::lock::tests::incomplete_locks_fail379 PASS [ 0.012s] (361/601) iets source::remote::tests::a_leftover_is_not_a_valid_path380 PASS [ 0.021s] (362/601) iets source::lock::tests::empty_lock_has_no_inputs381 PASS [ 0.044s] (363/601) iets settings::tests::the_flag_leaves_the_argv382 PASS [ 0.036s] (364/601) iets source::local::tests::accepted_set_adds_parent_directories383 PASS [ 0.087s] (365/601) iets settings::tests::a_flag_carries_several_places_separated_by_a_semicolon384 PASS [ 0.049s] (366/601) iets settings::tests::unknown_key_names_the_file385 PASS [ 0.063s] (367/601) iets settings::tests::the_file_is_the_users386 PASS [ 0.053s] (368/601) iets settings::tests::the_user_file_turns_purity_off387 PASS [ 0.064s] (369/601) iets source::local::tests::max_mtime_covers_root_and_children388 PASS [ 0.068s] (370/601) iets source::lock::tests::complete_lock_passes389 PASS [ 0.059s] (371/601) iets source::remote::tests::nix_literal_escapes390 PASS [ 0.056s] (372/601) iets source::remote::tests::only_the_archive_types_are_fetched_by_iets391 PASS [ 0.069s] (373/601) iets source::remote::tests::access_tokens_match_the_longest_prefix392 PASS [ 0.065s] (374/601) iets source::remote::tests::download_urls_match_the_fetchers393 PASS [ 0.082s] (375/601) iets source::lock::tests::declared_inputs_must_match_the_lock394 PASS [ 0.027s] (376/601) iets store::drv::tests::a_dynamic_input_writes_the_versioned_aterm_and_parses_back395 PASS [ 0.060s] (377/601) iets source::scm::ledger::tests::a_directory_in_a_working_tree_is_found396 PASS [ 0.072s] (378/601) iets source::scm::git::tests::a_directory_in_a_repository_is_found397 PASS [ 0.018s] (379/601) iets store::drv::tests::input_drvs_hash_modulo_from_scratch398 PASS [ 0.033s] (380/601) iets store::drv::tests::fixed_output_from_scratch399 PASS [ 0.049s] (381/601) iets store::drv::tests::an_env_key_named_json_is_refused400 PASS [ 0.069s] (382/601) iets source::tests::dates401 PASS [ 1.366s] (383/601) iets compile::cache::tests::a_malformed_entry_is_a_miss_and_never_a_crash402 PASS [ 0.027s] (384/601) iets store::drv::tests::string_escapes_roundtrip403 PASS [ 0.037s] (385/601) iets store::drv::tests::masked_unparse_blanks_output_paths_and_env404 PASS [ 1.110s] (386/601) iets eval::tests::fetchurl_needs_a_sha256_in_every_mode405 PASS [ 0.050s] (387/601) iets store::drv::tests::fixtures_output_paths_recompute406 PASS [ 0.062s] (388/601) iets store::drv::tests::fixtures_drv_path_matches_store_path407 PASS [ 0.057s] (389/601) iets store::drv::tests::fixtures_roundtrip_byte_exact408 PASS [ 0.035s] (390/601) iets store::drvdiff::tests::a_changed_input_drv_is_paired_by_name_and_recursed_into409 PASS [ 0.060s] (391/601) iets store::drv::tests::input_addressed_multi_output_from_scratch410 PASS [ 0.028s] (392/601) iets store::drvdiff::tests::the_same_derivation_is_empty411 PASS [ 0.045s] (393/601) iets store::drvdiff::tests::an_input_source_an_added_input_drv_and_a_fixed_output_show_up412 PASS [ 0.224s] (394/601) iets runtime::value::alloc_tests::a_speculated_thunk_is_forced_but_not_demanded413 PASS [ 0.220s] (395/601) iets runtime::value::tests::union_lookup_agrees_with_iteration414 PASS [ 0.043s] (396/601) iets store::drvdiff::tests::json_names_what_differs415 PASS [ 0.023s] (397/601) iets store::hash::tests::empty_sha256416 PASS [ 1.132s] (398/601) iets eval::tests::from_json_and_toml_reject_null_bytes417 PASS [ 0.034s] (399/601) iets store::hash::tests::base64_roundtrip418 PASS [ 0.034s] (400/601) iets store::hash::tests::compress_hash_xors419 PASS [ 0.030s] (401/601) iets store::hash::tests::md5_nix32420 PASS [ 0.056s] (402/601) iets store::drvdiff::tests::env_name_shows_only_when_it_is_not_the_derivation_name421 PASS [ 0.019s] (403/601) iets store::hash::tests::sha512_nix32_base64422 PASS [ 1.145s] (404/601) iets eval::tests::nix_eq_forces_what_the_shortcut_skips423 PASS [ 0.026s] (405/601) iets store::hash::tests::sha256_sri424 PASS [ 0.024s] (406/601) iets store::hash::tests::streaming_matches_oneshot425 PASS [ 0.026s] (407/601) iets store::nar::tests::directory_nar_hash_formats426 PASS [ 0.017s] (408/601) iets store::nar::tests::readers_refuse_what_nix_refuses427 PASS [ 0.065s] (409/601) iets store::drvdiff::tests::the_local_fields_the_env_and_an_absent_value428 PASS [ 0.050s] (410/601) iets store::hash::tests::nix32_roundtrip_and_reject429 PASS [ 0.022s] (411/601) iets store::nar::tests::executable_file_nar430 PASS [ 0.035s] (412/601) iets store::hash::tests::sha256_nix32431 PASS [ 0.075s] (413/601) iets store::drvdiff::tests::the_depth_limit_names_the_input_without_walking_it432 PASS [ 0.032s] (414/601) iets store::nar::tests::directory_nar_with_an_executable433 PASS [ 0.020s] (415/601) iets store::nar::tests::regular_file_nar434 PASS [ 1.164s] (416/601) iets eval::tests::printing435 PASS [ 1.451s] (417/601) iets compile::cache::tests::a_changed_byte_never_makes_the_evaluator_read_past_its_env436 PASS [ 0.017s] (418/601) iets store::nar::tests::script_nar437 PASS [ 0.171s] (419/601) iets source::scm::ledger::tests::the_count_is_lazy_and_kept_by_revision438 PASS [ 0.020s] (420/601) iets store::nar::tests::restore_roundtrip439 PASS [ 0.062s] (421/601) iets store::hash::tests::parse_any_all_formats440 PASS [ 1.020s] (422/601) iets fetch::http::tests::a_stalled_download_fails441 PASS [ 0.066s] (423/601) iets store::hash::tests::sha1_nix32442 PASS [ 0.032s] (424/601) iets store::path::tests::an_override_is_absolute_and_has_no_trailing_separator443 PASS [ 0.055s] (425/601) iets store::nar::tests::filter_sees_types_and_paths444 PASS [ 0.037s] (426/601) iets store::nar::tests::symlink_nar445 PASS [ 0.024s] (427/601) iets store::path::tests::parse_and_accessors446 PASS [ 0.038s] (428/601) iets store::path::tests::check_name_rules447 PASS [ 0.047s] (429/601) iets store::nar::tests::restore_rejects_garbage448 PASS [ 0.017s] (430/601) iets store::path::tests::to_file449 PASS [ 0.040s] (431/601) iets store::path::tests::fixed_flat_sha256450 PASS [ 0.037s] (432/601) iets store::path::tests::path_with_name451 PASS [ 0.046s] (433/601) iets store::path::tests::output_names452 PASS [ 0.040s] (434/601) iets store::path::tests::the_directory_is_found_as_a_string_and_as_a_path453 PASS [ 0.023s] (435/601) iets syntax::tests::allow_comments454 PASS [ 0.054s] (436/601) iets store::path::tests::fixed_recursive_sha256455 PASS [ 0.031s] (437/601) iets store::path::tests::to_file_with_reference456 PASS [ 0.049s] (438/601) iets store::path::tests::path_copy_directory457 PASS [ 0.049s] (439/601) iets store::path::tests::path_copy_file458 PASS [ 0.230s] (440/601) iets source::scm::ledger::tests::a_name_resolves_to_a_revision_and_a_revision_has_a_tree459 PASS [ 0.065s] (441/601) iets store::path::tests::fixed_flat_sha1460 PASS [ 0.067s] (442/601) iets store::path::tests::a_multibyte_char_across_the_hash_part_is_an_error461 PASS [ 0.028s] (443/601) iets syntax::tests::attrs_and_bindings462 PASS [ 0.031s] (444/601) iets syntax::tests::a_line_ends_at_cr_lf_and_lone_cr463 PASS [ 0.067s] (445/601) iets store::path::tests::filter_source464 PASS [ 0.016s] (446/601) iets syntax::tests::json_gives_every_node_its_kind_and_span465 PASS [ 0.046s] (447/601) iets store::path::tests::the_host_picks_the_store_directory466 PASS [ 0.037s] (448/601) iets syntax::tests::an_interpolated_name_is_static_when_nix_has_one_string_node467 PASS [ 0.104s] (449/601) iets store::nar::tests::directory_nar468 PASS [ 0.065s] (450/601) iets store::path::tests::placeholder469 PASS [ 0.030s] (451/601) iets syntax::tests::indented_string_stripping470 PASS [ 0.333s] (452/601) iets runtime::value::alloc_tests::a_static_slice_is_interned_without_a_copy471 PASS [ 0.027s] (453/601) iets syntax::tests::lambdas472 PASS [ 0.248s] (454/601) iets source::scm::ledger::tests::an_untracked_file_is_the_error_of_nix473 PASS [ 0.046s] (455/601) iets syntax::tests::end_of_file_inside_a_path_is_at_its_last_token474 PASS [ 0.039s] (456/601) iets syntax::tests::nul_in_string_literals475 PASS [ 0.062s] (457/601) iets syntax::tests::comments_and_misc476 PASS [ 0.037s] (458/601) iets syntax::tests::paths477 PASS [ 0.011s] (459/601) iets sys::winpath::tests::relative_and_rooted_paths_only_change_separator478 PASS [ 0.045s] (460/601) iets syntax::tests::numbers479 PASS [ 0.054s] (461/601) iets syntax::tests::line_col_counts_bytes480 PASS [ 0.280s] (462/601) iets source::scm::ledger::tests::a_change_of_the_ledger_is_a_change_of_the_working_tree481 PASS [ 0.054s] (463/601) iets syntax::tests::string_escapes_and_interpolation482 PASS [ 0.048s] (464/601) iets sys::winpath::tests::device_paths_are_not_shares_and_survive_a_round_trip483 PASS [ 0.022s] (465/601) iets trace::key::tests::relative_path_detection484 PASS [ 0.079s] (466/601) iets syntax::tests::operator_precedence485 PASS [ 0.076s] (467/601) iets sys::winpath::tests::a_drive_is_the_first_component486 PASS [ 0.042s] (468/601) iets sys::winpath::tests::the_evaluators_form_is_left_alone487 PASS [ 1.695s] (469/601) iets builtins::fetch::tests::the_name_on_a_value_that_is_not_a_tree_is_silent488 PASS [ 0.073s] (470/601) iets sys::winpath::tests::a_leading_double_slash_is_not_a_share489 PASS [ 0.078s] (471/601) iets syntax::tests::the_error_reported_is_the_one_nix_meets_first490 PASS [ 0.071s] (472/601) iets sys::winpath::tests::a_round_trip_is_stable491 PASS [ 0.073s] (473/601) iets sys::winpath::tests::a_relative_name_that_starts_with_unc_is_not_a_share492 PASS [ 1.310s] (474/601) iets eval::tests::fetchurl_checks_its_argument_like_nix493 PASS [ 0.078s] (475/601) iets syntax::tests::spans_cover_tokens494 PASS [ 0.080s] (476/601) iets sys::winpath::tests::a_bare_drive_is_not_its_root495 PASS [ 0.049s] (477/601) iets trace::store::tests::a_reader_of_one_generation_never_sees_the_next496 PASS [ 0.070s] (478/601) iets sys::winpath::tests::network_shares_sit_under_unc497 PASS [ 0.074s] (479/601) iets sys::winpath::tests::native_names_come_back498 PASS [ 0.078s] (480/601) iets sys::winpath::tests::dot_dot_stops_at_the_anchor499 PASS [ 0.078s] (481/601) iets sys::winpath::tests::mixed_separators_agree500 PASS [ 0.052s] (482/601) iets trace::store::tests::bytes_that_are_not_an_entry_are_bad_not_a_panic501 PASS [ 0.053s] (483/601) iets trace::tests::dedupe_keeps_conflicting_values502 PASS [ 0.086s] (484/601) iets sys::winpath::tests::forward_slashes_make_a_share_too503 PASS [ 0.028s] (485/601) iets trace::tests::dump_fingerprint_matches_the_separate_walk504 PASS [ 0.022s] (486/601) iets treestore::pack::tests::a_pack_reads_back_what_was_written505 PASS [ 0.030s] (487/601) iets trace::watch::tests::only_the_paths_an_mtime_can_speak_for506 PASS [ 0.009s] (488/601) iets treestore::tests::a_tree_is_named_by_its_nar_hash507 PASS [ 0.040s] (489/601) iets trace::tests::only_a_named_query_is_an_observation508 PASS [ 1.327s] (490/601) iets eval::tests::reading_a_derivation_output_is_unsupported509 PASS [ 0.071s] (491/601) iets trace::store::tests::one_rename_publishes_every_part510 PASS [ 0.082s] (492/601) iets trace::key::tests::key_is_order_and_value_sensitive511 PASS [ 0.022s] (493/601) iets treestore::tests::a_staged_directory_goes_when_it_is_dropped512 PASS [ 0.052s] (494/601) iets trace::wire::tests::drvs_sources_roots_roundtrip513 PASS [ 0.059s] (495/601) iets trace::validate::tests::file_touch_refreshes_edit_misses514 PASS [ 0.046s] (496/601) iets treestore::pack::tests::a_reader_sees_a_pack_written_after_it_listed515 PASS [ 0.045s] (497/601) iets treestore::pack::tests::an_empty_writer_leaves_no_file516 PASS [ 0.040s] (498/601) iets treestore::tests::a_stored_input_reads_back_and_a_wrong_hash_is_refused517 PASS [ 0.066s] (499/601) iets trace::validate::tests::a_copy_in_place_that_keeps_the_stat_still_misses518 PASS [ 0.013s] (500/601) iets::aterm_crosscheck masked_and_unmasked_hashes_differ_once_filled519 PASS [ 0.074s] (501/601) iets trace::validate::dir_hash_tests::dir_hash_agrees_with_dir_listing_hash520 PASS [ 0.058s] (502/601) iets treestore::pack::tests::a_set_finds_objects_across_packs_and_drops_a_broken_one521 PASS [ 1.772s] (503/601) iets builtins::fetch::tests::the_first_read_of_a_tree_gives_its_finding522 PASS [ 0.078s] (504/601) iets trace::tests::fingerprint_changes_with_content_size_and_seen_entries523 PASS [ 0.077s] (505/601) iets treestore::pack::tests::a_changed_index_byte_is_not_a_pack524 FAIL [ 0.039s] (506/601) iets trace::validate::tests::what_a_native_path_records_validates525 stdout ---526527 running 1 test528 test trace::validate::tests::what_a_native_path_records_validates ... FAILED529530 failures:531532 failures:533 trace::validate::tests::what_a_native_path_records_validates534535 test result: FAILED. 0 passed; 1 failed; 0 ignored; 0 measured; 540 filtered out; finished in 0.02s536 537 stderr ---538539 thread 'trace::validate::tests::what_a_native_path_records_validates' (2007) panicked at src/trace/validate.rs:351:9:540 assertion failed: validate(&mut obs, 2).is_err()541 note: run with `RUST_BACKTRACE=1` environment variable to display a backtrace542543 Cancelling due to test failure: 47 tests still running544 PASS [ 0.024s] (507/601) iets::aterm_crosscheck upstream_bad_drvs_are_rejected545 PASS [ 0.068s] (508/601) iets treestore::tests::a_flat_file_is_named_by_the_hash_of_its_bytes546 PASS [ 0.049s] (509/601) iets::aterm_crosscheck fixed_output_inputs_hide_their_provenance547 PASS [ 0.046s] (510/601) iets::aterm_crosscheck floating_ca_defers_itself_and_downstream548 PASS [ 0.072s] (511/601) iets treestore::pack::tests::collect_removes_dead_packs_and_compacts_mostly_dead_ones549 PASS [ 0.059s] (512/601) iets treestore::tests::collect_keeps_what_an_entry_names550 PASS [ 0.053s] (513/601) iets::aterm_crosscheck bytes_that_are_not_utf8_roundtrip551 PASS [ 0.092s] (514/601) iets trace::wire::tests::readset_roundtrip552 PASS [ 0.055s] (515/601) iets treestore::tests::two_inputs_share_their_common_files553 PASS [ 0.047s] (516/601) iets::aterm_crosscheck harmonia_cases_roundtrip554 PASS [ 0.055s] (517/601) iets::aterm_crosscheck fixed_output_path_is_recomputed_not_trusted555 PASS [ 0.096s] (518/601) iets trace::validate::tests::dir_stat_env_checks556 PASS [ 0.035s] (519/601) iets::aterm_crosscheck upstream_drvs_roundtrip_byte_exact557 PASS [ 0.048s] (520/601) iets::aterm_crosscheck malformed_aterm_is_an_error558 PASS [ 0.035s] (521/601) iets::aterm_crosscheck upstream_input_addressed_paths_recompute559 PASS [ 1.390s] (522/601) iets eval::tests::scoping560 PASS [ 0.027s] (523/601) iets::aterm_crosscheck upstream_invariants_ca_floating_dependency561 PASS [ 0.031s] (524/601) iets::cache_hygiene a_corrupt_entry_is_dropped_and_a_corrupt_store_is_wiped562 PASS [ 0.034s] (525/601) iets::aterm_crosscheck upstream_invariants_fill_in_deferred563 PASS [ 0.093s] (526/601) iets treestore::tests::a_put_after_a_collection_brings_its_own_objects564 PASS [ 0.056s] (527/601) iets::aterm_crosscheck upstream_bench_drvs_parse_and_reprint_stably565 PASS [ 0.042s] (528/601) iets::cache_hygiene a_changed_byte_or_a_copied_entry_is_a_miss566 PASS [ 0.043s] (529/601) iets::aterm_crosscheck upstream_invariants_input_addressed_kept_or_rejected567 PASS [ 0.423s] (530/601) iets source::scm::ledger::tests::the_metadata_has_the_mark_of_its_tree568 PASS [ 0.156s] (531/601) iets trace::validate::tests::the_lowest_failing_observation_is_the_one_reported569 PASS [ 0.476s] (532/601) iets source::scm::ledger::tests::the_tracked_files_and_the_metadata_are_the_tree570 PASS [ 0.628s] (533/601) iets session::tests::a_parallel_run_releases_its_session571 PASS [ 1.650s] (534/601) iets eval::tests::arithmetic_and_strings572 PASS [ 0.323s] (535/601) iets syntax::tests::lang_corpus573 PASS [ 0.656s] (536/601) iets session::tests::a_value_used_after_release_is_loud574 PASS [ 0.302s] (537/601) iets trace::tests::dedupe_of_many_repeats_is_linear575 PASS [ 2.060s] (538/601) iets builtins::fetch::tests::a_read_that_is_not_a_selection_has_no_site576 PASS [ 0.938s] (539/601) iets parallel::thunk::tests::many_fibers_force_one_shared_graph577 PASS [ 2.094s] (540/601) iets builtins::fetch::tests::the_tree_decides_the_level578 PASS [ 2.101s] (541/601) iets builtins::fetch::tests::a_read_of_the_count_is_one_finding_for_each_tree579 PASS [ 0.358s] (542/601) iets::cache_hygiene a_killed_writer_leaves_the_store_usable580 PASS [ 1.795s] (543/601) iets eval::tests::laziness_and_recursion581 PASS [ 2.231s] (544/601) iets api::run::tests::the_counters_cover_the_helper_fibers582 PASS [ 2.232s] (545/601) iets api::value::tests::scalars583 PASS [ 0.918s] (546/601) iets session::tests::a_released_session_leaves_the_other_alone584 PASS [ 2.102s] (547/601) iets eval::tests::attrs_and_lists585 PASS [ 1.900s] (548/601) iets runtime::value::alloc_tests::a_full_string_table_records_no_more_but_still_shares586 PASS [ 4.689s] (549/601) iets api::run::tests::helper_fibers_read_the_ir_cache587 PASS [ 4.810s] (550/601) iets builtins::fetch::tests::a_selection_of_the_count_is_the_site588 PASS [ 8.753s] (551/601) iets eval::tests::pure_eval_answers_like_nix589 PASS [ 22.895s] (552/601) iets syntax::tests::deep_nesting_ends_with_an_error590 PASS [ 50.344s] (553/601) iets runtime::value::tests::union_iteration_merges_like_a_fold591------------592 Summary [ 51.688s] 553/601 tests run: 552 passed, 1 failed, 5 skipped593 FAIL [ 0.039s] (506/601) iets trace::validate::tests::what_a_native_path_records_validates594warning: 48/601 tests were not run due to test failure (run with --no-fail-fast to run all tests, or run with --max-fail)595error: test run failed