nixbot

builds

failed iets-nextest-0.1.0 checks.x86_64-linux.test · build #243 · raw

unpackPhase
1unpacking source archive /nix/store/d3ikfbvg48jwdrvpx3y47ix6ymh0l3py-source2source root is source
patchPhase
3Executing configureCargoCommonVars4decompressing cargo artifacts from /nix/store/4ag17s7r3x70qan6yhkvb308lflc1jrh-iets-deps-0.1.0/target.tar.zst to target
configurePhase
5will append /build/source/.cargo-home/config.toml with contents of /nix/store/a8si5lqcnsxaa7nv2zfpl0vi6iqck9mw-vendor-cargo-deps/config.toml6default configurePhase, nothing to do
buildPhase
7+++ command cargo --version8cargo 1.98.0 (797e8a9bc 2026-08-05)9+++ command cargo nextest --version10cargo-nextest 0.9.14611release: 0.9.14612host: x86_64-unknown-linux-gnu
checkPhase
13+++ command cargo nextest run --cargo-profile dev14 Compiling iets v0.1.0 (/build/source)15 Finished `dev` profile [unoptimized + debuginfo] target(s) in 1m 09s16------------17 Nextest run ID e36c23ca-b415-45ce-9ae0-f73a0ff1c72a with nextest profile: default18 Starting 616 tests across 14 binaries (5 tests skipped)19 PASS [ 0.016s] ( 1/616) iets build::render::tests::a_failure_after_the_activity_ended_never_claims_a_success20 PASS [ 0.040s] ( 2/616) iets api::drvshow::tests::a_multi_output_derivation21 PASS [ 0.037s] ( 3/616) iets api::drvshow::tests::floats_take_nlohmanns_form22 PASS [ 0.038s] ( 4/616) iets api::fetch::tests::only_a_fixed_output_drv_can_be_prefetched23 PASS [ 0.038s] ( 5/616) iets api::fetch::tests::the_fake_hash_moves_the_output_and_the_drv24 PASS [ 0.032s] ( 6/616) iets build::executor::tests::one_place_declaring_nothing_takes_everything25 PASS [ 0.022s] ( 7/616) iets build::fixhash::tests::one_match_is_rewritten_in_its_own_spelling26 PASS [ 0.029s] ( 8/616) iets build::fixhash::tests::two_matches_are_left_alone27 PASS [ 0.052s] ( 9/616) iets api::drvshow::tests::pretty_matches_serde_json28 PASS [ 0.030s] ( 10/616) iets build::render::tests::a_build_the_backend_saw_succeed_is_verdicted_at_once29 PASS [ 0.047s] ( 11/616) iets build::executor::tests::a_feature_the_place_lacks_rules_it_out30 PASS [ 0.047s] ( 12/616) iets build::executor::tests::no_place_at_all_is_a_usage_error31 PASS [ 0.047s] ( 13/616) iets build::executor::tests::a_declared_system_filters32 PASS [ 0.049s] ( 14/616) iets api::installable::tests::the_name_a_program_takes_from_a_derivation_name33 PASS [ 0.050s] ( 15/616) iets api::drvshow::tests::a_non_canonical_structured_attrs_text_is_renormalised34 PASS [ 0.051s] ( 16/616) iets api::drvshow::tests::inputs_and_structured_attrs35 PASS [ 0.014s] ( 17/616) iets build::render::tests::a_build_log_never_reports_a_mismatch36 PASS [ 0.053s] ( 18/616) iets build::render::tests::a_daemon_failure_message_decides_the_verdict37 PASS [ 0.051s] ( 19/616) iets build::executor::tests::the_first_place_that_takes_it_wins38 PASS [ 0.042s] ( 20/616) iets build::fixhash::tests::a_longer_hash_is_not_a_match39 PASS [ 0.045s] ( 21/616) iets build::fanout::tests::dependencies_run_first40 PASS [ 0.066s] ( 22/616) iets api::drvshow::tests::a_fixed_output_shows_its_content_address_and_no_path41 PASS [ 0.043s] ( 23/616) iets build::render::tests::a_failure_shows_a_short_extract42 PASS [ 0.084s] ( 24/616) iets build::backend::tests::output_specs43 PASS [ 0.084s] ( 25/616) iets build::executor::tests::an_unsupported_url_says_what_is_expected44 PASS [ 0.081s] ( 26/616) iets build::event::tests::durations45 PASS [ 0.081s] ( 27/616) iets build::backend::tests::the_timings_report_with_every_line46 PASS [ 0.088s] ( 28/616) iets build::executor::tests::a_refusal_names_every_place_and_what_it_declared47 PASS [ 0.082s] ( 29/616) iets argv::tests::every_byte_round_trips48 PASS [ 0.087s] ( 30/616) iets build::backend::tests::base_names_drop_the_store_dir49 PASS [ 0.053s] ( 31/616) iets build::render::tests::an_unfolded_success_ends_with_its_verdict50 PASS [ 0.090s] ( 32/616) iets api::installable::tests::default_and_fragment_attr_paths51 PASS [ 0.095s] ( 33/616) iets build::fanout::tests::a_failed_dependency_blocks_its_dependants52 PASS [ 0.090s] ( 34/616) iets build::render::tests::a_long_attribute_keeps_its_ends53 PASS [ 0.044s] ( 35/616) iets build::tests::a_target_with_no_verdict_fails54 PASS [ 0.049s] ( 36/616) iets build::render::tests::the_status_line_takes_the_colours_of_the_rows_above55 PASS [ 0.045s] ( 37/616) iets builtins::derivation::tests::a_dynamic_output_renders_the_placeholder_nix_renders56 PASS [ 0.046s] ( 38/616) iets build::tests::targets_become_jobs57 PASS [ 0.103s] ( 39/616) iets build::render::tests::a_stalled_build_that_fails_still_shows_its_cause58 PASS [ 0.044s] ( 40/616) iets builtins::fetch_git::tests::a_working_tree_is_a_file_url_of_an_absolute_path59 PASS [ 0.047s] ( 41/616) iets build::render::tests::drv_paths_of_a_failure_message60 PASS [ 0.045s] ( 42/616) iets build::tests::hash_stripping61 PASS [ 0.103s] ( 43/616) iets build::render::tests::an_owned_build_is_verdicted_once_by_its_op62 PASS [ 0.047s] ( 44/616) iets build::render::tests::ci_folds_a_success_and_never_a_failure63 PASS [ 0.047s] ( 45/616) iets build::render::tests::tty_keeps_successful_logs_off_the_screen64 PASS [ 0.047s] ( 46/616) iets build::render::tests::heartbeat_names_running_builds65 PASS [ 0.049s] ( 47/616) iets build::render::tests::the_live_region_spins_and_counts66 PASS [ 0.048s] ( 48/616) iets builtins::derivation::tests::the_two_placeholders_are_not_the_same67 PASS [ 0.054s] ( 49/616) iets build::render::tests::the_summary_follows_more_than_one_build68 PASS [ 0.146s] ( 50/616) iets build::fanout::tests::at_most_limit_builds_run_at_once69 PASS [ 0.059s] ( 51/616) iets build::render::tests::one_build_needs_no_summary70 PASS [ 0.060s] ( 52/616) iets builtins::store_hooks::tests::a_relative_path_inside_an_entry_joins_once71 PASS [ 0.058s] ( 53/616) iets builtins::fetch_git::tests::only_a_plain_rev_or_ref_is_read_by_iets72 PASS [ 0.063s] ( 54/616) iets build::render::tests::logs_of_two_builds_do_not_interleave73 PASS [ 0.095s] ( 55/616) iets build::tests::a_fan_out_backend_keeps_the_cap_and_the_log_blocks74 PASS [ 0.041s] ( 56/616) iets cachefs::tests::garbled_stamp_wipes_the_store75 PASS [ 0.037s] ( 57/616) iets cachefs::tests::sweep_ages_a_root_by_its_link_not_by_what_it_names76 PASS [ 0.062s] ( 58/616) iets builtins::text::regex::tests::size_limit77 PASS [ 0.061s] ( 59/616) iets cachefs::tests::a_wipe_of_the_ir_cache_walks_its_shards78 PASS [ 0.082s] ( 60/616) iets builtins::text::fromtoml::tests::inline_tables_stay_on_one_line79 PASS [ 0.065s] ( 61/616) iets builtins::text::regex::tests::names80 PASS [ 0.053s] ( 62/616) iets cachefs::tests::sweep_drops_old_entries_and_keeps_young_ones81 PASS [ 0.072s] ( 63/616) iets builtins::text::fromtoml::tests::new_escapes_are_refused82 PASS [ 0.066s] ( 64/616) iets cachefs::tests::a_directory_that_is_not_ours_is_refused_untouched83 PASS [ 0.068s] ( 65/616) iets cachefs::tests::a_sweep_runs_once_per_interval84 PASS [ 0.098s] ( 66/616) iets cachefs::tests::a_stamp_in_the_future_is_due85 PASS [ 0.026s] ( 67/616) iets cli::build::tests::installables_are_sorted_without_repeats86 PASS [ 0.026s] ( 68/616) iets cli::classic::shell::tests::declares_for_every_bash_shaped_value87 PASS [ 0.099s] ( 69/616) iets cachefs::tests::a_store_without_a_version_file_is_wiped_once88 PASS [ 0.055s] ( 70/616) iets cli::build::tests::a_failed_build_reports_itself89 PASS [ 0.056s] ( 71/616) iets cli::build::tests::a_path_on_stdout_is_silent90 PASS [ 0.056s] ( 72/616) iets cachefs::tests::version_mismatch_wipes_the_store91 PASS [ 0.102s] ( 73/616) iets cachefs::tests::a_touch_inside_the_interval_writes_nothing92 PASS [ 0.103s] ( 74/616) iets cachefs::tests::an_input_store_of_the_spool_layout_is_wiped93 PASS [ 0.033s] ( 75/616) iets cli::build::tests::no_build_result_is_named94 PASS [ 0.104s] ( 76/616) iets cachefs::tests::an_empty_directory_is_ours_to_take95 PASS [ 0.107s] ( 77/616) iets cachefs::tests::a_wait_lock_waits_for_its_holder96 PASS [ 0.033s] ( 78/616) iets cli::build::tests::out_links_are_named_as_nix_build_names_them97 PASS [ 0.032s] ( 79/616) iets cli::build::tests::an_out_flag_that_matches_nothing_is_named98 PASS [ 0.109s] ( 80/616) iets cachefs::tests::a_wipe_keeps_what_iets_did_not_create99 PASS [ 0.035s] ( 81/616) iets cli::build::tests::roots_come_back_in_command_order_once100 PASS [ 0.095s] ( 82/616) iets cachefs::tests::sweep_walks_the_shards_of_the_ir_cache101 PASS [ 0.023s] ( 83/616) iets cli::classic::shell::tests::outputs_become_placeholders102 PASS [ 0.021s] ( 84/616) iets cli::classic::tests::a_flag_with_no_effect_is_noted_and_one_that_holds_is_not103 PASS [ 0.026s] ( 85/616) iets cli::complete::tests::a_flag_value_completes_by_its_placeholder104 PASS [ 0.023s] ( 86/616) iets cli::complete::tests::a_positional_is_left_to_the_shell105 PASS [ 0.023s] ( 87/616) iets cli::complete::tests::flags_complete_after_a_dash106 PASS [ 0.026s] ( 88/616) iets cli::complete::tests::commands_complete_with_their_summary107 PASS [ 0.021s] ( 89/616) iets cli::docs::tests::topics_resolve_bare_and_qualified108 PASS [ 0.054s] ( 90/616) iets cli::build::tests::no_outcome_at_all_is_named109 PASS [ 0.023s] ( 91/616) iets cli::docs::tests::every_embedded_page_has_a_heading110 PASS [ 0.033s] ( 92/616) iets cli::classic::shell::tests::sh_var_names111 PASS [ 0.060s] ( 93/616) iets cli::build::tests::a_success_with_no_output_path_is_named112 PASS [ 0.029s] ( 94/616) iets cli::help::tests::a_mistyped_command_is_suggested113 PASS [ 0.037s] ( 95/616) iets cli::help::tests::suggestions_come_from_the_help114 PASS [ 0.025s] ( 96/616) iets cli::plumbing::tests::a_file_url_needs_one_slash_not_three115 PASS [ 0.040s] ( 97/616) iets cli::docs::tests::the_topic_list_fits_80_columns116 PASS [ 0.039s] ( 98/616) iets cli::diff::tests::a_name_ends_at_the_first_dash_before_a_digit117 PASS [ 0.044s] ( 99/616) iets cli::complete::tests::every_script_asks_the_binary118 PASS [ 0.038s] (100/616) iets cli::help::tests::messages119 PASS [ 0.153s] (101/616) iets cachefs::tests::a_lock_that_cannot_be_opened_is_not_a_busy_lock120 PASS [ 0.029s] (102/616) iets cli::render::tests::sizes_render_as_nix_renders_them121 PASS [ 0.028s] (103/616) iets cli::search::tests::merged_highlights122 PASS [ 0.034s] (104/616) iets cli::search::tests::drv_names123 PASS [ 0.034s] (105/616) iets cli::render::text::tests::a_long_value_shows_the_lines_that_differ124 PASS [ 0.033s] (106/616) iets cli::search::tests::index_round_trip125 PASS [ 0.060s] (107/616) iets cli::help::tests::help_fits_80_columns126 PASS [ 0.062s] (108/616) iets cli::complete::tests::subcommands_and_topics127 PASS [ 0.047s] (109/616) iets cli::plumbing::tests::a_url_is_the_positional_fetch_takes_itself128 PASS [ 0.024s] (110/616) iets config::tests::an_alias_is_its_setting129 PASS [ 0.027s] (111/616) iets config::tests::a_classic_name_leaves_an_unimplemented_setting_to_nix130 PASS [ 0.028s] (112/616) iets config::tests::bad_typed_values_error_where_they_are_set131 PASS [ 0.030s] (113/616) iets config::tests::extra_appends_to_list_settings_only132 PASS [ 0.024s] (114/616) iets config::tests::include_chain133 PASS [ 0.031s] (115/616) iets config::tests::bool_spellings134 PASS [ 0.033s] (116/616) iets config::tests::a_setting_with_no_effect_is_noted135 PASS [ 0.023s] (117/616) iets config::tests::syntax_errors136 PASS [ 0.028s] (118/616) iets config::tests::option_nix_path_replaces_nix_path_and_extra_adds137 PASS [ 0.032s] (119/616) iets config::tests::missing_include_errors_and_bang_include_does_not138 PASS [ 0.045s] (120/616) iets config::tests::basic_syntax139 PASS [ 0.031s] (121/616) iets config::tests::overrides_win_over_files140 PASS [ 0.150s] (122/616) iets cachefs::tests::the_writer_lock_excludes_one_holder_at_a_time141 PASS [ 0.021s] (123/616) iets config::tests::unknown_settings_are_kept142 PASS [ 0.025s] (124/616) iets config::tests::the_daemon_gets_the_store_settings_set_outside_the_system_file143 PASS [ 0.039s] (125/616) iets config::tests::max_jobs_auto_is_the_cpu_count144 PASS [ 0.032s] (126/616) iets config::tests::user_conf_files_are_in_precedence_order145 PASS [ 0.032s] (127/616) iets devenv::tests::json_roundtrip_and_bash_forms146 PASS [ 0.032s] (128/616) iets devenv::tests::get_env_sh_store_path_matches_nix147 PASS [ 0.024s] (129/616) iets devenv::tests::rewrites_apply_in_map_order_to_every_occurrence148 PASS [ 0.037s] (130/616) iets devenv::tests::cached_result_roundtrip149 PASS [ 0.021s] (131/616) iets display::tests::a_frame_is_one_synchronized_write150 PASS [ 0.034s] (132/616) iets devenv::tests::output_checks_are_erased_only_when_present151 PASS [ 0.044s] (133/616) iets config::tests::typed_getters_and_defaults152 PASS [ 0.029s] (134/616) iets devenv::tests::shell_escaping153 PASS [ 0.025s] (135/616) iets display::tests::a_full_width_line_keeps_its_last_column154 PASS [ 0.026s] (136/616) iets display::tests::a_resize_burst_never_erases155 PASS [ 0.027s] (137/616) iets display::tests::a_resize_keeps_one_region156 PASS [ 0.037s] (138/616) iets devenv::tests::rc_script_rewrites_outputs_and_writes_attrs157 PASS [ 0.029s] (139/616) iets display::tests::a_region_taller_than_the_screen_is_clamped158 PASS [ 0.021s] (140/616) iets display::tests::colour_and_width159 PASS [ 0.050s] (141/616) iets devenv::tests::non_bash_builder_is_refused160 PASS [ 0.060s] (142/616) iets config::tests::the_setting_tables_name_nix_settings161 PASS [ 0.023s] (143/616) iets display::tests::growth_does_not_eat_output162 PASS [ 0.041s] (144/616) iets display::tests::a_region_that_grows_and_shrinks_loses_no_output163 PASS [ 0.025s] (145/616) iets display::tests::output_scrolls_and_the_region_stays_at_the_bottom164 PASS [ 0.027s] (146/616) iets display::tests::the_region_comes_down_on_close165 PASS [ 0.026s] (147/616) iets display::tests::the_region_keeps_its_rows_until_a_smaller_size_lasts166 PASS [ 0.052s] (148/616) iets display::tests::output_starts_at_the_origin167 PASS [ 0.139s] (149/616) iets display::tests::wrapped_output_does_not_corrupt_the_region168 PASS [ 0.706s] (150/616) iets api::value::tests::force_deep_forces_the_whole_tree169 PASS [ 0.360s] (151/616) iets eval::tests::fetch_mercurial_names_a_way_out170 PASS [ 0.634s] (152/616) iets builtins::fetch::tests::nix_sees_no_mark171 PASS [ 0.807s] (153/616) iets api::value::tests::attrs_by_name_and_index172 PASS [ 0.677s] (154/616) iets builtins::text::regex::tests::long_inputs_do_not_recurse173 PASS [ 0.823s] (155/616) iets api::run::tests::a_fiber_template_carries_the_configuration174 PASS [ 0.788s] (156/616) iets builtins::store_hooks::tests::virtual_tree_reads_go_to_the_local_files175 PASS [ 0.558s] (157/616) iets eval::tests::an_invalid_regex_fails_before_the_string_is_forced176 PASS [ 0.919s] (158/616) iets api::value::tests::wrong_type_is_an_error177 PASS [ 0.029s] (159/616) iets fetch::http::tests::credentials_in_the_url_are_sent_and_never_printed178 PASS [ 0.956s] (160/616) iets api::value::tests::lists179 PASS [ 0.040s] (161/616) iets fetch::http::tests::credentials_stay_on_the_first_origin180 PASS [ 0.971s] (162/616) iets api::value::tests::apply_is_lazy181 PASS [ 0.622s] (163/616) iets eval::tests::a_function_select_is_a_fresh_slot_when_its_subject_is_forced182 PASS [ 0.055s] (164/616) iets fetch::http::tests::magic_bytes183 PASS [ 0.037s] (165/616) iets fetch::http::tests::redirects_resolve184 PASS [ 0.045s] (166/616) iets fetch::http::tests::redirects_keep_credentials_only_on_the_same_origin185 PASS [ 1.027s] (167/616) iets api::value::tests::thunk_reads_as_thunk186 PASS [ 0.943s] (168/616) iets builtins::fetch::tests::an_entry_of_the_compiled_file_cache_keeps_the_site187 PASS [ 0.767s] (169/616) iets compile::cache::tests::a_malformed_entry_is_a_miss_and_never_a_crash188 PASS [ 0.092s] (170/616) iets fetch::http::tests::file_urls_name_a_local_path189 PASS [ 0.042s] (171/616) iets fetch::roots::tests::nix_ssl_cert_file_wins_over_ssl_cert_file_and_the_platform190 PASS [ 0.070s] (172/616) iets fetch::http::tests::trailing_bytes_and_a_second_layer191 PASS [ 0.047s] (173/616) iets fetch::roots::tests::no_bundle_anywhere_gives_the_compiled_in_set192 PASS [ 0.083s] (174/616) iets fetch::http::tests::urls_split193 PASS [ 0.018s] (175/616) iets fetch::roots::tests::the_platform_store_wins_over_the_compiled_in_set194 PASS [ 0.074s] (176/616) iets fetch::roots::tests::an_empty_nix_ssl_cert_file_hides_ssl_cert_file195 PASS [ 0.032s] (177/616) iets fetch::spool::tests::a_changed_index_byte_is_a_miss196 PASS [ 0.769s] (178/616) iets compile::cache::tests::a_changed_byte_of_a_stored_entry_is_a_miss197 PASS [ 0.280s] (179/616) iets fetch::http::tests::downloads_stop_at_the_size_limit198 PASS [ 1.227s] (180/616) iets api::value::tests::calling_a_function199 PASS [ 1.129s] (181/616) iets builtins::fetch::tests::the_mark_follows_the_string_like_store_context200 PASS [ 0.953s] (182/616) iets compile::cache::tests::nesting_past_the_cap_misses201 PASS [ 0.420s] (183/616) iets eval::tests::update_forces_the_right_operand_first202 PASS [ 0.211s] (184/616) iets fetch::roots::tests::a_named_file_that_is_missing_or_empty_is_an_error203 PASS [ 0.015s] (185/616) iets fetch::spool::tests::an_empty_archive_is_an_empty_directory204 PASS [ 0.024s] (186/616) iets fetch::spool::tests::a_sparse_member_counts_against_the_size_limit205 PASS [ 0.020s] (187/616) iets fetch::spool::tests::the_scratch_file_never_follows_a_symlink206 PASS [ 0.031s] (188/616) iets fetch::spool::tests::a_stored_tree_dumps_the_spools_nar207 PASS [ 0.903s] (189/616) iets eval::tests::nix_eq_forces_what_the_shortcut_skips208 PASS [ 1.288s] (190/616) iets api::value::tests::missing_attribute209 PASS [ 0.027s] (191/616) iets fetch::unpack::tests::an_unsupported_member_type_is_an_error210 PASS [ 0.028s] (192/616) iets fetch::unpack::tests::a_repeated_member_keeps_the_last_copy211 PASS [ 0.031s] (193/616) iets fetch::spool::tests::nar_hash_of_the_fixture212 PASS [ 0.033s] (194/616) iets fetch::spool::tests::spool_matches_the_tree_on_the_top_level213 PASS [ 0.013s] (195/616) iets fetch::unpack::tests::member_names_are_made_relative_and_cannot_escape214 PASS [ 0.034s] (196/616) iets fetch::spool::tests::the_errors_match215 PASS [ 0.022s] (197/616) iets fetch::unpack::tests::keeps_the_root_when_it_is_not_a_single_directory216 PASS [ 0.016s] (198/616) iets flake::flakeref::tests::git_urls_are_fixed_like_nix217 PASS [ 0.018s] (199/616) iets fetch::unpack::tests::strips_one_leading_component218 PASS [ 0.011s] (200/616) iets flake::flakeref::tests::refuses_a_github_ref_named_twice219 PASS [ 0.041s] (201/616) iets fetch::spool::tests::archives_the_git_sink_accepts220 PASS [ 0.020s] (202/616) iets fetch::unpack::tests::nar_hash_of_the_fixture221 PASS [ 0.017s] (203/616) iets flake::flakeref::tests::parses_the_kept_schemes222 PASS [ 0.012s] (204/616) iets flake::tests::attr_paths223 PASS [ 0.027s] (205/616) iets flake::flakeref::tests::errors_and_unsupported224 PASS [ 0.019s] (206/616) iets flake::flakeref::tests::to_string_from_attrs225 PASS [ 0.014s] (207/616) iets jobs::constituents::tests::fnmatch_basics226 PASS [ 0.024s] (208/616) iets flake::flakeref::tests::round_trips227 PASS [ 1.219s] (209/616) iets builtins::fetch::tests::a_read_that_is_not_a_selection_has_no_site228 PASS [ 0.015s] (210/616) iets jobs::constituents::tests::topo_sort_orders_and_detects_cycles229 PASS [ 0.026s] (211/616) iets flake::tests::a_pinned_checkout_is_its_revision230 PASS [ 0.019s] (212/616) iets flake::tests::refs_resolve_against_cwd_and_home231 PASS [ 0.019s] (213/616) iets jobs::line::tests::error_line_round_trip232 PASS [ 0.011s] (214/616) iets lint::tests::keys233 PASS [ 0.017s] (215/616) iets lint::allow::tests::comment_names234 PASS [ 0.025s] (216/616) iets jobs::line::tests::split_and_round_trip235 PASS [ 0.069s] (217/616) iets fetch::spool::tests::pax_sparse_members_are_expanded236 PASS [ 0.969s] (218/616) iets eval::tests::derivation_wrapper_exists237 PASS [ 0.025s] (219/616) iets jobs::line::tests::stats_survive_the_collector238 PASS [ 0.015s] (220/616) iets lint::site::tests::a_literal_lint_of_nix_has_an_edit239 PASS [ 0.012s] (221/616) iets lint::tests::names_are_unique_kebab_case240 PASS [ 0.014s] (222/616) iets lint::site::tests::the_span_is_the_innermost_node_of_the_kind_of_the_lint241 PASS [ 0.021s] (223/616) iets lint::allow::tests::lines242 PASS [ 0.015s] (224/616) iets lint::tests::scope_and_inputs243 PASS [ 0.019s] (225/616) iets lint::tests::an_unknown_name_is_a_warning_in_a_file_and_an_error_in_a_flag244 PASS [ 0.019s] (226/616) iets lint::tests::selectors_and_order245 PASS [ 0.011s] (227/616) iets log::tests::a_hash_mismatch_names_the_hash_it_got246 PASS [ 0.010s] (228/616) iets log::tests::a_region_stays_under_the_output_that_scrolls_above_it247 PASS [ 0.102s] (229/616) iets fetch::spool::tests::a_hard_link_never_replaces_a_member248 PASS [ 0.010s] (230/616) iets log::tests::a_resolved_copy_reports_its_mismatch_as_a_line249 PASS [ 0.017s] (231/616) iets log::tests::a_mismatch_reason_keeps_both_hashes250 PASS [ 0.020s] (232/616) iets lint::tests::toml_table251 PASS [ 0.019s] (233/616) iets log::tests::a_pause_takes_the_view_down_for_a_prompt252 PASS [ 0.016s] (234/616) iets log::tests::a_resize_redraws_the_region_once253 PASS [ 0.022s] (235/616) iets log::tests::a_forged_mismatch_is_dropped254 PASS [ 0.011s] (236/616) iets log::tests::a_session_id_is_a_uuid_v7255 PASS [ 1.089s] (237/616) iets compile::cache::tests::a_changed_byte_never_makes_the_evaluator_read_past_its_env256 PASS [ 0.024s] (238/616) iets log::tests::a_fixed_hash_has_the_shape_of_a_finding_with_an_edit257 PASS [ 0.632s] (239/616) iets eval::tests::sets_compare_in_the_symbol_order_of_nix258 PASS [ 0.028s] (240/616) iets log::tests::a_coloured_error_is_an_error_record259 PASS [ 0.030s] (241/616) iets log::tests::a_half_line_waits_for_its_newline260 PASS [ 0.031s] (242/616) iets lint::tests::the_project_file_walk_stops_at_the_project_root261 PASS [ 0.014s] (243/616) iets log::tests::record_is_nix_log_ei_plus_code_and_hint262 PASS [ 0.037s] (244/616) iets lint::tests::specificity_inside_a_source_and_order_between_sources263 PASS [ 0.014s] (245/616) iets log::tests::escapes_are_filtered_the_way_nix_filters_them264 PASS [ 0.022s] (246/616) iets log::tests::activity_records_are_nix_json_logger_records265 PASS [ 0.020s] (247/616) iets log::tests::lint_warning_is_a_level_1_record266 PASS [ 0.018s] (248/616) iets log::tests::exit_status_flags_combine_like_nix267 PASS [ 0.020s] (249/616) iets log::tests::text_shows_the_hint_of_an_unsupported_error268 PASS [ 0.017s] (250/616) iets log::tests::the_status_line_goes_under_the_region269 PASS [ 0.018s] (251/616) iets log::tests::without_a_terminal_output_is_plain270 PASS [ 0.117s] (252/616) iets fetch::spool::tests::spool_matches_the_tree271 PASS [ 0.023s] (253/616) iets log::tests::record_without_position272 PASS [ 1.286s] (254/616) iets builtins::fetch::tests::the_first_read_of_a_tree_gives_its_finding273 PASS [ 0.099s] (255/616) iets fetch::unpack::tests::modes_symlinks_and_empty_dirs274 PASS [ 0.034s] (256/616) iets nixbin::tests::every_iets_build_is_skipped275 PASS [ 1.050s] (257/616) iets eval::tests::derivation_keeps_env_and_args_that_are_not_utf8276 PASS [ 0.045s] (258/616) iets parallel::interner::tests::empty_name_misses_the_cache_sentinel277 PASS [ 0.111s] (259/616) iets jobs::tests::a_numeric_name_selects_an_attribute_under_a_set278 PASS [ 0.689s] (260/616) iets eval::tests::try_eval_and_errors279 PASS [ 0.062s] (261/616) iets nixbin::tests::farm_marker_is_found_through_two_hops280 PASS [ 0.066s] (262/616) iets log::tests::ansi_stripping281 PASS [ 0.931s] (263/616) iets eval::tests::reading_a_derivation_output_is_unsupported282 PASS [ 0.050s] (264/616) iets parallel::interner::tests::concurrent_intern_agrees283 PASS [ 0.008s] (265/616) iets profile::tests::a_frame_keeps_its_call_site_and_its_name284 PASS [ 0.011s] (266/616) iets progress::tests::a_download_inside_a_copy_is_part_of_the_copy285 PASS [ 0.069s] (267/616) iets parallel::deque::tests::lifo_owner_fifo_thief286 PASS [ 0.014s] (268/616) iets profile::tests::a_sample_is_taken_once_per_tick287 PASS [ 0.063s] (269/616) iets parallel::sched::tests::a_task_survives_packing_past_the_old_24_bit_start288 PASS [ 0.063s] (270/616) iets parallel::sched::tests::fan_out_from_main289 PASS [ 0.063s] (271/616) iets parallel::interner::tests::intern_is_stable_and_shared290 PASS [ 0.019s] (272/616) iets profile::tests::an_unwind_returns_to_a_depth291 PASS [ 0.015s] (273/616) iets progress::tests::a_transfer_that_does_not_move_says_so292 PASS [ 0.018s] (274/616) iets progress::tests::several_of_a_kind_are_counted293 PASS [ 0.025s] (275/616) iets profile::tests::a_weight_is_bytes_when_the_profile_asks_for_them294 PASS [ 0.011s] (276/616) iets project::tests::a_config_file_never_shrinks_the_root295 PASS [ 0.015s] (277/616) iets progress::tests::store_hashes_are_left_out296 PASS [ 0.072s] (278/616) iets parallel::sched::tests::main_parks_and_is_woken_by_helper297 PASS [ 0.029s] (279/616) iets progress::tests::a_log_hears_of_a_task_after_first_and_then_every_heartbeat298 PASS [ 0.084s] (280/616) iets parallel::fiber::tests::resume_yield_finish299 PASS [ 0.084s] (281/616) iets parallel::fiber::tests::reservation_is_capped_and_mmap_failure_is_an_error300 PASS [ 0.026s] (282/616) iets project::tests::a_working_tree_wins_over_a_file_marker_below_it301 PASS [ 0.092s] (283/616) iets parallel::fiber::tests::migrates_between_threads302 PASS [ 0.013s] (284/616) iets provenance::tests::locate_without_a_match_is_none303 PASS [ 0.017s] (285/616) iets provenance::tests::failed_line_names_the_attribute_and_the_position304 PASS [ 0.024s] (286/616) iets project::tests::each_marker_is_a_root305 PASS [ 0.022s] (287/616) iets provenance::tests::a_shared_position_is_left_off_the_started_line_only306 PASS [ 0.019s] (288/616) iets provenance::tests::an_input_file_is_labelled_by_its_lock_node307 PASS [ 0.100s] (289/616) iets parallel::fiber::tests::large_stack_use_and_release308 PASS [ 0.018s] (290/616) iets provenance::tests::rewrite_leaves_unknown_text_alone309 PASS [ 0.028s] (291/616) iets provenance::tests::locate_takes_the_longest_prefix310 PASS [ 0.019s] (292/616) iets remote::grpc::backend::tests::a_built_root_asks_nothing_below_it311 PASS [ 0.033s] (293/616) iets provenance::tests::a_path_followed_by_a_colour_escape_still_matches312 PASS [ 0.081s] (294/616) iets print::tests::float_formatting_edge_cases313 PASS [ 0.036s] (295/616) iets provenance::tests::a_tree_copied_from_a_store_tree_resolves_to_the_local_one314 PASS [ 0.017s] (296/616) iets remote::grpc::backend::tests::a_cold_store_is_asked_the_rest_in_one_call315 PASS [ 0.014s] (297/616) iets remote::grpc::build::tests::reschedules_back_off_past_a_dead_worker316 PASS [ 0.025s] (298/616) iets remote::grpc::backend::tests::a_built_input_stops_the_walk317 PASS [ 0.098s] (299/616) iets parallel::sched::tests::park_and_wake_across_workers318 PASS [ 0.021s] (300/616) iets remote::grpc::backend::tests::an_input_below_a_built_one_is_not_built319 PASS [ 0.042s] (301/616) iets project::tests::the_nearest_flake_wins_without_a_working_tree320 PASS [ 0.019s] (302/616) iets remote::grpc::build::tests::the_timings_report_with_every_line321 PASS [ 0.030s] (303/616) iets provenance::tests::rewrite_replaces_every_known_path_in_a_line322 PASS [ 0.020s] (304/616) iets remote::grpc::build::tests::required_features_come_from_the_env_or_structured_attrs323 PASS [ 0.025s] (305/616) iets remote::grpc::build::tests::a_local_upload_failure_beats_the_stream_ended_status324 PASS [ 0.024s] (306/616) iets remote::grpc::build::tests::a_self_reference_does_not_loop325 PASS [ 0.126s] (307/616) iets parallel::fiber::tests::a_freed_stack_frees_its_guard_entry326 PASS [ 0.020s] (308/616) iets remote::grpc::tests::percent_escapes_decode_in_values327 PASS [ 0.037s] (309/616) iets remote::grpc::drvwire::tests::an_unresolvable_input_output_is_an_error328 PASS [ 0.032s] (310/616) iets remote::grpc::health::tests::a_completed_build_clears_the_history329 PASS [ 0.037s] (311/616) iets remote::grpc::drvwire::tests::basic_derivation_matches_the_cxx_field_order330 PASS [ 0.041s] (312/616) iets remote::grpc::drvwire::tests::a_failure_keeps_its_message331 PASS [ 0.036s] (313/616) iets remote::grpc::drvwire::tests::build_result_round_trips_a_daemon_reply332 PASS [ 0.036s] (314/616) iets remote::grpc::drvwire::tests::path_info_round_trips333 PASS [ 0.028s] (315/616) iets remote::grpc::health::tests::an_unknown_address_is_usable334 PASS [ 0.028s] (316/616) iets remote::grpc::health::tests::a_passed_cooldown_lets_one_caller_through335 PASS [ 0.023s] (317/616) iets remote::grpc::tests::insecure_is_a_bare_flag_or_a_boolean336 PASS [ 0.028s] (318/616) iets remote::grpc::health::tests::one_address_does_not_refuse_another337 PASS [ 0.027s] (319/616) iets remote::grpc::tests::defaults_match_the_cxx_settings338 PASS [ 0.023s] (320/616) iets remote::grpc::tests::mtls_needs_both_halves339 PASS [ 1.152s] (321/616) iets eval::tests::arithmetic_and_strings340 PASS [ 0.026s] (322/616) iets remote::grpc::tests::a_token_needs_tls_and_unknown_parameters_are_errors341 PASS [ 0.138s] (323/616) iets parallel::thunk::tests::deadlocked_fibers_are_cancelled342 PASS [ 0.033s] (324/616) iets remote::grpc::health::tests::the_cooldown_grows_and_stops_at_30s343 PASS [ 0.033s] (325/616) iets remote::grpc::health::tests::two_bounces_refuse_it344 PASS [ 0.034s] (326/616) iets remote::grpc::tests::every_parameter_parses345 PASS [ 0.013s] (327/616) iets remote::plan::tests::a_held_input_answers_for_its_closure346 PASS [ 0.129s] (328/616) iets profile::tests::a_deep_stack_is_capped347 PASS [ 0.026s] (329/616) iets remote::worker::counts_tests::each_change_is_a_verdict_in_order348 PASS [ 0.057s] (330/616) iets remote::grpc::health::tests::one_bounce_does_not_refuse_an_address349 PASS [ 0.027s] (331/616) iets remote::worker::tests::a_status_over_a_byte_is_not_a_success350 PASS [ 0.179s] (332/616) iets parallel::deque::tests::concurrent_sum351 PASS [ 0.028s] (333/616) iets remote::plan::tests::a_cold_store_is_asked_the_rest_in_one_call352 PASS [ 0.027s] (334/616) iets remote::plan::tests::hash_source_matches_nar_hash353 PASS [ 0.071s] (335/616) iets remote::grpc::build::tests::topo_sort_puts_references_first354 PASS [ 0.044s] (336/616) iets remote::worker::wire::tests::framed_sink_frames_and_terminates355 PASS [ 0.066s] (337/616) iets runtime::heap::tests::release_tombstones_every_chunk356 PASS [ 0.079s] (338/616) iets remote::plan::tests::an_answered_root_is_not_asked_again357 PASS [ 0.073s] (339/616) iets remote::worker::wire::tests::replies_are_read_as_nix_reads_them358 PASS [ 0.083s] (340/616) iets remote::worker::tests::an_ssh_host_is_never_an_option359 PASS [ 0.083s] (341/616) iets remote::worker::tests::transport_from_url360 PASS [ 0.077s] (342/616) iets remote::worker::wire::tests::strings_are_padded361 PASS [ 0.095s] (343/616) iets remote::worker::counts_tests::a_repeated_update_claims_nothing362 PASS [ 0.095s] (344/616) iets remote::worker::tests::nix_sshopts_split_like_a_shell363 PASS [ 0.025s] (345/616) iets settings::tests::a_flag_carries_several_places_separated_by_a_semicolon364 PASS [ 0.102s] (346/616) iets remote::worker::tests::ssh_argv_puts_the_host_first365 PASS [ 0.030s] (347/616) iets settings::tests::a_missing_file_is_skipped_and_the_defaults_hold366 PASS [ 0.066s] (348/616) iets session::tests::two_sessions_share_no_state367 PASS [ 0.110s] (349/616) iets remote::plan::tests::memory_source_matches_dump_string368 PASS [ 0.025s] (350/616) iets settings::tests::builder_reads_all_three_forms369 PASS [ 0.083s] (351/616) iets runtime::value::layout::a_primop_pays_nothing_for_its_symbol370 PASS [ 0.109s] (352/616) iets remote::plan::tests::a_held_root_answers_for_its_closure371 PASS [ 0.025s] (353/616) iets settings::tests::a_wrong_type_names_the_key_and_the_file372 PASS [ 0.035s] (354/616) iets settings::tests::a_project_file_holds_lint_and_nothing_else373 PASS [ 0.103s] (355/616) iets runtime::value::alloc_tests::a_list_too_long_to_address_has_no_size374 PASS [ 0.035s] (356/616) iets settings::tests::a_settings_file_may_hold_lint_and_the_other_sources_may_not375 PASS [ 0.032s] (357/616) iets settings::tests::each_source_wins_over_the_one_before376 PASS [ 0.031s] (358/616) iets settings::tests::the_environment_wins_over_the_file377 PASS [ 0.014s] (359/616) iets source::local::tests::max_mtime_covers_root_and_children378 PASS [ 0.036s] (360/616) iets settings::tests::source_map_adds_up_and_every_other_key_replaces379 PASS [ 0.023s] (361/616) iets settings::tests::the_user_file_turns_purity_off380 PASS [ 0.020s] (362/616) iets settings::tests::unknown_key_names_the_file381 PASS [ 0.023s] (363/616) iets settings::tests::the_flag_leaves_the_argv382 PASS [ 0.018s] (364/616) iets source::lock::tests::declared_inputs_must_match_the_lock383 PASS [ 0.028s] (365/616) iets settings::tests::the_flag_pairs_are_kept_for_a_second_iets384 PASS [ 0.034s] (366/616) iets settings::tests::the_file_is_the_users385 PASS [ 0.031s] (367/616) iets source::local::tests::accepted_set_adds_parent_directories386 PASS [ 0.034s] (368/616) iets source::local::tests::only_a_content_addressed_store_path_names_its_content387 PASS [ 0.148s] (369/616) iets remote::worker::wire::tests::build_results_are_read_as_nix_reads_them388 PASS [ 0.123s] (370/616) iets runtime::value::alloc_tests::a_speculated_thunk_is_forced_but_not_demanded389 PASS [ 0.124s] (371/616) iets runtime::value::tests::union_lookup_agrees_with_iteration390 PASS [ 0.025s] (372/616) iets source::lock::tests::incomplete_locks_fail391 PASS [ 0.023s] (373/616) iets source::remote::tests::download_urls_match_the_fetchers392 PASS [ 0.024s] (374/616) iets source::remote::tests::only_the_archive_types_are_fetched_by_iets393 PASS [ 0.031s] (375/616) iets source::remote::tests::nix_literal_escapes394 PASS [ 0.031s] (376/616) iets source::remote::tests::access_tokens_match_the_longest_prefix395 PASS [ 0.036s] (377/616) iets source::remote::tests::a_leftover_is_not_a_valid_path396 PASS [ 0.971s] (378/616) iets eval::tests::scoping397 PASS [ 0.026s] (379/616) iets source::scm::git::tests::a_directory_in_a_repository_is_found398 PASS [ 0.040s] (380/616) iets source::lock::tests::empty_lock_has_no_inputs399 PASS [ 0.025s] (381/616) iets store::drv::tests::an_env_key_named_json_is_refused400 PASS [ 0.047s] (382/616) iets source::scm::ledger::tests::a_directory_in_a_working_tree_is_found401 PASS [ 0.023s] (383/616) iets store::drv::tests::fixed_output_from_scratch402 PASS [ 0.034s] (384/616) iets source::tests::dates403 PASS [ 0.033s] (385/616) iets store::drv::tests::a_dynamic_input_writes_the_versioned_aterm_and_parses_back404 PASS [ 0.029s] (386/616) iets store::drv::tests::input_addressed_multi_output_from_scratch405 PASS [ 0.026s] (387/616) iets store::drv::tests::input_drvs_hash_modulo_from_scratch406 PASS [ 1.714s] (388/616) iets api::run::tests::the_counters_cover_the_helper_fibers407 PASS [ 0.827s] (389/616) iets fetch::http::tests::a_transient_status_is_retried408 PASS [ 1.619s] (390/616) iets builtins::fetch::tests::a_read_of_the_count_is_one_finding_for_each_tree409 PASS [ 0.095s] (391/616) iets settings::tests::the_flag_value_is_toml_when_it_reads_as_toml410 PASS [ 0.029s] (392/616) iets store::drvdiff::tests::a_changed_input_drv_is_paired_by_name_and_recursed_into411 PASS [ 0.033s] (393/616) iets store::drv::tests::masked_unparse_blanks_output_paths_and_env412 PASS [ 0.021s] (394/616) iets store::drvdiff::tests::the_depth_limit_names_the_input_without_walking_it413 PASS [ 0.102s] (395/616) iets source::lock::tests::complete_lock_passes414 PASS [ 0.032s] (396/616) iets store::drv::tests::string_escapes_roundtrip415 PASS [ 0.030s] (397/616) iets store::drvdiff::tests::env_name_shows_only_when_it_is_not_the_derivation_name416 PASS [ 0.071s] (398/616) iets source::scm::ledger::tests::the_metadata_has_the_mark_of_its_tree417 PASS [ 0.057s] (399/616) iets store::drv::tests::fixtures_output_paths_recompute418 PASS [ 0.018s] (400/616) iets store::drvdiff::tests::the_same_derivation_is_empty419 PASS [ 0.019s] (401/616) iets store::hash::tests::compress_hash_xors420 PASS [ 0.037s] (402/616) iets store::drvdiff::tests::an_input_source_an_added_input_drv_and_a_fixed_output_show_up421 PASS [ 0.029s] (403/616) iets store::drvdiff::tests::the_local_fields_the_env_and_an_absent_value422 PASS [ 0.064s] (404/616) iets store::drv::tests::fixtures_roundtrip_byte_exact423 PASS [ 0.028s] (405/616) iets store::hash::tests::base64_roundtrip424 PASS [ 0.068s] (406/616) iets store::drv::tests::fixtures_drv_path_matches_store_path425 PASS [ 0.038s] (407/616) iets store::drvdiff::tests::json_names_what_differs426 PASS [ 0.016s] (408/616) iets store::hash::tests::empty_sha256427 PASS [ 0.206s] (409/616) iets runtime::value::alloc_tests::a_static_slice_is_interned_without_a_copy428 PASS [ 0.020s] (410/616) iets store::hash::tests::nix32_roundtrip_and_reject429 PASS [ 0.021s] (411/616) iets store::hash::tests::md5_nix32430 PASS [ 0.021s] (412/616) iets store::hash::tests::sha1_nix32431 PASS [ 0.022s] (413/616) iets store::hash::tests::sha256_sri432 PASS [ 0.026s] (414/616) iets store::hash::tests::parse_any_all_formats433 PASS [ 0.024s] (415/616) iets store::hash::tests::sha256_nix32434 PASS [ 0.023s] (416/616) iets store::nar::tests::directory_nar_hash_formats435 PASS [ 0.026s] (417/616) iets store::hash::tests::sha512_nix32_base64436 PASS [ 0.024s] (418/616) iets store::nar::tests::directory_nar437 PASS [ 0.032s] (419/616) iets store::hash::tests::streaming_matches_oneshot438 PASS [ 0.023s] (420/616) iets store::nar::tests::regular_file_nar439 PASS [ 0.022s] (421/616) iets store::nar::tests::restore_rejects_garbage440 PASS [ 0.029s] (422/616) iets store::nar::tests::directory_nar_with_an_executable441 PASS [ 0.117s] (423/616) iets source::scm::ledger::tests::a_name_resolves_to_a_revision_and_a_revision_has_a_tree442 PASS [ 0.032s] (424/616) iets store::nar::tests::filter_sees_types_and_paths443 PASS [ 0.034s] (425/616) iets store::nar::tests::executable_file_nar444 PASS [ 0.032s] (426/616) iets store::nar::tests::readers_refuse_what_nix_refuses445 PASS [ 0.030s] (427/616) iets store::nar::tests::restore_roundtrip446 PASS [ 0.118s] (428/616) iets source::scm::ledger::tests::the_count_is_lazy_and_kept_by_revision447 PASS [ 0.034s] (429/616) iets store::nar::tests::symlink_nar448 PASS [ 0.033s] (430/616) iets store::nar::tests::script_nar449 PASS [ 0.028s] (431/616) iets store::path::tests::an_override_is_absolute_and_has_no_trailing_separator450 PASS [ 1.787s] (432/616) iets api::value::tests::scalars451 PASS [ 0.023s] (433/616) iets store::path::tests::output_names452 PASS [ 0.030s] (434/616) iets store::path::tests::fixed_flat_sha256453 PASS [ 0.030s] (435/616) iets store::path::tests::fixed_flat_sha1454 PASS [ 0.033s] (436/616) iets store::path::tests::filter_source455 PASS [ 0.040s] (437/616) iets store::path::tests::a_multibyte_char_across_the_hash_part_is_an_error456 PASS [ 0.017s] (438/616) iets store::path::tests::path_with_name457 PASS [ 0.022s] (439/616) iets store::path::tests::path_copy_file458 PASS [ 0.023s] (440/616) iets store::path::tests::path_copy_directory459 PASS [ 0.025s] (441/616) iets store::path::tests::parse_and_accessors460 PASS [ 0.040s] (442/616) iets store::path::tests::fixed_recursive_sha256461 PASS [ 0.018s] (443/616) iets syntax::tests::an_interpolated_name_is_static_when_nix_has_one_string_node462 PASS [ 0.023s] (444/616) iets store::path::tests::to_file_with_reference463 PASS [ 0.156s] (445/616) iets source::scm::ledger::tests::a_change_of_the_ledger_is_a_change_of_the_working_tree464 PASS [ 0.028s] (446/616) iets store::path::tests::the_directory_is_found_as_a_string_and_as_a_path465 PASS [ 0.029s] (447/616) iets store::path::tests::placeholder466 PASS [ 0.030s] (448/616) iets syntax::tests::a_line_ends_at_cr_lf_and_lone_cr467 PASS [ 0.036s] (449/616) iets store::path::tests::the_host_picks_the_store_directory468 PASS [ 0.036s] (450/616) iets store::path::tests::to_file469 PASS [ 0.022s] (451/616) iets syntax::tests::line_col_counts_bytes470 PASS [ 0.019s] (452/616) iets syntax::tests::numbers471 PASS [ 0.028s] (453/616) iets syntax::tests::comments_and_misc472 PASS [ 0.029s] (454/616) iets syntax::tests::nul_in_string_literals473 PASS [ 0.032s] (455/616) iets syntax::tests::end_of_file_inside_a_path_is_at_its_last_token474 PASS [ 0.030s] (456/616) iets syntax::tests::json_gives_every_node_its_kind_and_span475 PASS [ 0.033s] (457/616) iets syntax::tests::attrs_and_bindings476 PASS [ 0.031s] (458/616) iets syntax::tests::lambdas477 PASS [ 0.039s] (459/616) iets syntax::tests::allow_comments478 PASS [ 0.020s] (460/616) iets syntax::tests::paths479 PASS [ 0.022s] (461/616) iets syntax::tests::spans_cover_tokens480 PASS [ 0.036s] (462/616) iets syntax::tests::indented_string_stripping481 PASS [ 0.013s] (463/616) iets sys::winpath::tests::a_relative_name_that_starts_with_unc_is_not_a_share482 PASS [ 0.019s] (464/616) iets sys::winpath::tests::a_leading_double_slash_is_not_a_share483 PASS [ 0.074s] (465/616) iets store::path::tests::check_name_rules484 PASS [ 0.026s] (466/616) iets syntax::tests::the_error_reported_is_the_one_nix_meets_first485 PASS [ 0.016s] (467/616) iets sys::winpath::tests::device_paths_are_not_shares_and_survive_a_round_trip486 PASS [ 0.016s] (468/616) iets sys::winpath::tests::a_round_trip_is_stable487 PASS [ 0.015s] (469/616) iets sys::winpath::tests::network_shares_sit_under_unc488 PASS [ 0.024s] (470/616) iets sys::winpath::tests::a_bare_drive_is_not_its_root489 PASS [ 0.015s] (471/616) iets sys::winpath::tests::dot_dot_stops_at_the_anchor490 PASS [ 0.035s] (472/616) iets syntax::tests::operator_precedence491 PASS [ 0.014s] (473/616) iets sys::winpath::tests::forward_slashes_make_a_share_too492 PASS [ 0.014s] (474/616) iets sys::winpath::tests::native_names_come_back493 PASS [ 0.016s] (475/616) iets sys::winpath::tests::mixed_separators_agree494 PASS [ 0.033s] (476/616) iets syntax::tests::string_escapes_and_interpolation495 PASS [ 0.029s] (477/616) iets sys::winpath::tests::a_drive_is_the_first_component496 PASS [ 0.021s] (478/616) iets sys::winpath::tests::relative_and_rooted_paths_only_change_separator497 PASS [ 0.021s] (479/616) iets sys::winpath::tests::the_evaluators_form_is_left_alone498 PASS [ 0.019s] (480/616) iets trace::key::tests::key_is_order_and_value_sensitive499 PASS [ 0.019s] (481/616) iets trace::key::tests::relative_path_detection500 PASS [ 0.014s] (482/616) iets trace::validate::dir_hash_tests::dir_hash_agrees_with_dir_listing_hash501 PASS [ 0.016s] (483/616) iets trace::tests::dump_fingerprint_matches_the_separate_walk502 PASS [ 0.022s] (484/616) iets trace::store::tests::one_rename_publishes_every_part503 PASS [ 0.027s] (485/616) iets trace::store::tests::bytes_that_are_not_an_entry_are_bad_not_a_panic504 PASS [ 0.016s] (486/616) iets trace::wire::tests::drvs_sources_roots_roundtrip505 PASS [ 0.032s] (487/616) iets trace::store::tests::a_reader_of_one_generation_never_sees_the_next506 PASS [ 0.022s] (488/616) iets trace::validate::tests::a_copy_in_place_that_keeps_the_stat_still_misses507 FAIL [ 0.014s] (489/616) iets trace::validate::tests::what_a_native_path_records_validates508 stdout ---509510 running 1 test511 test trace::validate::tests::what_a_native_path_records_validates ... FAILED512513 failures:514515 failures:516 trace::validate::tests::what_a_native_path_records_validates517518 test result: FAILED. 0 passed; 1 failed; 0 ignored; 0 measured; 544 filtered out; finished in 0.01s519 520 stderr ---521522 thread 'trace::validate::tests::what_a_native_path_records_validates' (2056) panicked at src/trace/validate.rs:351:9:523 assertion failed: validate(&mut obs, 2).is_err()524 note: run with `RUST_BACKTRACE=1` environment variable to display a backtrace525526 Cancelling due to test failure: 47 tests still running527 PASS [ 0.026s] (490/616) iets trace::tests::only_a_named_query_is_an_observation528 PASS [ 0.027s] (491/616) iets trace::tests::fingerprint_changes_with_content_size_and_seen_entries529 PASS [ 0.022s] (492/616) iets trace::watch::tests::only_the_paths_an_mtime_can_speak_for530 PASS [ 0.014s] (493/616) iets treestore::pack::tests::a_reader_sees_a_pack_written_after_it_listed531 PASS [ 0.008s] (494/616) iets treestore::tests::a_staged_directory_goes_when_it_is_dropped532 PASS [ 0.032s] (495/616) iets trace::validate::tests::dir_stat_env_checks533 PASS [ 0.027s] (496/616) iets treestore::pack::tests::a_pack_reads_back_what_was_written534 PASS [ 1.054s] (497/616) iets fetch::http::tests::a_stalled_download_fails535 PASS [ 0.020s] (498/616) iets treestore::pack::tests::an_empty_writer_leaves_no_file536 PASS [ 0.335s] (499/616) iets session::tests::a_released_session_leaves_the_other_alone537 PASS [ 0.043s] (500/616) iets trace::validate::tests::file_touch_refreshes_edit_misses538 PASS [ 0.028s] (501/616) iets treestore::pack::tests::a_set_finds_objects_across_packs_and_drops_a_broken_one539 PASS [ 0.035s] (502/616) iets treestore::pack::tests::a_changed_index_byte_is_not_a_pack540 PASS [ 0.038s] (503/616) iets trace::wire::tests::readset_roundtrip541 PASS [ 0.050s] (504/616) iets trace::tests::dedupe_keeps_conflicting_values542 PASS [ 0.025s] (505/616) iets treestore::tests::a_put_after_a_collection_brings_its_own_objects543 PASS [ 0.026s] (506/616) iets treestore::tests::a_flat_file_is_named_by_the_hash_of_its_bytes544 PASS [ 0.232s] (507/616) iets source::scm::ledger::tests::an_untracked_file_is_the_error_of_nix545 PASS [ 0.036s] (508/616) iets treestore::pack::tests::collect_removes_dead_packs_and_compacts_mostly_dead_ones546 PASS [ 1.815s] (509/616) iets builtins::fetch::tests::the_tree_decides_the_level547 PASS [ 1.544s] (510/616) iets eval::tests::from_json_and_toml_reject_null_bytes548 PASS [ 1.544s] (511/616) iets eval::tests::printing549 PASS [ 1.995s] (512/616) iets api::value::tests::construction550 PASS [ 1.695s] (513/616) iets eval::tests::a_second_pseudo_file_keeps_its_own_positions551 PASS [ 1.696s] (514/616) iets eval::tests::attrs_and_lists552 PASS [ 0.233s] (515/616) iets trace::validate::tests::the_lowest_failing_observation_is_the_one_reported553 PASS [ 0.241s] (516/616) iets trace::tests::dedupe_of_many_repeats_is_linear554 PASS [ 0.370s] (517/616) iets syntax::tests::lang_corpus555 PASS [ 0.653s] (518/616) iets session::tests::a_value_used_after_release_is_loud556 PASS [ 2.139s] (519/616) iets builtins::fetch::tests::the_name_on_a_value_that_is_not_a_tree_is_silent557 PASS [ 0.906s] (520/616) iets parallel::thunk::tests::many_fibers_force_one_shared_graph558 PASS [ 1.999s] (521/616) iets eval::tests::fetchurl_needs_a_sha256_in_every_mode559 PASS [ 0.741s] (522/616) iets source::scm::ledger::tests::the_tracked_files_and_the_metadata_are_the_tree560 PASS [ 2.089s] (523/616) iets eval::tests::laziness_and_recursion561 PASS [ 2.491s] (524/616) iets api::value::tests::strings_and_context562 PASS [ 2.162s] (525/616) iets eval::tests::equality563 PASS [ 1.884s] (526/616) iets fetch::http::tests::a_decompression_bomb_is_refused564 PASS [ 2.638s] (527/616) iets eval::tests::fetchurl_checks_its_argument_like_nix565 PASS [ 1.471s] (528/616) iets session::tests::a_parallel_run_releases_its_session566 PASS [ 2.984s] (529/616) iets builtins::fetch::tests::a_selection_of_the_count_is_the_site567 PASS [ 2.435s] (530/616) iets runtime::value::alloc_tests::a_full_string_table_records_no_more_but_still_shares568 PASS [ 3.968s] (531/616) iets api::run::tests::helper_fibers_read_the_ir_cache569 PASS [ 4.522s] (532/616) iets eval::tests::pure_eval_answers_like_nix570 PASS [ 8.724s] (533/616) iets api::concurrent_eval::concurrent_eval_sums_arena_use_over_workers571 PASS [ 25.778s] (534/616) iets syntax::tests::deep_nesting_ends_with_an_error572 PASS [ 39.549s] (535/616) iets runtime::value::tests::union_iteration_merges_like_a_fold573 SLOW [> 60.000s] (-------) iets api::concurrent_eval::concurrent_eval_matches_sequential_eval574 SLOW [>120.000s] (-------) iets api::concurrent_eval::concurrent_eval_matches_sequential_eval575 SLOW [>180.000s] (-------) iets api::concurrent_eval::concurrent_eval_matches_sequential_eval576 SLOW [>240.000s] (-------) iets api::concurrent_eval::concurrent_eval_matches_sequential_eval577 PASS [ 253.102s] (536/616) iets api::concurrent_eval::concurrent_eval_matches_sequential_eval578------------579 Summary [ 253.128s] 536/616 tests run: 535 passed (1 slow), 1 failed, 5 skipped580 FAIL [ 0.014s] (489/616) iets trace::validate::tests::what_a_native_path_records_validates581warning: 80/616 tests were not run due to test failure (run with --no-fail-fast to run all tests, or run with --max-fail)582error: test run failed