nixbot

builds

cancelled checks.x86_64-linux.classic-e2e build #213 · raw · eval 2.8 s · 475.1 MiB allocated · ·

1these 5 derivations will be built:2  /nix/store/32bhzrn1nhq0pvk0jvk36h5bjdyq6ii5-closure-info.drv3  /nix/store/jj90fpmjghy9bq8hgm5giiihc7l8spwn-test-script.drv4  /nix/store/0v22p6m97lb4w1nw2aillxc4nhzqhxgm-driverConfiguration.json.drv5  /nix/store/hjwvw8lr2km05ms96mp60ypqybjsin9j-nixos-test-driver-iets-classic-e2e.drv6  /nix/store/gwskqcanhchigxj1dn3gszsfc456bxds-container-test-run-iets-classic-e2e.drv7building '/nix/store/32bhzrn1nhq0pvk0jvk36h5bjdyq6ii5-closure-info.drv'8closure-info> structuredAttrs is enabled9building '/nix/store/jj90fpmjghy9bq8hgm5giiihc7l8spwn-test-script.drv'10test-script> structuredAttrs is enabled11building '/nix/store/0v22p6m97lb4w1nw2aillxc4nhzqhxgm-driverConfiguration.json.drv'12driverConfiguration.json> structuredAttrs is enabled13building '/nix/store/hjwvw8lr2km05ms96mp60ypqybjsin9j-nixos-test-driver-iets-classic-e2e.drv'14nixos-test-driver-iets-classic-e2e> Running type check (enable/disable: config.skipTypeCheck)15nixos-test-driver-iets-classic-e2e> See https://nixos.org/manual/nixos/stable/#test-opt-skipTypeCheck16nixos-test-driver-iets-classic-e2e> All checks passed!17nixos-test-driver-iets-classic-e2e> Linting test script (enable/disable: config.skipLint)18nixos-test-driver-iets-classic-e2e> See https://nixos.org/manual/nixos/stable/#test-opt-skipLint19nixos-test-driver-iets-classic-e2e> All checks passed!20building '/nix/store/gwskqcanhchigxj1dn3gszsfc456bxds-container-test-run-iets-classic-e2e.drv'21container-test-run-iets-classic-e2e> Machine state will be reset. To keep it, pass --keep-machine-state22container-test-run-iets-classic-e2e> start all VLans23container-test-run-iets-classic-e2e> (finished: start all VLans, in 0.01 seconds)24container-test-run-iets-classic-e2e> 25container-test-run-iets-classic-e2e> Test will time out and terminate in 3600.0 seconds26container-test-run-iets-classic-e2e> run the VM test script27container-test-run-iets-classic-e2e> additionally exposed symbols:28container-test-run-iets-classic-e2e>     machine,29container-test-run-iets-classic-e2e>     vlan1,30container-test-run-iets-classic-e2e>     start_all, test_script, machines, machines_qemu, machines_nspawn, vlans, driver, log, os, create_machine, subtest, run_tests, join_all, retry, serial_stdout_off, serial_stdout_on, polling_condition, BaseMachine, QemuMachine, NspawnMachine, t, debug, dump_machine_ssh31container-test-run-iets-classic-e2e> machine: waiting for unit multi-user.target32container-test-run-iets-classic-e2e> machine: systemd-nspawn running (pid 50)33container-test-run-iets-classic-e2e> machine: Waiting for journal at /build/vm-state-machine/var/log/journal...34container-test-run-iets-classic-e2e> nixos-nspawn(machine): TAP vde-tap1 not found; container will be isolated from VDE35container-test-run-iets-classic-e2e> nixos-nspawn(machine): A common reason for this is that /dev/net is not available in the Nix sandbox. Try adding /dev/net to extra-sandbox-paths.36container-test-run-iets-classic-e2e> Note: in a future version of systemd-nspawn the default set of permitted socket address families will be restricted to AF_INET, AF_INET6 and AF_UNIX. Use --restrict-address-families= to configure the set of permitted socket address families, or set RestrictAddressFamilies= in a .nspawn file.37container-test-run-iets-classic-e2e> ░ Spawning container machine on /build/vm-state-machine.38container-test-run-iets-classic-e2e> machine # No journal files were found.39container-test-run-iets-classic-e2e> machine # No journal boot entry found for the specified boot (+0).40container-test-run-iets-classic-e2e> machine # [1675565.268355] machine systemd-journald[57]: Journal started41container-test-run-iets-classic-e2e> machine # [1675565.268433] machine systemd-journald[57]: Runtime Journal (/run/log/journal/d92a62a656d848c5aee18a98c0117238) is 8M, max 2.5G, 2.5G free.42container-test-run-iets-classic-e2e> machine # [1675565.288176] machine systemd[1]: Finished Create Static Device Nodes in /dev gracefully.43container-test-run-iets-classic-e2e> machine # [1675565.306837] machine systemd[1]: Starting Flush Journal to Persistent Storage...44container-test-run-iets-classic-e2e> machine # [1675565.307384] machine systemd[1]: Starting Create Static Device Nodes in /dev...45container-test-run-iets-classic-e2e> machine # [1675565.329473] machine systemd-journald[57]: Time spent on flushing to /var/log/journal/d92a62a656d848c5aee18a98c0117238 is 1.408ms for 5 entries.46container-test-run-iets-classic-e2e> machine # [1675565.329473] machine systemd-journald[57]: System Journal (/var/log/journal/d92a62a656d848c5aee18a98c0117238) is 512B, max 4G, 3.9G free.47container-test-run-iets-classic-e2e> machine # [1675565.341075] machine systemd[1]: Finished Create Static Device Nodes in /dev.48container-test-run-iets-classic-e2e> machine # [1675565.342215] machine systemd[1]: Reached target Preparation for Local File Systems.49container-test-run-iets-classic-e2e> machine # [1675565.342300] machine systemd[1]: Rule-based Manager for Device Events and Files skipped, unmet condition check ConditionPathIsReadWrite=/sys50container-test-run-iets-classic-e2e> machine # [1675565.355259] machine systemd[1]: Finished Flush Journal to Persistent Storage.51container-test-run-iets-classic-e2e> machine # [1675565.466754] machine systemd[1]: Finished Firewall.52container-test-run-iets-classic-e2e> machine # [1675566.235506] machine systemd[1]: Mounting /run/wrappers...53container-test-run-iets-classic-e2e> machine # [1675566.270934] machine systemd[1]: Mounted /run/wrappers.54container-test-run-iets-classic-e2e> machine # [1675566.271812] machine systemd[1]: Reached target Local File Systems.55container-test-run-iets-classic-e2e> machine # [1675566.272632] machine systemd[1]: Listening on Boot Loader Control Service Socket.56container-test-run-iets-classic-e2e> machine # [1675566.273692] machine systemd[1]: Starting Create SUID/SGID Wrappers...57container-test-run-iets-classic-e2e> machine # [1675566.273714] machine systemd[1]: Update Boot Loader Random Seed skipped, unmet condition check ConditionVirtualization=!container58container-test-run-iets-classic-e2e> machine # [1675566.274521] machine systemd[1]: Starting Save Transient machine-id to Disk...59container-test-run-iets-classic-e2e> machine # [1675566.275365] machine systemd[1]: Starting Create System Files and Directories...60container-test-run-iets-classic-e2e> machine # [1675566.324996] machine systemd-tmpfiles[161]: Cannot set file attributes for '/var/empty', value=0x00000010, mask=0x00000010, ignoring: Operation not permitted61container-test-run-iets-classic-e2e> machine # [1675566.325119] machine systemd-tmpfiles[161]: fchmod() of /var/log/journal failed: Operation not permitted62container-test-run-iets-classic-e2e> machine # [1675566.325194] machine systemd-tmpfiles[161]: fchmod() of /var/log/journal/d92a62a656d848c5aee18a98c0117238 failed: Operation not permitted63container-test-run-iets-classic-e2e> machine # [1675566.325291] machine systemd-tmpfiles[161]: fchmod() of /run/log/journal failed: Operation not permitted64container-test-run-iets-classic-e2e> machine # [1675566.328975] machine systemd[1]: Finished Create System Files and Directories.65container-test-run-iets-classic-e2e> machine # [1675566.333298] machine suid-sgid-wrappers-start[168]: chmod: changing permissions of '/run/wrappers/wrappers.rO7NKOnjFe/chsh': Operation not permitted66container-test-run-iets-classic-e2e> machine # [1675566.341646] machine systemd[1]: suid-sgid-wrappers.service: Main process exited, code=exited, status=1/FAILURE67container-test-run-iets-classic-e2e> machine # [1675566.341709] machine systemd[1]: suid-sgid-wrappers.service: Failed with result 'exit-code'.68container-test-run-iets-classic-e2e> machine # [1675566.342306] machine systemd[1]: Failed to start Create SUID/SGID Wrappers.69container-test-run-iets-classic-e2e> machine # [1675566.344680] machine systemd[1]: Starting Rebuild Journal Catalog...70container-test-run-iets-classic-e2e> machine # [1675566.345942] machine systemd[1]: Starting Record System Boot/Shutdown in UTMP...71container-test-run-iets-classic-e2e> machine # [1675566.367587] machine systemd[1]: Finished Record System Boot/Shutdown in UTMP.72container-test-run-iets-classic-e2e> machine # [1675566.371444] machine systemd[1]: Finished Rebuild Journal Catalog.73container-test-run-iets-classic-e2e> machine # [1675566.372322] machine systemd[1]: Starting Update is Completed...74container-test-run-iets-classic-e2e> machine # [1675566.418911] machine systemd[1]: Finished Update is Completed.75container-test-run-iets-classic-e2e> machine # [1675566.419041] machine systemd[1]: Reached target System Initialization.76container-test-run-iets-classic-e2e> machine # [1675566.419127] machine systemd[1]: Discard unused filesystem blocks once a week skipped, unmet condition check ConditionVirtualization=!container77container-test-run-iets-classic-e2e> machine # [1675566.419397] machine systemd[1]: Started Daily Cleanup of Temporary Directories.78container-test-run-iets-classic-e2e> machine # [1675566.419422] machine systemd[1]: Reached target Timer Units.79container-test-run-iets-classic-e2e> machine # [1675566.419552] machine systemd[1]: Listening on D-Bus System Message Bus Socket.80container-test-run-iets-classic-e2e> machine # [1675566.419634] machine systemd[1]: Listening on Virtual Machine and Container Registration Service Socket.81container-test-run-iets-classic-e2e> machine # [1675566.419650] machine systemd[1]: Reached target Socket Units.82container-test-run-iets-classic-e2e> machine # [1675566.419680] machine systemd[1]: Reached target Basic System.83container-test-run-iets-classic-e2e> machine # [1675566.422069] machine systemd[1]: Starting Import lastlog data into lastlog2 database...84container-test-run-iets-classic-e2e> machine # [1675566.423487] machine systemd[1]: Starting Name Service Cache Daemon (nsncd)...85container-test-run-iets-classic-e2e> machine # [1675566.424837] machine systemd[1]: Starting resolvconf update...86container-test-run-iets-classic-e2e> machine # [1675566.444428] machine systemd[1]: Finished Import lastlog data into lastlog2 database.87container-test-run-iets-classic-e2e> machine # [1675566.485061] machine systemd[1]: etc-machine\x2did.mount: Deactivated successfully.88container-test-run-iets-classic-e2e> machine # [1675566.485951] machine systemd[1]: Finished Save Transient machine-id to Disk.89container-test-run-iets-classic-e2e> machine # [1675566.495348] machine systemd[1]: nscd.service: Deactivated successfully.90container-test-run-iets-classic-e2e> machine # [1675566.495483] machine systemd[1]: Stopped Name Service Cache Daemon (nsncd).91container-test-run-iets-classic-e2e> machine # [1675566.497491] machine systemd[1]: Starting Name Service Cache Daemon (nsncd)...92container-test-run-iets-classic-e2e> machine # [1675566.531284] machine resolvconf-start[235]: setfacl: /run/resolvconf: Operation not supported93container-test-run-iets-classic-e2e> machine # [1675566.532965] machine systemd[1]: resolvconf.service: Main process exited, code=exited, status=1/FAILURE94container-test-run-iets-classic-e2e> machine # [1675566.533048] machine systemd[1]: resolvconf.service: Failed with result 'exit-code'.95container-test-run-iets-classic-e2e> machine # [1675566.554336] machine systemd[1]: Failed to start resolvconf update.96container-test-run-iets-classic-e2e> machine # [1675566.554662] machine systemd[1]: Reached target Preparation for Network.97container-test-run-iets-classic-e2e> machine # [1675566.555776] machine systemd[1]: Starting Address configuration of eth1...98container-test-run-iets-classic-e2e> machine # [1675566.556615] machine systemd[1]: Starting Extra networking commands....99container-test-run-iets-classic-e2e> machine # [1675566.572841] machine network-addresses-eth1-start[238]: adding address 192.168.1.1/24... done100container-test-run-iets-classic-e2e> machine # [1675566.575200] machine network-addresses-eth1-start[238]: adding address 2001:db8:1::1/64... done101container-test-run-iets-classic-e2e> machine # [1675566.578280] machine systemd[1]: Finished Address configuration of eth1.102container-test-run-iets-classic-e2e> machine # [1675566.612667] machine systemd[1]: Finished Extra networking commands..103container-test-run-iets-classic-e2e> machine # [1675566.612737] machine systemd[1]: Reached target Network.104container-test-run-iets-classic-e2e> machine # [1675566.695029] machine nsncd[224]: Oct 14 08:25:37.425 INFO started, config: Config { ignored_request_types: {}, worker_count: 8, handoff_timeout: 10s }, path: "/var/run/nscd/socket"105container-test-run-iets-classic-e2e> machine # [1675566.695013] machine systemd[1]: Started Name Service Cache Daemon (nsncd).106container-test-run-iets-classic-e2e> machine # [1675566.695086] machine systemd[1]: Reached target Host and Network Name Lookups.107container-test-run-iets-classic-e2e> machine # [1675566.695136] machine systemd[1]: Reached target User and Group Name Lookups.108container-test-run-iets-classic-e2e> machine # [1675566.696545] machine systemd[1]: Starting User Login Management...109container-test-run-iets-classic-e2e> machine # [1675566.697470] machine systemd[1]: Starting Permit User Sessions...110container-test-run-iets-classic-e2e> machine # [1675566.719358] machine systemd[1]: Finished Permit User Sessions.111container-test-run-iets-classic-e2e> machine # [1675566.720521] machine systemd[1]: Started Console Getty.112container-test-run-iets-classic-e2e> machine # [1675566.720570] machine systemd[1]: Getty on tty1 skipped, unmet condition check ConditionPathExists=/dev/tty0113container-test-run-iets-classic-e2e> machine # [1675566.720588] machine systemd[1]: Reached target Login Prompts.114container-test-run-iets-classic-e2e> machine # [1675567.657730] machine systemd-logind[306]: New seat seat0.115container-test-run-iets-classic-e2e> machine # [1675567.659971] machine systemd[1]: Starting D-Bus System Message Bus...116container-test-run-iets-classic-e2e> machine # [1675567.660112] machine systemd[1]: Started User Login Management.117container-test-run-iets-classic-e2e> machine # [1675567.660937] machine systemd[1]: Starting linger-users.service...118container-test-run-iets-classic-e2e> machine # [1675567.709792] machine systemd[1]: linger-users.service: Deactivated successfully.119container-test-run-iets-classic-e2e> machine # [1675567.710007] machine systemd[1]: Finished linger-users.service.120container-test-run-iets-classic-e2e> machine # [1675567.710175] machine systemd[1]: Reached target Multi-User System.121container-test-run-iets-classic-e2e> machine: (finished: waiting for unit multi-user.target, in 4.17 seconds)122container-test-run-iets-classic-e2e> machine: must succeed: /nix/store/phhjngxgfhr1lrzk0w7ms3775mh0pxd5-writable-store /nix/store/zh4m55r42yp6z2ws6nx47rhd9nc5w4hz-closure-info123container-test-run-iets-classic-e2e> machine # [1675567.981754] machine dbus-broker-launch[316]: Looking up NSS user entry for 'systemd-timesync'...124container-test-run-iets-classic-e2e> machine # [1675567.983274] machine dbus-broker-launch[316]: NSS returned no entry for 'systemd-timesync'125container-test-run-iets-classic-e2e> machine # [1675567.983274] machine dbus-broker-launch[316]: Invalid user-name in /nix/store/jlg1ir1z4dfm81ya2kccdm1fv06giam6-system-path/share/dbus-1/system.d/org.freedesktop.timesync1.conf +16: user="systemd-timesync"126container-test-run-iets-classic-e2e> machine # [1675567.986280] machine systemd[1]: Started D-Bus System Message Bus.127container-test-run-iets-classic-e2e> machine # [1675567.986922] machine systemd[1]: Startup finished in 3.281s.128container-test-run-iets-classic-e2e> machine # [1675567.998339] machine dbus-broker-launch[316]: Ready129container-test-run-iets-classic-e2e> warning: '--json' without '--json-format' is deprecated; please specify '--json-format 1' or '--json-format 2'. This will become an error in a future release.130container-test-run-iets-classic-e2e> machine: (finished: must succeed: /nix/store/phhjngxgfhr1lrzk0w7ms3775mh0pxd5-writable-store /nix/store/zh4m55r42yp6z2ws6nx47rhd9nc5w4hz-closure-info, in 10.39 seconds)131container-test-run-iets-classic-e2e> machine: must succeed: systemctl start nix-daemon.socket132container-test-run-iets-classic-e2e> machine: (finished: must succeed: systemctl start nix-daemon.socket, in 0.07 seconds)133container-test-run-iets-classic-e2e> machine: must succeed: /nix/store/4w5x4f2szvwd1kzhp0xpzgzpvvpmkc4h-leftovers134container-test-run-iets-classic-e2e> machine: (finished: must succeed: /nix/store/4w5x4f2szvwd1kzhp0xpzgzpvvpmkc4h-leftovers, in 0.19 seconds)135container-test-run-iets-classic-e2e> machine: must succeed: cp -r /nix/store/h74d0b6xx9saxywjcvfsw1i1rkrdk3zw-source /home/alice/iets && chmod -R u+w /home/alice/iets && chown -R alice /home/alice/iets136container-test-run-iets-classic-e2e> machine: (finished: must succeed: cp -r /nix/store/h74d0b6xx9saxywjcvfsw1i1rkrdk3zw-source /home/alice/iets && chmod -R u+w /home/alice/iets && chown -R alice /home/alice/iets, in 0.18 seconds)137container-test-run-iets-classic-e2e> machine: must succeed: runuser -l alice -c 'cd iets && git init -q && git add -A && git -c user.name=e2e -c user.email=e2e@example.com commit -q -m e2e'138container-test-run-iets-classic-e2e> machine # [1675578.690620] machine systemd[1]: Listening on Nix Daemon Socket.139container-test-run-iets-classic-e2e> machine # [1675579.067649] machine runuser[4980]: pam_unix(runuser-l:session): session opened for user alice(uid=1000) by (uid=0)140container-test-run-iets-classic-e2e> machine: (finished: must succeed: runuser -l alice -c 'cd iets && git init -q && git add -A && git -c user.name=e2e -c user.email=e2e@example.com commit -q -m e2e', in 0.35 seconds)141container-test-run-iets-classic-e2e> machine: must succeed: runuser -l alice -c 'cd iets && IETS=/nix/store/43344pd2m7747rblyxyl28i60q397gyd-iets-0.1.0/bin/iets NIXPKGS=/nix/store/2010s04mqpq7q1kch0ddc9b429s2vh9v-source E2E_OFFLINE=1   nu scripts/classic-e2e.nu' >&2142container-test-run-iets-classic-e2e> real nix: /nix/store/f0rfa5pcykqbv313j74x7l7wa8nl4bj4-nix-2.34.8/bin143container-test-run-iets-classic-e2e> machine # [1675579.404302] machine runuser[4980]: pam_unix(runuser-l:session): session closed for user alice144container-test-run-iets-classic-e2e> machine # [1675579.415359] machine runuser[4993]: pam_unix(runuser-l:session): session opened for user alice(uid=1000) by (uid=0)145container-test-run-iets-classic-e2e> ok   builtins --impure []: the same names nix has146container-test-run-iets-classic-e2e> ok   builtins --impure [dynamic-derivations]: the same names nix has147container-test-run-iets-classic-e2e> ok   builtins --impure [dynamic-derivations fetch-closure fetch-tree]: the same names nix has148container-test-run-iets-classic-e2e> ok   builtins --pure-eval []: the same names nix has149container-test-run-iets-classic-e2e> ok   builtins --pure-eval [dynamic-derivations]: the same names nix has150container-test-run-iets-classic-e2e> ok   builtins --pure-eval [dynamic-derivations fetch-closure fetch-tree]: the same names nix has151container-test-run-iets-classic-e2e> machine # [1675582.184062] machine systemd[1]: Started Nix Daemon.152container-test-run-iets-classic-e2e> machine # [1675582.246399] machine nix-daemon[5314]: accepted connection from pid 5307, user alice (trusted)153container-test-run-iets-classic-e2e> ok   instantiate <nixpkgs> -A hello154container-test-run-iets-classic-e2e> machine # [1675582.953864] machine nix-daemon[5314]: accepted connection from pid 5431, user alice (trusted)155container-test-run-iets-classic-e2e> machine # [1675583.811697] machine nix-daemon[5314]: accepted connection from pid 5452, user alice (trusted)156container-test-run-iets-classic-e2e> machine # [1675584.113262] machine nix-daemon[5314]: accepted connection from pid 5463, user alice (trusted)157container-test-run-iets-classic-e2e> ok   instantiate <nixpkgs> -A glibc (multi-output)158container-test-run-iets-classic-e2e> machine # [1675584.827250] machine nix-daemon[5314]: accepted connection from pid 5484, user alice (trusted)159container-test-run-iets-classic-e2e> machine # [1675585.107715] machine nix-daemon[5314]: accepted connection from pid 5495, user alice (trusted)160container-test-run-iets-classic-e2e> ok   instantiate <nixpkgs> -A glibc.dev (!output suffix)161container-test-run-iets-classic-e2e> machine # [1675585.750978] machine nix-daemon[5314]: accepted connection from pid 5516, user alice (trusted)162container-test-run-iets-classic-e2e> machine # [1675585.985947] machine nix-daemon[5314]: accepted connection from pid 5527, user alice (trusted)163container-test-run-iets-classic-e2e> ok   instantiate two -A in one run164container-test-run-iets-classic-e2e> machine # [1675587.634459] machine nix-daemon[5314]: accepted connection from pid 5548, user alice (trusted)165container-test-run-iets-classic-e2e> machine # [1675587.888539] machine nix-daemon[5314]: accepted connection from pid 5559, user alice (trusted)166container-test-run-iets-classic-e2e> ok   instantiate two -A that name one derivation167container-test-run-iets-classic-e2e> machine # [1675589.547287] machine nix-daemon[5314]: accepted connection from pid 5580, user alice (trusted)168container-test-run-iets-classic-e2e> machine # [1675589.799493] machine nix-daemon[5314]: accepted connection from pid 5591, user alice (trusted)169container-test-run-iets-classic-e2e> ok   instantiate --add-root ''170container-test-run-iets-classic-e2e> ok   instantiate --eval --strict --json171container-test-run-iets-classic-e2e> ok   instantiate --eval172container-test-run-iets-classic-e2e> ok   instantiate --eval --raw173container-test-run-iets-classic-e2e> ok   instantiate --eval --raw a path174container-test-run-iets-classic-e2e> ok   instantiate --eval --raw an outPath175container-test-run-iets-classic-e2e> ok   instantiate --eval, one --arg name twice176container-test-run-iets-classic-e2e> ok   instantiate --eval, --arg then --argstr of one name177container-test-run-iets-classic-e2e> ok   instantiate --eval, a later expression throws178container-test-run-iets-classic-e2e> ok   instantiate --eval --argstr179container-test-run-iets-classic-e2e> ok   instantiate a custom drv180container-test-run-iets-classic-e2e> machine # [1675595.107251] machine nix-daemon[5314]: accepted connection from pid 5846, user alice (trusted)181container-test-run-iets-classic-e2e> machine # [1675595.228717] machine nix-daemon[5314]: accepted connection from pid 5858, user alice (trusted)182container-test-run-iets-classic-e2e> machine # [1675595.375826] machine nix-daemon[5314]: accepted connection from pid 5879, user alice (trusted)183container-test-run-iets-classic-e2e> machine # [1675595.622252] machine nix-daemon[5314]: accepted connection from pid 5894, user alice (trusted)184container-test-run-iets-classic-e2e> ok   drv closure follows the references of a toFile185container-test-run-iets-classic-e2e> ok   instantiate builtins.outputOf, once and nested186container-test-run-iets-classic-e2e> ok   eval builtins.outputOf placeholders187container-test-run-iets-classic-e2e> machine # [1675595.689857] machine nix-daemon[5314]: accepted connection from pid 5915, user alice (trusted)188container-test-run-iets-classic-e2e> machine # [1675595.758593] machine nix-daemon[5314]: accepted connection from pid 5937, user alice (trusted)189container-test-run-iets-classic-e2e> machine # [1675595.840759] machine nix-daemon[5314]: accepted connection from pid 5958, user alice (trusted)190container-test-run-iets-classic-e2e> machine # [1675595.901642] machine nix-daemon[5314]: accepted connection from pid 5980, user alice (trusted)191container-test-run-iets-classic-e2e> machine # [1675595.986513] machine nix-daemon[5314]: accepted connection from pid 6001, user alice (trusted)192container-test-run-iets-classic-e2e> ok   two consumers of one dynamic producer stay apart193container-test-run-iets-classic-e2e> ok   instantiate --readonly-mode194container-test-run-iets-classic-e2e> machine # [1675596.055623] machine nix-daemon[5314]: accepted connection from pid 6023, user alice (trusted)195container-test-run-iets-classic-e2e> machine # [1675596.263610] machine nix-daemon[5314]: accepted connection from pid 6070, user alice (trusted)196container-test-run-iets-classic-e2e> machine # [1675596.321847] machine nix-daemon[5314]: accepted connection from pid 6093, user alice (trusted)197container-test-run-iets-classic-e2e> machine # [1675596.508918] machine nix-daemon[5314]: accepted connection from pid 6114, user alice (trusted)198container-test-run-iets-classic-e2e> machine # [1675596.577131] machine nix-daemon[5314]: accepted connection from pid 6127, user alice (trusted)199container-test-run-iets-classic-e2e> ok   --add-root links and registers a gc root200container-test-run-iets-classic-e2e> machine # [1675596.637172] machine nix-daemon[5314]: accepted connection from pid 6148, user alice (trusted)201container-test-run-iets-classic-e2e> machine # [1675596.865148] machine nix-daemon[5314]: accepted connection from pid 6198, user alice (trusted)202container-test-run-iets-classic-e2e> machine # [1675597.060768] machine nix-daemon[5314]: accepted connection from pid 6239, user alice (trusted)203container-test-run-iets-classic-e2e> machine # [1675597.306037] machine nix-daemon[5314]: accepted connection from pid 6289, user alice (trusted)204container-test-run-iets-classic-e2e> machine # [1675597.481335] machine nix-daemon[5314]: accepted connection from pid 6332, user alice (trusted)205container-test-run-iets-classic-e2e> machine # [1675597.741296] machine nix-daemon[5314]: accepted connection from pid 6384, user alice (trusted)206container-test-run-iets-classic-e2e> machine # [1675597.894124] machine nix-daemon[5314]: accepted connection from pid 6427, user alice (trusted)207container-test-run-iets-classic-e2e> ok   -o over an existing path acts as Nix does208container-test-run-iets-classic-e2e> machine # [1675598.174484] machine nix-daemon[5314]: accepted connection from pid 6479, user alice (trusted)209container-test-run-iets-classic-e2e> machine # [1675598.357737] machine nix-daemon[5314]: accepted connection from pid 6520, user alice (trusted)210container-test-run-iets-classic-e2e> ok   build a custom drv, default result211container-test-run-iets-classic-e2e> machine # [1675598.616085] machine nix-daemon[5314]: accepted connection from pid 6564, user alice (trusted)212container-test-run-iets-classic-e2e> machine # [1675598.761643] machine nix-daemon[5314]: accepted connection from pid 6599, user alice (trusted)213container-test-run-iets-classic-e2e> ok   build -o link214container-test-run-iets-classic-e2e> machine # [1675599.025009] machine nix-daemon[5314]: accepted connection from pid 6643, user alice (trusted)215container-test-run-iets-classic-e2e> machine # [1675599.183097] machine nix-daemon[5314]: accepted connection from pid 6678, user alice (trusted)216container-test-run-iets-classic-e2e> ok   build --no-out-link217container-test-run-iets-classic-e2e> machine # [1675599.427401] machine nix-daemon[5314]: accepted connection from pid 6722, user alice (trusted)218container-test-run-iets-classic-e2e> machine # [1675599.597462] machine nix-daemon[5314]: accepted connection from pid 6757, user alice (trusted)219container-test-run-iets-classic-e2e> ok   build two outputs of one drv220container-test-run-iets-classic-e2e> machine # [1675599.845437] machine nix-daemon[5314]: accepted connection from pid 6809, user alice (trusted)221container-test-run-iets-classic-e2e> machine # [1675599.935217] machine nix-daemon[5314]: accepted connection from pid 6825, user alice (trusted)222container-test-run-iets-classic-e2e> ok   build two drvs223container-test-run-iets-classic-e2e> machine # [1675600.159755] machine nix-daemon[5314]: accepted connection from pid 6874, user alice (trusted)224container-test-run-iets-classic-e2e> ok   builder = unix://SCRATCH builds there and registers here225container-test-run-iets-classic-e2e> machine # [1675601.106532] machine nix-daemon[5314]: accepted connection from pid 6932, user alice (trusted)226container-test-run-iets-classic-e2e> machine # [1675601.179623] machine nix-daemon[5314]: accepted connection from pid 6969, user alice (trusted)227container-test-run-iets-classic-e2e> machine # [1675601.243892] machine nix-daemon[5314]: accepted connection from pid 6990, user alice (trusted)228container-test-run-iets-classic-e2e> ok   fetchGit of a clean working tree229container-test-run-iets-classic-e2e> machine # [1675601.626920] machine nix-daemon[5314]: accepted connection from pid 7059, user alice (trusted)230container-test-run-iets-classic-e2e> ok   fetchGit of a file URL231container-test-run-iets-classic-e2e> machine # [1675602.757564] machine nix-daemon[5314]: accepted connection from pid 7096, user alice (trusted)232container-test-run-iets-classic-e2e> machine # [1675603.117378] machine nix-daemon[5314]: accepted connection from pid 7129, user alice (trusted)233container-test-run-iets-classic-e2e> ok   fetchGit with name, shallow and exportIgnore = false234container-test-run-iets-classic-e2e> machine # [1675603.300180] machine nix-daemon[5314]: accepted connection from pid 7151, user alice (trusted)235container-test-run-iets-classic-e2e> ok   fetchGit of a rev236container-test-run-iets-classic-e2e> machine # [1675603.402037] machine nix-daemon[5314]: accepted connection from pid 7170, user alice (trusted)237container-test-run-iets-classic-e2e> machine # [1675603.587017] machine nix-daemon[5314]: accepted connection from pid 7192, user alice (trusted)238container-test-run-iets-classic-e2e> machine # [1675603.709692] machine nix-daemon[5314]: accepted connection from pid 7211, user alice (trusted)239container-test-run-iets-classic-e2e> ok   fetchGit of a rev in pure mode240container-test-run-iets-classic-e2e> machine # [1675603.865984] machine nix-daemon[5314]: accepted connection from pid 7233, user alice (trusted)241container-test-run-iets-classic-e2e> machine # [1675603.958515] machine nix-daemon[5314]: accepted connection from pid 7254, user alice (trusted)242container-test-run-iets-classic-e2e> ok   fetchGit of a ref243container-test-run-iets-classic-e2e> ok   fetchGit of an unlocked tree in pure mode244container-test-run-iets-classic-e2e> ok   fetchGit of a ref that is a tag245container-test-run-iets-classic-e2e> machine # [1675604.258097] machine nix-daemon[5314]: accepted connection from pid 7303, user alice (trusted)246container-test-run-iets-classic-e2e> machine # [1675604.355068] machine nix-daemon[5314]: accepted connection from pid 7324, user alice (trusted)247container-test-run-iets-classic-e2e> machine # [1675604.495843] machine nix-daemon[5314]: accepted connection from pid 7346, user alice (trusted)248container-test-run-iets-classic-e2e> machine # [1675604.623065] machine nix-daemon[5314]: accepted connection from pid 7367, user alice (trusted)249container-test-run-iets-classic-e2e> ok   fetchGit of a ref that is an annotated tag250container-test-run-iets-classic-e2e> ok   fetchGit of a branch with an executable, a symlink and a submodule251container-test-run-iets-classic-e2e> machine # [1675604.893545] machine nix-daemon[5314]: accepted connection from pid 7414, user alice (trusted)252container-test-run-iets-classic-e2e> machine # [1675605.086496] machine nix-daemon[5314]: accepted connection from pid 7436, user alice (trusted)253container-test-run-iets-classic-e2e> machine # [1675605.195759] machine nix-daemon[5314]: accepted connection from pid 7455, user alice (trusted)254container-test-run-iets-classic-e2e> ok   fetchGit of a rev and a ref255container-test-run-iets-classic-e2e> ok   fetchGit of a rev with exportIgnore = false256container-test-run-iets-classic-e2e> ok   fetchGit of a ref that names nothing257container-test-run-iets-classic-e2e> machine # [1675605.494238] machine nix-daemon[5314]: accepted connection from pid 7494, user alice (trusted)258container-test-run-iets-classic-e2e> machine # [1675605.865452] machine nix-daemon[5314]: accepted connection from pid 7567, user alice (trusted)259container-test-run-iets-classic-e2e> ok   fetchGit { url = "/tmp/iets-classic-e2e.aneuRe/fetchgit repo"; rev = "8f771abf3dec041062af0e0e9ad64e58eff35c2f"; } runs no nix260container-test-run-iets-classic-e2e> machine # [1675606.107241] machine nix-daemon[5314]: accepted connection from pid 7586, user alice (trusted)261container-test-run-iets-classic-e2e> ok   fetchGit { url = "/tmp/iets-classic-e2e.aneuRe/fetchgit repo"; ref = "ann"; } runs no nix262container-test-run-iets-classic-e2e> ok   fetchGit of a dirty working tree263container-test-run-iets-classic-e2e> ok   fetchGit of a dirty working tree warns as Nix does264container-test-run-iets-classic-e2e> machine # [1675606.370957] machine nix-daemon[5314]: accepted connection from pid 7632, user alice (trusted)265container-test-run-iets-classic-e2e> ok   lib.fileset.gitTracked of a dirty working tree266container-test-run-iets-classic-e2e> machine # [1675606.894986] machine nix-daemon[5314]: accepted connection from pid 7684, user alice (trusted)267container-test-run-iets-classic-e2e> machine # [1675606.924225] machine nix-daemon[5314]: accepted connection from pid 7684, user alice (trusted)268container-test-run-iets-classic-e2e> machine # [1675607.287549] machine nix-daemon[5314]: accepted connection from pid 7733, user alice (trusted)269container-test-run-iets-classic-e2e> ok   lib.fileset.gitTracked of a clean working tree270container-test-run-iets-classic-e2e> ok   --parse execs the real nix-instantiate271container-test-run-iets-classic-e2e> ok   --iets-option never reaches the fallback nix272container-test-run-iets-classic-e2e> ok   the fallback prints one line on stderr273container-test-run-iets-classic-e2e> ok   IETS_NO_FALLBACK=1 exits 1274container-test-run-iets-classic-e2e> ok   nix-bin-dir full of iets: the fallback stops, it does not loop275container-test-run-iets-classic-e2e> machine # [1675607.321824] machine nix-daemon[5314]: accepted connection from pid 7733, user alice (trusted)276container-test-run-iets-classic-e2e> ok   nix eval > /dev/full277container-test-run-iets-classic-e2e> ok   nix-instantiate --eval > /dev/full278container-test-run-iets-classic-e2e> ok   iets version > /dev/full reports, not aborts279container-test-run-iets-classic-e2e> ok   iets parse /tmp/iets-classic-e2e.aneuRe/case/multi.nix > /dev/full reports, not aborts280container-test-run-iets-classic-e2e> ok   iets --help > /dev/full reports, not aborts281container-test-run-iets-classic-e2e> ok   iets lint list > /dev/full reports, not aborts282container-test-run-iets-classic-e2e> ok   a bad iets.toml and 'iets version'283container-test-run-iets-classic-e2e> ok   a bad iets.toml and 'iets --help'284container-test-run-iets-classic-e2e> ok   a bad iets.toml and 'iets eval -E 1'285container-test-run-iets-classic-e2e> ok   an early error is a record under internal-json286container-test-run-iets-classic-e2e> ok   fetchTarball falls back and prints the real result287container-test-run-iets-classic-e2e> ok   fetchMercurial falls back with one 'iets:' prefix288container-test-run-iets-classic-e2e> machine # [1675608.209945] machine nix-daemon[5314]: accepted connection from pid 7964, user alice (trusted)289container-test-run-iets-classic-e2e> machine # [1675608.289146] machine nix-daemon[5314]: accepted connection from pid 7990, user alice (trusted)290container-test-run-iets-classic-e2e> ok   iets eval fetchMercurial names fetchTree on stderr291container-test-run-iets-classic-e2e> ok   fetchurl with a sha256 has nix's store path292container-test-run-iets-classic-e2e> ok   nix eval reads what fetchurl got293container-test-run-iets-classic-e2e> machine # [1675608.813840] machine nix-daemon[5314]: accepted connection from pid 8036, user alice (trusted)294container-test-run-iets-classic-e2e> machine # [1675608.978122] machine nix-daemon[5314]: accepted connection from pid 8068, user alice (trusted)295container-test-run-iets-classic-e2e> ok   fetchurl without a hash falls back in an impure evaluation296container-test-run-iets-classic-e2e> ok   fetchurl without a hash in a pure evaluation297container-test-run-iets-classic-e2e> machine # [1675609.189762] machine nix-daemon[5314]: accepted connection from pid 8091, user alice (trusted)298container-test-run-iets-classic-e2e> machine # [1675609.252316] machine nix-daemon[5314]: accepted connection from pid 8116, user alice (trusted)299container-test-run-iets-classic-e2e> ok   fetchurl does not take an invalid path300container-test-run-iets-classic-e2e> machine # [1675609.555757] machine nix-daemon[5314]: accepted connection from pid 8164, user alice (trusted)301container-test-run-iets-classic-e2e> machine # [1675609.624290] machine nix-daemon[5314]: accepted connection from pid 8176, user alice (trusted)302container-test-run-iets-classic-e2e> ok   fetchurl with a wrong hash does not take an invalid path303container-test-run-iets-classic-e2e> machine # [1675610.092337] machine nix-daemon[5314]: accepted connection from pid 8199, user alice (trusted)304container-test-run-iets-classic-e2e> machine # [1675610.218557] machine nix-daemon[5314]: accepted connection from pid 8211, user alice (trusted)305container-test-run-iets-classic-e2e> ok   fetchTarball does not take an invalid path306container-test-run-iets-classic-e2e> machine # [1675610.852938] machine nix-daemon[5314]: accepted connection from pid 8251, user alice (trusted)307container-test-run-iets-classic-e2e> machine # [1675610.886867] machine nix-daemon[5314]: accepted connection from pid 8251, user alice (trusted)308container-test-run-iets-classic-e2e> machine # [1675610.926204] machine nix-daemon[5314]: accepted connection from pid 8265, user alice (trusted)309container-test-run-iets-classic-e2e> ok   import from derivation falls back310container-test-run-iets-classic-e2e> ok   iets eval refuses import from derivation311container-test-run-iets-classic-e2e> machine # [1675611.741166] machine nix-daemon[5314]: accepted connection from pid 8287, user alice (trusted)312container-test-run-iets-classic-e2e> machine # [1675611.798206] machine nix-daemon[5314]: accepted connection from pid 8312, user alice (trusted)313container-test-run-iets-classic-e2e> ok   instantiate --eval a non-UTF-8 file name314container-test-run-iets-classic-e2e> ok   iets eval a non-UTF-8 file name315container-test-run-iets-classic-e2e> ok   a non-UTF-8 file name reaches the fallback intact316container-test-run-iets-classic-e2e> ok   the 'nix' name falls back317container-test-run-iets-classic-e2e> ok   nix eval --json .#x318container-test-run-iets-classic-e2e> ok   nix eval --raw .#x319container-test-run-iets-classic-e2e> machine # [1675613.578596] machine nix-daemon[5314]: accepted connection from pid 8444, user alice (trusted)320container-test-run-iets-classic-e2e> machine # [1675613.810060] machine nix-daemon[5314]: accepted connection from pid 8473, user alice (trusted)321container-test-run-iets-classic-e2e> ok   nix eval .#s (attrset, list, float)322container-test-run-iets-classic-e2e> ok   nix eval .#l323container-test-run-iets-classic-e2e> machine # [1675614.010992] machine nix-daemon[5314]: accepted connection from pid 8502, user alice (trusted)324container-test-run-iets-classic-e2e> machine # [1675614.257041] machine nix-daemon[5314]: accepted connection from pid 8531, user alice (trusted)325container-test-run-iets-classic-e2e> machine # [1675614.347328] machine nix-daemon[5314]: accepted connection from pid 8557, user alice (trusted)326container-test-run-iets-classic-e2e> ok   nix flake prefetch-inputs, no inputs327container-test-run-iets-classic-e2e> ok   nix flake prefetch-inputs is iets's own328container-test-run-iets-classic-e2e> ok   nix eval .#x, no flake.lock329container-test-run-iets-classic-e2e> ok   nix eval .#x, no flake.lock is iets's own330container-test-run-iets-classic-e2e> machine # [1675614.512380] machine nix-daemon[5314]: accepted connection from pid 8586, user alice (trusted)331container-test-run-iets-classic-e2e> ok   nix eval .#pkg.drvPath, no flake.lock332container-test-run-iets-classic-e2e> ok   nix eval .#pkg.drvPath, no flake.lock is iets's own333container-test-run-iets-classic-e2e> machine # [1675614.792341] machine nix-daemon[5314]: accepted connection from pid 8615, user alice (trusted)334container-test-run-iets-classic-e2e> machine # [1675615.011205] machine nix-daemon[5314]: accepted connection from pid 8637, user alice (trusted)335container-test-run-iets-classic-e2e> ok   nix build .#pkg, no flake.lock336container-test-run-iets-classic-e2e> ok   nix build .#pkg, no flake.lock is iets's own337container-test-run-iets-classic-e2e> ok   no flake.lock: neither side writes one338container-test-run-iets-classic-e2e> machine # [1675615.179638] machine nix-daemon[5314]: accepted connection from pid 8637, user alice (trusted)339container-test-run-iets-classic-e2e> machine # [1675615.224672] machine nix-daemon[5314]: accepted connection from pid 8674, user alice (trusted)340container-test-run-iets-classic-e2e> machine # [1675615.457338] machine nix-daemon[5314]: accepted connection from pid 8703, user alice (trusted)341container-test-run-iets-classic-e2e> ok   nix eval, farm first on PATH, fresh tree342container-test-run-iets-classic-e2e> ok   fallback through the farm marker, real nix off PATH343container-test-run-iets-classic-e2e> ok   nix eval .#pkg (a derivation)344container-test-run-iets-classic-e2e> ok   nix eval . (packages.<system>.default)345container-test-run-iets-classic-e2e> machine # [1675615.789855] machine nix-daemon[5314]: accepted connection from pid 8773, user alice (trusted)346container-test-run-iets-classic-e2e> machine # [1675615.996060] machine nix-daemon[5314]: accepted connection from pid 8802, user alice (trusted)347container-test-run-iets-classic-e2e> ok   nix eval --expr348container-test-run-iets-classic-e2e> ok   nix eval --expr is pure349container-test-run-iets-classic-e2e> ok   nix eval --impure --expr350container-test-run-iets-classic-e2e> ok   nix --option pure-eval false eval --expr351container-test-run-iets-classic-e2e> ok   nix eval -f is impure352container-test-run-iets-classic-e2e> ok   nix eval .#x is pure353container-test-run-iets-classic-e2e> ok   nix-instantiate is impure354container-test-run-iets-classic-e2e> ok   nix-instantiate --pure-eval355container-test-run-iets-classic-e2e> machine # [1675616.905311] machine nix-daemon[5314]: accepted connection from pid 8964, user alice (trusted)356container-test-run-iets-classic-e2e> ok   nix-instantiate --option pure-eval true357container-test-run-iets-classic-e2e> ok   nix-instantiate --pure-eval refuses a local file358container-test-run-iets-classic-e2e> ok   nix.conf system reaches builtins.currentSystem359container-test-run-iets-classic-e2e> ok   NIX_USER_CONF_FILES empty360container-test-run-iets-classic-e2e> ok   NIX_USER_CONF_FILES unset361container-test-run-iets-classic-e2e> ok   nix eval -f with pure-eval from the system nix.conf362container-test-run-iets-classic-e2e> ok   nix eval -f with pure-eval from a user nix.conf363container-test-run-iets-classic-e2e> ok   nix eval -f with pure-eval from NIX_CONFIG364container-test-run-iets-classic-e2e> ok   nix eval -f with pure-eval from --option365container-test-run-iets-classic-e2e> ok   nix eval -f with pure-eval from --impure366container-test-run-iets-classic-e2e> ok   instantiate -j 4294967296367container-test-run-iets-classic-e2e> ok   instantiate --cores 4294967296368container-test-run-iets-classic-e2e> ok   instantiate -j auto369container-test-run-iets-classic-e2e> ok   instantiate --cores 1K370container-test-run-iets-classic-e2e> ok   instantiate -j 2371container-test-run-iets-classic-e2e> ok   instantiate -Ifoo=/etc372container-test-run-iets-classic-e2e> ok   nix-eval-jobs prints no summary373container-test-run-iets-classic-e2e> ok   iets eval-jobs keeps its summary374container-test-run-iets-classic-e2e> ok   nix.conf 'pure-eval = maybe'375container-test-run-iets-classic-e2e> ok   nix.conf 'show-trace = maybe'376container-test-run-iets-classic-e2e> ok   nix.conf 'sandbox = maybe'377container-test-run-iets-classic-e2e> ok   nix.conf 'eval-cache = 2'378container-test-run-iets-classic-e2e> ok   nix.conf 'connect-timeout = abc'379container-test-run-iets-classic-e2e> ok   nix.conf 'cores = -1'380container-test-run-iets-classic-e2e> ok   nix.conf 'cores = 4294967296'381container-test-run-iets-classic-e2e> ok   nix.conf 'max-jobs = abc'382container-test-run-iets-classic-e2e> ok   nix.conf 'cores = 1K'383container-test-run-iets-classic-e2e> ok   nix.conf 'min-free = 2G'384container-test-run-iets-classic-e2e> ok   nix.conf 'max-jobs = auto'385container-test-run-iets-classic-e2e> ok   nix.conf 'sandbox = relaxed'386container-test-run-iets-classic-e2e> ok   nix eval --expr, a nested error387container-test-run-iets-classic-e2e> ok   nix eval --expr, repeated and empty values388container-test-run-iets-classic-e2e> ok   nix eval --expr, functions389container-test-run-iets-classic-e2e> machine # [1675625.657047] machine nix-daemon[5314]: accepted connection from pid 9805, user alice (trusted)390container-test-run-iets-classic-e2e> ok   symlink: readFile through a copy of the link itself391container-test-run-iets-classic-e2e> machine # [1675626.321091] machine nix-daemon[5314]: accepted connection from pid 9834, user alice (trusted)392container-test-run-iets-classic-e2e> ok   symlink: readFile of a target the filter left out393container-test-run-iets-classic-e2e> machine # [1675626.655984] machine nix-daemon[5314]: accepted connection from pid 9863, user alice (trusted)394container-test-run-iets-classic-e2e> ok   symlink: readDir through a copy of the link itself395container-test-run-iets-classic-e2e> machine # [1675626.975793] machine nix-daemon[5314]: accepted connection from pid 9892, user alice (trusted)396container-test-run-iets-classic-e2e> machine # [1675627.277429] machine nix-daemon[5314]: accepted connection from pid 9921, user alice (trusted)397container-test-run-iets-classic-e2e> ok   symlink: hashFile through a copy of the link itself398container-test-run-iets-classic-e2e> machine # [1675627.587852] machine nix-daemon[5314]: accepted connection from pid 9950, user alice (trusted)399container-test-run-iets-classic-e2e> ok   symlink: readFile below a link in a copied tree400container-test-run-iets-classic-e2e> ok   symlink: readDir of a link in a copied tree401container-test-run-iets-classic-e2e> ok   symlink: pathExists below a link in a copied tree402container-test-run-iets-classic-e2e> machine # [1675627.928659] machine nix-daemon[5314]: accepted connection from pid 9979, user alice (trusted)403container-test-run-iets-classic-e2e> machine # [1675628.128366] machine nix-daemon[5314]: accepted connection from pid 10008, user alice (trusted)404container-test-run-iets-classic-e2e> ok   symlink: path of a link in a copied tree405container-test-run-iets-classic-e2e> ok   symlink: path of a link, local and copied agree406container-test-run-iets-classic-e2e> machine # [1675628.425742] machine nix-daemon[5314]: accepted connection from pid 10037, user alice (trusted)407container-test-run-iets-classic-e2e> machine # [1675628.657243] machine nix-daemon[5314]: accepted connection from pid 10066, user alice (trusted)408container-test-run-iets-classic-e2e> ok   symlink: path of a dangling link409container-test-run-iets-classic-e2e> ok   symlink: path of a dangling link in a copied tree410container-test-run-iets-classic-e2e> machine # [1675628.952510] machine nix-daemon[5314]: accepted connection from pid 10095, user alice (trusted)411container-test-run-iets-classic-e2e> machine # [1675628.989330] machine nix-daemon[10115]: unexpected Nix daemon error: error: interrupted by the user412container-test-run-iets-classic-e2e> machine # [1675629.150895] machine nix-daemon[5314]: accepted connection from pid 10124, user alice (trusted)413container-test-run-iets-classic-e2e> machine # [1675629.158924] machine nix-daemon[10144]: unexpected Nix daemon error: error: interrupted by the user414container-test-run-iets-classic-e2e> machine # [1675629.303485] machine nix-daemon[5314]: accepted connection from pid 10153, user alice (trusted)415container-test-run-iets-classic-e2e> ok   symlink: storePath below a link in a copied tree416container-test-run-iets-classic-e2e> ok   symlink: filterSource sees the store path of an unfiltered copy417container-test-run-iets-classic-e2e> machine # [1675629.494124] machine nix-daemon[5314]: accepted connection from pid 10182, user alice (trusted)418container-test-run-iets-classic-e2e> ok   symlink: path keeps the references of a store path419container-test-run-iets-classic-e2e> machine # [1675629.702315] machine nix-daemon[5314]: accepted connection from pid 10211, user alice (trusted)420container-test-run-iets-classic-e2e> machine # [1675629.770011] machine nix-daemon[5314]: accepted connection from pid 10231, user alice (trusted)421container-test-run-iets-classic-e2e> machine # [1675629.906107] machine nix-daemon[5314]: accepted connection from pid 10260, user alice (trusted)422container-test-run-iets-classic-e2e> machine # [1675629.979714] machine nix-daemon[5314]: accepted connection from pid 10280, user alice (trusted)423container-test-run-iets-classic-e2e> ok   symlink: path flat refuses a store path with references424container-test-run-iets-classic-e2e> ok   nix eval -f FILE ATTR425container-test-run-iets-classic-e2e> ok   nix eval --json -f FILE ATTR426container-test-run-iets-classic-e2e> ok   auto-call a function file, defaults: nix-instantiate427container-test-run-iets-classic-e2e> ok   auto-call a function file, defaults: iets eval428container-test-run-iets-classic-e2e> ok   auto-call a '...' function file, defaults: nix-instantiate429container-test-run-iets-classic-e2e> ok   auto-call a '...' function file, defaults: iets eval430container-test-run-iets-classic-e2e> ok   auto-call a function file, --arg: nix-instantiate431container-test-run-iets-classic-e2e> ok   auto-call a function file, --arg: iets eval432container-test-run-iets-classic-e2e> ok   auto-call a '...' function file, --arg: nix-instantiate433container-test-run-iets-classic-e2e> ok   auto-call a '...' function file, --arg: iets eval434container-test-run-iets-classic-e2e> ok   auto-call a function file, --argstr: nix-instantiate435container-test-run-iets-classic-e2e> ok   auto-call a function file, --argstr: iets eval436container-test-run-iets-classic-e2e> ok   auto-call a '...' function file, --argstr: nix-instantiate437container-test-run-iets-classic-e2e> ok   auto-call a '...' function file, --argstr: iets eval438container-test-run-iets-classic-e2e> ok   a required --arg that is missing: the same first error line everywhere439container-test-run-iets-classic-e2e> ok   nix search, every package440container-test-run-iets-classic-e2e> ok   nix search --json441container-test-run-iets-classic-e2e> ok   nix search --json --pretty442container-test-run-iets-classic-e2e> ok   nix search, two regexes are ANDed443container-test-run-iets-classic-e2e> ok   nix search --exclude444container-test-run-iets-classic-e2e> ok   nix search is case insensitive445container-test-run-iets-classic-e2e> ok   nix search, a bracket expression446container-test-run-iets-classic-e2e> ok   nix search, an alternation447container-test-run-iets-classic-e2e> ok   nix search, no results448container-test-run-iets-classic-e2e> ok   nix search --json, no results449container-test-run-iets-classic-e2e> machine # [1675670.338125] machine nix-daemon[5314]: accepted connection from pid 10972, user alice (trusted)450container-test-run-iets-classic-e2e> ok   nix search nixpkgs --json ^hello$451container-test-run-iets-classic-e2e> machine # [1675707.745346] machine nix-daemon[5314]: accepted connection from pid 11002, user alice (trusted)452container-test-run-iets-classic-e2e> ok   nix search nixpkgs --json ripgrep453container-test-run-iets-classic-e2e> ok   internal-json: undefined variable in a file454container-test-run-iets-classic-e2e> ok   internal-json: missing attribute455container-test-run-iets-classic-e2e> ok   internal-json: syntax error456container-test-run-iets-classic-e2e> ok   internal-json: nix eval, missing attribute457container-test-run-iets-classic-e2e> machine # [1675760.330611] machine nix-daemon[5314]: accepted connection from pid 11129, user alice (trusted)458container-test-run-iets-classic-e2e> ok   internal-json: a failed build459container-test-run-iets-classic-e2e> machine # [1675760.984172] machine nix-daemon[5314]: accepted connection from pid 11163, user alice (trusted)460container-test-run-iets-classic-e2e> ok   internal-json: a hash mismatch461container-test-run-iets-classic-e2e> machine # [1675762.490948] machine nix-daemon[5314]: accepted connection from pid 11207, user alice (trusted)462container-test-run-iets-classic-e2e> machine # [1675762.642207] machine nix-daemon[5314]: accepted connection from pid 11241, user alice (trusted)463container-test-run-iets-classic-e2e> ok   iets build: a failed build exits 100464container-test-run-iets-classic-e2e> machine # [1675763.285152] machine nix-daemon[5314]: accepted connection from pid 11285, user alice (trusted)465container-test-run-iets-classic-e2e> machine # [1675764.693665] machine nix-daemon[5314]: accepted connection from pid 11320, user alice (trusted)466container-test-run-iets-classic-e2e> ok   iets build: the ✔ is the last line of a successful block467container-test-run-iets-classic-e2e> machine # [1675765.126156] machine nix-daemon[5314]: accepted connection from pid 11320, user alice (trusted)468container-test-run-iets-classic-e2e> ok   iets build: a hash mismatch exits 102 and names the hash469container-test-run-iets-classic-e2e> ok   iets build: every record, activities too, has one sid470container-test-run-iets-classic-e2e> machine # [1675766.322505] machine nix-daemon[5314]: accepted connection from pid 11357, user alice (trusted)471container-test-run-iets-classic-e2e> machine # [1675769.698070] machine nix-daemon[5314]: accepted connection from pid 11391, user alice (trusted)472container-test-run-iets-classic-e2e> machine # [1675775.581872] machine nix-daemon[5314]: accepted connection from pid 11391, user alice (trusted)473container-test-run-iets-classic-e2e> machine # [1675775.862920] machine nix-daemon[5314]: accepted connection from pid 11391, user alice (trusted)474container-test-run-iets-classic-e2e> ok   iets build with fix-hashes: rewrites the hash and builds475container-test-run-iets-classic-e2e> ok   iets build without a terminal: fix-hashes asks nobody, the file stays476container-test-run-iets-classic-e2e> machine # [1675777.078665] machine nix-daemon[5314]: accepted connection from pid 11441, user alice (trusted)477container-test-run-iets-classic-e2e> machine # [1675777.963806] machine nix-daemon[5314]: accepted connection from pid 11477, user alice (trusted)478container-test-run-iets-classic-e2e> ok   iets build with fix-hashes: a resolved derivation's mismatch is fixed too479container-test-run-iets-classic-e2e> machine # [1675779.932637] machine nix-daemon[5314]: accepted connection from pid 11477, user alice (trusted)480container-test-run-iets-classic-e2e> machine # [1675779.966770] machine nix-daemon[5314]: accepted connection from pid 11477, user alice (trusted)481container-test-run-iets-classic-e2e> machine # [1675782.099581] machine nix-daemon[5314]: accepted connection from pid 11532, user alice (trusted)