nixbot

builds

failed iets-nextest-0.1.0 checks.x86_64-linux.test · build #190 · raw

unpackPhase
1unpacking source archive /nix/store/l6cnbi3k1q45i0wdq7n31r5alm98fkg4-source2source root is source
patchPhase
3Executing configureCargoCommonVars4decompressing cargo artifacts from /nix/store/lyd3v788icvjq85dpxivhglg4f1b6vfk-iets-deps-0.1.0/target.tar.zst to target
configurePhase
5will append /build/source/.cargo-home/config.toml with contents of /nix/store/6d3hja68bqvwgvycz4f6g4vl7rpw6hk7-vendor-cargo-deps/config.toml6default configurePhase, nothing to do
buildPhase
7+++ command cargo --version8cargo 1.98.0 (797e8a9bc 2026-08-05)9+++ command cargo nextest --version10cargo-nextest 0.9.14311release: 0.9.14312host: x86_64-unknown-linux-gnu
checkPhase
13+++ command cargo nextest run --cargo-profile dev14 Compiling iets v0.1.0 (/build/source)15error[E0423]: expected function, found module `lz4_flex::block::decompress`16 --> src/treestore/pack.rs:207:917 |18207 | lz4_flex::block::decompress(&stored, loc.raw as usize)19 | ^^^^^^^^^^^^^^^^^^^^^^^^^^^ not a function2021error[E0423]: expected function, found module `lz4_flex::block::compress`22 --> src/treestore/pack.rs:237:1823 |24237 | .then(|| lz4_flex::block::compress(&bytes))25 | ^^^^^^^^^^^^^^^^^^^^^^^^^ not a function2627error[E0603]: module `decompress` is private28 --> src/treestore/pack.rs:207:2629 |30207 | lz4_flex::block::decompress(&stored, loc.raw as usize)31 | ^^^^^^^^^^ private module32 |33note: the module `decompress` is defined here34 --> /nix/store/6d3hja68bqvwgvycz4f6g4vl7rpw6hk7-vendor-cargo-deps/c19b7c6f923b580ac259164a89f2577984ad5ab09ee9d583b888f934adbbe8d0/lz4_flex-0.14.0/src/block/mod.rs:26:1635 |36 26 | pub(crate) use decompress_safe as decompress;37 | ^^^^^^^^^^^^^^^3839error[E0603]: module `compress` is private40 --> src/treestore/pack.rs:237:3541 |42237 | .then(|| lz4_flex::block::compress(&bytes))43 | ^^^^^^^^ private module44 |45note: the module `compress` is defined here46 --> /nix/store/6d3hja68bqvwgvycz4f6g4vl7rpw6hk7-vendor-cargo-deps/c19b7c6f923b580ac259164a89f2577984ad5ab09ee9d583b888f934adbbe8d0/lz4_flex-0.14.0/src/block/mod.rs:19:147 |48 19 | pub(crate) mod compress;49 | ^^^^^^^^^^^^^^^^^^^^^^^5051error[E0423]: expected function, found module `lz4_flex::block::decompress`52 --> src/treestore/pack.rs:207:953 |54207 | lz4_flex::block::decompress(&stored, loc.raw as usize)55 | ^^^^^^^^^^^^^^^^^^^^^^^^^^^ not a function56 |57note: function `crate::source::remote::tests::http::decompress` exists but is inaccessible58 --> src/fetch/http.rs:703:159 |60703 | pub fn decompress(bytes: Vec<u8>) -> Result<Vec<u8>> {61 | ^^^^^^^^^^^^^^^^^^^^^^^^^^^^^^^^^^^^^^^^^^^^^^^^^^^^ not accessible6263Some errors have detailed explanations: E0423, E0603.64For more information about an error, try `rustc --explain E0423`.65error: could not compile `iets` (lib) due to 4 previous errors66warning: build failed, waiting for other jobs to finish...67error: could not compile `iets` (lib test) due to 4 previous errors68error: command `/nix/store/w20n3pmhhd1av9llykxa3gd21c9jsm8l-cargo-1.98.1/bin/cargo test --no-run --message-format json-render-diagnostics --profile dev` exited with code 101