nixbot

builds

failed iets-static-x86_64-unknown-linux-musl-0.1.0 checks.x86_64-linux.static · build #190 · raw

unpackPhase
1unpacking source archive /nix/store/g2f1sw6n7dhsphwamns6kilrvknsmywj-source2source root is source
patchPhase
3Executing configureCargoCommonVars4----------------------------------------------------------------------------------5NOTICE: setting the following environment variables for cross-compilation purposes6 - if this is unwanted, you can set them to a non-empty value7 - alternatively, you can disable the built-in cross compilation support8 by setting `doIncludeCrossToolchainEnv = false` in the derivation9AR_X86_64_UNKNOWN_LINUX_GNU=/nix/store/z4c6k0mrlkwl3s4w9ysxc8vq1wylm3ms-gcc-wrapper-15.3.0/bin/ar10AR_X86_64_UNKNOWN_LINUX_MUSL=/nix/store/fpj9xnxp4apb9fydh7pj35gw8h6hdkk0-x86_64-unknown-linux-musl-gcc-wrapper-15.3.0/bin/x86_64-unknown-linux-musl-ar11CARGO_BUILD_TARGET=x86_64-unknown-linux-musl12CARGO_TARGET_X86_64_UNKNOWN_LINUX_GNU_LINKER=/nix/store/z4c6k0mrlkwl3s4w9ysxc8vq1wylm3ms-gcc-wrapper-15.3.0/bin/cc13CARGO_TARGET_X86_64_UNKNOWN_LINUX_MUSL_LINKER=/nix/store/fpj9xnxp4apb9fydh7pj35gw8h6hdkk0-x86_64-unknown-linux-musl-gcc-wrapper-15.3.0/bin/x86_64-unknown-linux-musl-cc14CC_X86_64_UNKNOWN_LINUX_GNU=/nix/store/z4c6k0mrlkwl3s4w9ysxc8vq1wylm3ms-gcc-wrapper-15.3.0/bin/cc15CC_X86_64_UNKNOWN_LINUX_MUSL=/nix/store/fpj9xnxp4apb9fydh7pj35gw8h6hdkk0-x86_64-unknown-linux-musl-gcc-wrapper-15.3.0/bin/x86_64-unknown-linux-musl-cc16CXX_X86_64_UNKNOWN_LINUX_GNU=/nix/store/z4c6k0mrlkwl3s4w9ysxc8vq1wylm3ms-gcc-wrapper-15.3.0/bin/c++17CXX_X86_64_UNKNOWN_LINUX_MUSL=/nix/store/fpj9xnxp4apb9fydh7pj35gw8h6hdkk0-x86_64-unknown-linux-musl-gcc-wrapper-15.3.0/bin/x86_64-unknown-linux-musl-c++18HOST_AR=/nix/store/z4c6k0mrlkwl3s4w9ysxc8vq1wylm3ms-gcc-wrapper-15.3.0/bin/ar19HOST_CC=/nix/store/z4c6k0mrlkwl3s4w9ysxc8vq1wylm3ms-gcc-wrapper-15.3.0/bin/cc20HOST_CXX=/nix/store/z4c6k0mrlkwl3s4w9ysxc8vq1wylm3ms-gcc-wrapper-15.3.0/bin/c++21TARGET_AR=/nix/store/fpj9xnxp4apb9fydh7pj35gw8h6hdkk0-x86_64-unknown-linux-musl-gcc-wrapper-15.3.0/bin/x86_64-unknown-linux-musl-ar22TARGET_CC=/nix/store/fpj9xnxp4apb9fydh7pj35gw8h6hdkk0-x86_64-unknown-linux-musl-gcc-wrapper-15.3.0/bin/x86_64-unknown-linux-musl-cc23TARGET_CXX=/nix/store/fpj9xnxp4apb9fydh7pj35gw8h6hdkk0-x86_64-unknown-linux-musl-gcc-wrapper-15.3.0/bin/x86_64-unknown-linux-musl-c++24----------------------------------------------------------------------------------25decompressing cargo artifacts from /nix/store/v81n4smway24c8rv28l3gb03zdiza77r-iets-deps-static-x86_64-unknown-linux-musl-0.1.0/target.tar.zst to target
configurePhase
26will append /build/source/.cargo-home/config.toml with contents of /nix/store/6d3hja68bqvwgvycz4f6g4vl7rpw6hk7-vendor-cargo-deps/config.toml27default configurePhase, nothing to do
buildPhase
28+++ command cargo --version29cargo 1.98.0 (797e8a9bc 2026-08-05)30+++ command cargo build --release --message-format json-render-diagnostics --locked31 Compiling iets v0.1.0 (/build/source)32error[E0423]: expected function, found module `lz4_flex::block::decompress`33 --> src/treestore/pack.rs:207:934 |35207 | lz4_flex::block::decompress(&stored, loc.raw as usize)36 | ^^^^^^^^^^^^^^^^^^^^^^^^^^^ not a function3738error[E0423]: expected function, found module `lz4_flex::block::compress`39 --> src/treestore/pack.rs:237:1840 |41237 | .then(|| lz4_flex::block::compress(&bytes))42 | ^^^^^^^^^^^^^^^^^^^^^^^^^ not a function4344error[E0603]: module `decompress` is private45 --> src/treestore/pack.rs:207:2646 |47207 | lz4_flex::block::decompress(&stored, loc.raw as usize)48 | ^^^^^^^^^^ private module49 |50note: the module `decompress` is defined here51 --> /nix/store/6d3hja68bqvwgvycz4f6g4vl7rpw6hk7-vendor-cargo-deps/c19b7c6f923b580ac259164a89f2577984ad5ab09ee9d583b888f934adbbe8d0/lz4_flex-0.14.0/src/block/mod.rs:26:1652 |53 26 | pub(crate) use decompress_safe as decompress;54 | ^^^^^^^^^^^^^^^5556error[E0603]: module `compress` is private57 --> src/treestore/pack.rs:237:3558 |59237 | .then(|| lz4_flex::block::compress(&bytes))60 | ^^^^^^^^ private module61 |62note: the module `compress` is defined here63 --> /nix/store/6d3hja68bqvwgvycz4f6g4vl7rpw6hk7-vendor-cargo-deps/c19b7c6f923b580ac259164a89f2577984ad5ab09ee9d583b888f934adbbe8d0/lz4_flex-0.14.0/src/block/mod.rs:19:164 |65 19 | pub(crate) mod compress;66 | ^^^^^^^^^^^^^^^^^^^^^^^6768Some errors have detailed explanations: E0423, E0603.69For more information about an error, try `rustc --explain E0423`.70error: could not compile `iets` (lib) due to 4 previous errors