nixbot

builds

failed iets-0.1.0 checks.x86_64-linux.langtests · build #190 · raw

unpackPhase
1unpacking source archive /nix/store/g2f1sw6n7dhsphwamns6kilrvknsmywj-source2source root is source
patchPhase
3Executing configureCargoCommonVars4decompressing cargo artifacts from /nix/store/6hl89n89rglpwf0skprlssjifnxa6rvy-iets-deps-0.1.0/target.tar.zst to target
configurePhase
5will append /build/source/.cargo-home/config.toml with contents of /nix/store/6d3hja68bqvwgvycz4f6g4vl7rpw6hk7-vendor-cargo-deps/config.toml6default configurePhase, nothing to do
buildPhase
7+++ command cargo --version8cargo 1.98.0 (797e8a9bc 2026-08-05)9+++ command cargo build --release --message-format json-render-diagnostics --locked10 Compiling iets v0.1.0 (/build/source)11error[E0423]: expected function, found module `lz4_flex::block::decompress`12 --> src/treestore/pack.rs:207:913 |14207 | lz4_flex::block::decompress(&stored, loc.raw as usize)15 | ^^^^^^^^^^^^^^^^^^^^^^^^^^^ not a function1617error[E0423]: expected function, found module `lz4_flex::block::compress`18 --> src/treestore/pack.rs:237:1819 |20237 | .then(|| lz4_flex::block::compress(&bytes))21 | ^^^^^^^^^^^^^^^^^^^^^^^^^ not a function2223error[E0603]: module `decompress` is private24 --> src/treestore/pack.rs:207:2625 |26207 | lz4_flex::block::decompress(&stored, loc.raw as usize)27 | ^^^^^^^^^^ private module28 |29note: the module `decompress` is defined here30 --> /nix/store/6d3hja68bqvwgvycz4f6g4vl7rpw6hk7-vendor-cargo-deps/c19b7c6f923b580ac259164a89f2577984ad5ab09ee9d583b888f934adbbe8d0/lz4_flex-0.14.0/src/block/mod.rs:26:1631 |32 26 | pub(crate) use decompress_safe as decompress;33 | ^^^^^^^^^^^^^^^3435error[E0603]: module `compress` is private36 --> src/treestore/pack.rs:237:3537 |38237 | .then(|| lz4_flex::block::compress(&bytes))39 | ^^^^^^^^ private module40 |41note: the module `compress` is defined here42 --> /nix/store/6d3hja68bqvwgvycz4f6g4vl7rpw6hk7-vendor-cargo-deps/c19b7c6f923b580ac259164a89f2577984ad5ab09ee9d583b888f934adbbe8d0/lz4_flex-0.14.0/src/block/mod.rs:19:143 |44 19 | pub(crate) mod compress;45 | ^^^^^^^^^^^^^^^^^^^^^^^4647Some errors have detailed explanations: E0423, E0603.48For more information about an error, try `rustc --explain E0423`.49error: could not compile `iets` (lib) due to 4 previous errors