iets-fuzzers-0.0.0
checks.x86_64-linux.fuzz-parse
· build #190
· raw
unpackPhase
1unpacking source archive /nix/store/348zizg6xfqmyk3ns37qz500jv7h2bry-source2source root is source3Executing cargoSetupPostUnpackHook4Finished cargoSetupPostUnpackHookpatchPhase
5Executing cargoSetupPostPatchHook6Validating consistency between /build/source/fuzz/Cargo.lock and /build/cargo-vendor-dir/Cargo.lock7Finished cargoSetupPostPatchHookbuildPhase
8 Compiling libc v0.2.1909 Compiling proc-macro2 v1.0.10710 Compiling quote v1.0.4711 Compiling unicode-ident v1.0.2612 Compiling shlex v2.0.113 Compiling find-msvc-tools v0.1.1414 Compiling cfg-if v1.0.515 Compiling bytes v1.12.116 Compiling memchr v2.8.317 Compiling pin-project-lite v0.2.1718 Compiling anyhow v1.0.10419 Compiling either v1.19.020 Compiling regex-syntax v0.8.1121 Compiling futures-core v0.3.3422 Compiling once_cell v1.21.423 Compiling itoa v1.0.1824 Compiling getrandom v0.4.325 Compiling typenum v1.20.126 Compiling futures-sink v0.3.3427 Compiling equivalent v1.0.228 Compiling zeroize v1.9.129 Compiling hashbrown v0.17.130 Compiling bitflags v2.13.231 Compiling fnv v1.0.732 Compiling slab v0.4.1233 Compiling prettyplease v0.2.3734 Compiling httparse v1.10.135 Compiling pulldown-cmark v0.13.436 Compiling rustix v1.1.537 Compiling untrusted v0.9.038 Compiling try-lock v0.2.539 Compiling linux-raw-sys v0.12.140 Compiling atomic-waker v1.1.241 Compiling pkg-config v0.3.3442 Compiling thiserror v2.0.2143 Compiling futures-task v0.3.3444 Compiling unicode-width v0.1.1445 Compiling serde_core v1.0.22946 Compiling unicase v2.10.047 Compiling foldhash v0.1.548 Compiling tower-service v0.3.349 Compiling rustls v0.23.4550 Compiling fixedbitset v0.5.751 Compiling httpdate v1.0.352 Compiling smallvec v1.16.253 Compiling const-oid v0.10.254 Compiling fastrand v2.5.055 Compiling futures-channel v0.3.3456 Compiling want v0.3.257 Compiling log v0.4.3458 Compiling heck v0.5.059 Compiling cpufeatures v0.3.160 Compiling subtle v2.6.161 Compiling rustls-pki-types v1.15.162 Compiling hashbrown v0.15.563 Compiling futures-util v0.3.3464 Compiling multimap v0.10.165 Compiling itertools v0.14.066 Compiling tracing-core v0.1.3667 Compiling zmij v1.0.2368 Compiling sync_wrapper v1.0.269 Compiling tower-layer v0.3.370 Compiling zstd-safe v8.1.071 Compiling crc32fast v1.5.272 Compiling base64 v0.22.173 Compiling simd-adler32 v0.3.1074 Compiling serde_json v1.0.15275 Compiling percent-encoding v2.3.276 Compiling cty v0.2.277 Compiling adler2 v2.0.178 Compiling winnow v1.0.479 Compiling openssl-probe v0.2.180 Compiling libbz2-rs-sys v0.2.581 Compiling arrayvec v0.7.882 Compiling toml_writer v1.1.3+spec-1.1.083 Compiling constant_time_eq v0.4.284 Compiling lz4_flex v0.14.085 Compiling arbitrary v1.5.086 Compiling miniz_oxide v0.9.187 Compiling aho-corasick v1.1.588 Compiling webpki-roots v1.0.989 Compiling rustls-native-certs v0.8.490 Compiling indexmap v2.14.291 Compiling http v1.5.092 Compiling toml_parser v1.1.5+spec-1.1.093 Compiling bzip2 v0.6.194 Compiling flate2 v1.1.1095 Compiling hybrid-array v0.4.1596 Compiling syn v2.0.11997 Compiling syn v3.0.698 Compiling petgraph v0.8.399 Compiling pulldown-cmark-to-cmark v22.0.3100 Compiling block-buffer v0.12.1101 Compiling crypto-common v0.2.2102 Compiling http-body v1.1.0103 Compiling regex-automata v0.4.18104 Compiling http-body-util v0.1.5105 Compiling mio v1.2.4106 Compiling socket2 v0.6.5107 Compiling getrandom v0.2.17108 Compiling filetime v0.2.29109 Compiling jobserver v0.1.35110 Compiling tar v0.4.46111 Compiling cc v1.6.0112 Compiling digest v0.11.3113 Compiling sha2 v0.11.0114 Compiling tempfile v3.27.0115 Compiling sha1 v0.11.0116 Compiling md-5 v0.11.0117 Compiling lzma-rust2 v0.21.0118 Compiling serde_spanned v1.1.2119 Compiling toml_datetime v1.1.2+spec-1.1.0120 Compiling ring v0.17.14121 Compiling zstd-sys v2.1.1+zstd.1.5.7122 Compiling libmimalloc-sys v0.1.49123 Compiling blake3 v1.8.7124 Compiling libfuzzer-sys v0.4.13125 Compiling toml v1.1.8+spec-1.1.0126 Compiling tokio-macros v2.7.2127 Compiling thiserror-impl v2.0.21128 Compiling async-trait v0.1.92129 Compiling logos-codegen v0.16.1130 Compiling regex v1.13.1131 Compiling tonic-build v0.14.6132 Compiling tokio v1.53.2133 Compiling prost-derive v0.14.4134 Compiling tracing-attributes v0.1.31135 Compiling miette-derive v7.6.0136 Compiling pin-project-internal v1.1.13137 Compiling logos-derive v0.16.1138 Compiling miette v7.6.0139 Compiling pin-project v1.1.13140 Compiling tracing v0.1.44141 Compiling logos v0.16.1142 Compiling prost v0.14.4143 Compiling prost-types v0.14.4144 Compiling protox-parse v0.10.0145 Compiling prost-reflect v0.16.5146 Compiling prost-build v0.14.4147 Compiling tonic-prost-build v0.14.6148 Compiling mimalloc v0.1.52149 Compiling rustls-webpki v0.103.15150 Compiling tokio-util v0.7.19151 Compiling tokio-stream v0.1.19152 Compiling protox v0.10.0153 Compiling h2 v0.4.20154 Compiling tower v0.5.3155 Compiling iets v0.1.0 (/build/source)156 Compiling hyper v1.12.0157 Compiling tokio-rustls v0.26.6158 Compiling hyper-util v0.1.21159 Compiling zstd v0.14.2160 Compiling hyper-timeout v0.5.2161 Compiling tonic v0.14.6162 Compiling tonic-prost v0.14.6163error[E0423]: expected function, found module `lz4_flex::block::decompress`164 --> /build/source/src/treestore/pack.rs:207:9165 |166207 | lz4_flex::block::decompress(&stored, loc.raw as usize)167 | ^^^^^^^^^^^^^^^^^^^^^^^^^^^ not a function168169error[E0423]: expected function, found module `lz4_flex::block::compress`170 --> /build/source/src/treestore/pack.rs:237:18171 |172237 | .then(|| lz4_flex::block::compress(&bytes))173 | ^^^^^^^^^^^^^^^^^^^^^^^^^ not a function174175error[E0603]: module `decompress` is private176 --> /build/source/src/treestore/pack.rs:207:26177 |178207 | lz4_flex::block::decompress(&stored, loc.raw as usize)179 | ^^^^^^^^^^ private module180 |181note: the module `decompress` is defined here182 --> /build/cargo-vendor-dir/lz4_flex-0.14.0/src/block/mod.rs:26:16183 |184 26 | pub(crate) use decompress_safe as decompress;185 | ^^^^^^^^^^^^^^^186187error[E0603]: module `compress` is private188 --> /build/source/src/treestore/pack.rs:237:35189 |190237 | .then(|| lz4_flex::block::compress(&bytes))191 | ^^^^^^^^ private module192 |193note: the module `compress` is defined here194 --> /build/cargo-vendor-dir/lz4_flex-0.14.0/src/block/mod.rs:19:1195 |196 19 | pub(crate) mod compress;197 | ^^^^^^^^^^^^^^^^^^^^^^^198199Some errors have detailed explanations: E0423, E0603.200For more information about an error, try `rustc --explain E0423`.201error: could not compile `iets` (lib) due to 4 previous errors202warning: build failed, waiting for other jobs to finish...203Error: failed to build fuzz script: RUSTFLAGS=" -Cpasses=sancov-module -Cllvm-args=-sanitizer-coverage-level=4 -Cllvm-args=-sanitizer-coverage-inline-8bit-counters -Cllvm-args=-sanitizer-coverage-pc-table -Cllvm-args=-sanitizer-coverage-trace-compares --cfg fuzzing -Cllvm-args=-simplifycfg-branch-fold-threshold=0 -Cllvm-args=-sanitizer-coverage-stack-depth -Ccodegen-units=1" "cargo" "build" "--manifest-path" "/build/source/fuzz/Cargo.toml" "--target" "x86_64-unknown-linux-gnu" "--release" "--config" "profile.release.debug=\"line-tables-only\"" "--bin" "drv-eval"