iets-fuzz-diff-0.0.0
checks.x86_64-linux.fuzz-nar
· build #190
· raw
unpackPhase
1unpacking source archive /nix/store/348zizg6xfqmyk3ns37qz500jv7h2bry-source2source root is sourcepatchPhase
3moving Cargo.lock to Cargo.lock.orig, then will use /nix/store/x5fb9rdfs3v03iygc1a65rdpqkn584p0-Cargo.lock as Cargo.lock4Executing configureCargoCommonVars5decompressing cargo artifacts from /nix/store/62x8xjj97gkl1y7fqc16kwbhqhwz0ksb-iets-fuzz-diff-deps-0.0.0/target.tar.zst to targetconfigurePhase
6will append /build/source/fuzz/.cargo-home/config.toml with contents of /nix/store/5r1kwxcjfqcj191yh6zgdr4vfzd72z6h-vendor-cargo-deps/config.toml7default configurePhase, nothing to dobuildPhase
8+++ command cargo --version9cargo 1.98.0 (797e8a9bc 2026-08-05)10+++ command cargo build --release --message-format json-render-diagnostics --locked --bin fuzz-diff --bin conformance-adapter11 Compiling iets v0.1.0 (/build/source)12error[E0423]: expected function, found module `lz4_flex::block::decompress`13 --> /build/source/src/treestore/pack.rs:207:914 |15207 | lz4_flex::block::decompress(&stored, loc.raw as usize)16 | ^^^^^^^^^^^^^^^^^^^^^^^^^^^ not a function1718error[E0423]: expected function, found module `lz4_flex::block::compress`19 --> /build/source/src/treestore/pack.rs:237:1820 |21237 | .then(|| lz4_flex::block::compress(&bytes))22 | ^^^^^^^^^^^^^^^^^^^^^^^^^ not a function2324error[E0603]: module `decompress` is private25 --> /build/source/src/treestore/pack.rs:207:2626 |27207 | lz4_flex::block::decompress(&stored, loc.raw as usize)28 | ^^^^^^^^^^ private module29 |30note: the module `decompress` is defined here31 --> /nix/store/5r1kwxcjfqcj191yh6zgdr4vfzd72z6h-vendor-cargo-deps/c19b7c6f923b580ac259164a89f2577984ad5ab09ee9d583b888f934adbbe8d0/lz4_flex-0.14.0/src/block/mod.rs:26:1632 |33 26 | pub(crate) use decompress_safe as decompress;34 | ^^^^^^^^^^^^^^^3536error[E0603]: module `compress` is private37 --> /build/source/src/treestore/pack.rs:237:3538 |39237 | .then(|| lz4_flex::block::compress(&bytes))40 | ^^^^^^^^ private module41 |42note: the module `compress` is defined here43 --> /nix/store/5r1kwxcjfqcj191yh6zgdr4vfzd72z6h-vendor-cargo-deps/c19b7c6f923b580ac259164a89f2577984ad5ab09ee9d583b888f934adbbe8d0/lz4_flex-0.14.0/src/block/mod.rs:19:144 |45 19 | pub(crate) mod compress;46 | ^^^^^^^^^^^^^^^^^^^^^^^4748Some errors have detailed explanations: E0423, E0603.49For more information about an error, try `rustc --explain E0423`.50error: could not compile `iets` (lib) due to 4 previous errors