iets-fuzzers-0.0.0
checks.x86_64-linux.fuzz-eval
· build #190
· raw
unpackPhase
1unpacking source archive /nix/store/348zizg6xfqmyk3ns37qz500jv7h2bry-source2source root is source3Executing cargoSetupPostUnpackHook4Finished cargoSetupPostUnpackHookpatchPhase
5Executing cargoSetupPostPatchHook6Validating consistency between /build/source/fuzz/Cargo.lock and /build/cargo-vendor-dir/Cargo.lock7Finished cargoSetupPostPatchHookbuildPhase
8 Compiling libc v0.2.1909 Compiling proc-macro2 v1.0.10710 Compiling unicode-ident v1.0.2611 Compiling quote v1.0.4712 Compiling find-msvc-tools v0.1.1413 Compiling shlex v2.0.114 Compiling cfg-if v1.0.515 Compiling bytes v1.12.116 Compiling memchr v2.8.317 Compiling anyhow v1.0.10418 Compiling pin-project-lite v0.2.1719 Compiling either v1.19.020 Compiling regex-syntax v0.8.1121 Compiling futures-core v0.3.3422 Compiling once_cell v1.21.423 Compiling itoa v1.0.1824 Compiling getrandom v0.4.325 Compiling hashbrown v0.17.126 Compiling fnv v1.0.727 Compiling zeroize v1.9.128 Compiling slab v0.4.1229 Compiling equivalent v1.0.230 Compiling futures-sink v0.3.3431 Compiling bitflags v2.13.232 Compiling typenum v1.20.133 Compiling pulldown-cmark v0.13.434 Compiling rustix v1.1.535 Compiling prettyplease v0.2.3736 Compiling httparse v1.10.137 Compiling unicode-width v0.1.1438 Compiling thiserror v2.0.2139 Compiling atomic-waker v1.1.240 Compiling serde_core v1.0.22941 Compiling linux-raw-sys v0.12.142 Compiling unicase v2.10.043 Compiling try-lock v0.2.544 Compiling futures-task v0.3.3445 Compiling untrusted v0.9.046 Compiling pkg-config v0.3.3447 Compiling foldhash v0.1.548 Compiling httpdate v1.0.349 Compiling smallvec v1.16.250 Compiling fixedbitset v0.5.751 Compiling want v0.3.252 Compiling fastrand v2.5.053 Compiling rustls v0.23.4554 Compiling tower-service v0.3.355 Compiling futures-channel v0.3.3456 Compiling const-oid v0.10.257 Compiling rustls-pki-types v1.15.158 Compiling futures-util v0.3.3459 Compiling hashbrown v0.15.560 Compiling log v0.4.3461 Compiling multimap v0.10.162 Compiling subtle v2.6.163 Compiling cpufeatures v0.3.164 Compiling heck v0.5.065 Compiling zstd-safe v8.1.066 Compiling tower-layer v0.3.367 Compiling zmij v1.0.2368 Compiling sync_wrapper v1.0.269 Compiling crc32fast v1.5.270 Compiling serde_json v1.0.15271 Compiling adler2 v2.0.172 Compiling itertools v0.14.073 Compiling cty v0.2.274 Compiling base64 v0.22.175 Compiling percent-encoding v2.3.276 Compiling simd-adler32 v0.3.1077 Compiling winnow v1.0.478 Compiling openssl-probe v0.2.179 Compiling tracing-core v0.1.3680 Compiling toml_writer v1.1.3+spec-1.1.081 Compiling arrayvec v0.7.882 Compiling libbz2-rs-sys v0.2.583 Compiling constant_time_eq v0.4.284 Compiling arbitrary v1.5.085 Compiling lz4_flex v0.14.086 Compiling miniz_oxide v0.9.187 Compiling webpki-roots v1.0.988 Compiling rustls-native-certs v0.8.489 Compiling aho-corasick v1.1.590 Compiling flate2 v1.1.1091 Compiling indexmap v2.14.292 Compiling toml_parser v1.1.5+spec-1.1.093 Compiling bzip2 v0.6.194 Compiling hybrid-array v0.4.1595 Compiling http v1.5.096 Compiling syn v2.0.11997 Compiling syn v3.0.698 Compiling mio v1.2.499 Compiling socket2 v0.6.5100 Compiling getrandom v0.2.17101 Compiling filetime v0.2.29102 Compiling tar v0.4.46103 Compiling crypto-common v0.2.2104 Compiling block-buffer v0.12.1105 Compiling pulldown-cmark-to-cmark v22.0.3106 Compiling jobserver v0.1.35107 Compiling cc v1.6.0108 Compiling petgraph v0.8.3109 Compiling regex-automata v0.4.18110 Compiling tempfile v3.27.0111 Compiling http-body v1.1.0112 Compiling http-body-util v0.1.5113 Compiling digest v0.11.3114 Compiling sha2 v0.11.0115 Compiling sha1 v0.11.0116 Compiling md-5 v0.11.0117 Compiling serde_spanned v1.1.2118 Compiling toml_datetime v1.1.2+spec-1.1.0119 Compiling lzma-rust2 v0.21.0120 Compiling toml v1.1.8+spec-1.1.0121 Compiling ring v0.17.14122 Compiling zstd-sys v2.1.1+zstd.1.5.7123 Compiling libmimalloc-sys v0.1.49124 Compiling blake3 v1.8.7125 Compiling libfuzzer-sys v0.4.13126 Compiling logos-codegen v0.16.1127 Compiling regex v1.13.1128 Compiling tonic-build v0.14.6129 Compiling tokio-macros v2.7.2130 Compiling thiserror-impl v2.0.21131 Compiling async-trait v0.1.92132 Compiling prost-derive v0.14.4133 Compiling tracing-attributes v0.1.31134 Compiling miette-derive v7.6.0135 Compiling pin-project-internal v1.1.13136 Compiling tokio v1.53.2137 Compiling logos-derive v0.16.1138 Compiling pin-project v1.1.13139 Compiling miette v7.6.0140 Compiling prost v0.14.4141 Compiling logos v0.16.1142 Compiling tracing v0.1.44143 Compiling prost-types v0.14.4144 Compiling mimalloc v0.1.52145 Compiling prost-reflect v0.16.5146 Compiling protox-parse v0.10.0147 Compiling prost-build v0.14.4148 Compiling tonic-prost-build v0.14.6149 Compiling rustls-webpki v0.103.15150 Compiling protox v0.10.0151 Compiling tokio-util v0.7.19152 Compiling tokio-stream v0.1.19153 Compiling h2 v0.4.20154 Compiling tower v0.5.3155 Compiling iets v0.1.0 (/build/source)156 Compiling hyper v1.12.0157 Compiling zstd v0.14.2158 Compiling tokio-rustls v0.26.6159 Compiling hyper-util v0.1.21160 Compiling hyper-timeout v0.5.2161 Compiling tonic v0.14.6162 Compiling tonic-prost v0.14.6163error[E0423]: expected function, found module `lz4_flex::block::decompress`164 --> /build/source/src/treestore/pack.rs:207:9165 |166207 | lz4_flex::block::decompress(&stored, loc.raw as usize)167 | ^^^^^^^^^^^^^^^^^^^^^^^^^^^ not a function168169error[E0423]: expected function, found module `lz4_flex::block::compress`170 --> /build/source/src/treestore/pack.rs:237:18171 |172237 | .then(|| lz4_flex::block::compress(&bytes))173 | ^^^^^^^^^^^^^^^^^^^^^^^^^ not a function174175error[E0603]: module `decompress` is private176 --> /build/source/src/treestore/pack.rs:207:26177 |178207 | lz4_flex::block::decompress(&stored, loc.raw as usize)179 | ^^^^^^^^^^ private module180 |181note: the module `decompress` is defined here182 --> /build/cargo-vendor-dir/lz4_flex-0.14.0/src/block/mod.rs:26:16183 |184 26 | pub(crate) use decompress_safe as decompress;185 | ^^^^^^^^^^^^^^^186187error[E0603]: module `compress` is private188 --> /build/source/src/treestore/pack.rs:237:35189 |190237 | .then(|| lz4_flex::block::compress(&bytes))191 | ^^^^^^^^ private module192 |193note: the module `compress` is defined here194 --> /build/cargo-vendor-dir/lz4_flex-0.14.0/src/block/mod.rs:19:1195 |196 19 | pub(crate) mod compress;197 | ^^^^^^^^^^^^^^^^^^^^^^^198199Some errors have detailed explanations: E0423, E0603.200For more information about an error, try `rustc --explain E0423`.201error: could not compile `iets` (lib) due to 4 previous errors202warning: build failed, waiting for other jobs to finish...203Error: failed to build fuzz script: RUSTFLAGS=" -Cpasses=sancov-module -Cllvm-args=-sanitizer-coverage-level=4 -Cllvm-args=-sanitizer-coverage-inline-8bit-counters -Cllvm-args=-sanitizer-coverage-pc-table -Cllvm-args=-sanitizer-coverage-trace-compares --cfg fuzzing -Cllvm-args=-simplifycfg-branch-fold-threshold=0 -Cllvm-args=-sanitizer-coverage-stack-depth -Ccodegen-units=1" "cargo" "build" "--manifest-path" "/build/source/fuzz/Cargo.toml" "--target" "x86_64-unknown-linux-gnu" "--release" "--config" "profile.release.debug=\"line-tables-only\"" "--bin" "drv-eval"