iets-riscv64-unknown-linux-gnu-0.1.0
checks.x86_64-linux.cross-riscv64
· build #190
· raw
unpackPhase
1unpacking source archive /nix/store/g2f1sw6n7dhsphwamns6kilrvknsmywj-source2source root is sourcepatchPhase
3Executing configureCargoCommonVars4----------------------------------------------------------------------------------5NOTICE: setting the following environment variables for cross-compilation purposes6 - if this is unwanted, you can set them to a non-empty value7 - alternatively, you can disable the built-in cross compilation support8 by setting `doIncludeCrossToolchainEnv = false` in the derivation9AR_RISCV64GC_UNKNOWN_LINUX_GNU=/nix/store/4j2mwxqjvnyr6da0925sp0bm4jaj5r5i-riscv64-unknown-linux-gnu-gcc-wrapper-15.3.0/bin/riscv64-unknown-linux-gnu-ar10AR_X86_64_UNKNOWN_LINUX_GNU=/nix/store/z4c6k0mrlkwl3s4w9ysxc8vq1wylm3ms-gcc-wrapper-15.3.0/bin/ar11CARGO_BUILD_TARGET=riscv64gc-unknown-linux-gnu12CARGO_TARGET_RISCV64GC_UNKNOWN_LINUX_GNU_LINKER=/nix/store/4j2mwxqjvnyr6da0925sp0bm4jaj5r5i-riscv64-unknown-linux-gnu-gcc-wrapper-15.3.0/bin/riscv64-unknown-linux-gnu-cc13CARGO_TARGET_RISCV64GC_UNKNOWN_LINUX_GNU_RUNNER=/nix/store/mry40rpx1wclfkchaandw06m562xc0h8-qemu-user-11.1.0/bin/qemu-riscv6414CARGO_TARGET_X86_64_UNKNOWN_LINUX_GNU_LINKER=/nix/store/z4c6k0mrlkwl3s4w9ysxc8vq1wylm3ms-gcc-wrapper-15.3.0/bin/cc15CC_RISCV64GC_UNKNOWN_LINUX_GNU=/nix/store/4j2mwxqjvnyr6da0925sp0bm4jaj5r5i-riscv64-unknown-linux-gnu-gcc-wrapper-15.3.0/bin/riscv64-unknown-linux-gnu-cc16CC_X86_64_UNKNOWN_LINUX_GNU=/nix/store/z4c6k0mrlkwl3s4w9ysxc8vq1wylm3ms-gcc-wrapper-15.3.0/bin/cc17CXX_RISCV64GC_UNKNOWN_LINUX_GNU=/nix/store/4j2mwxqjvnyr6da0925sp0bm4jaj5r5i-riscv64-unknown-linux-gnu-gcc-wrapper-15.3.0/bin/riscv64-unknown-linux-gnu-c++18CXX_X86_64_UNKNOWN_LINUX_GNU=/nix/store/z4c6k0mrlkwl3s4w9ysxc8vq1wylm3ms-gcc-wrapper-15.3.0/bin/c++19HOST_AR=/nix/store/z4c6k0mrlkwl3s4w9ysxc8vq1wylm3ms-gcc-wrapper-15.3.0/bin/ar20HOST_CC=/nix/store/z4c6k0mrlkwl3s4w9ysxc8vq1wylm3ms-gcc-wrapper-15.3.0/bin/cc21HOST_CXX=/nix/store/z4c6k0mrlkwl3s4w9ysxc8vq1wylm3ms-gcc-wrapper-15.3.0/bin/c++22TARGET_AR=/nix/store/4j2mwxqjvnyr6da0925sp0bm4jaj5r5i-riscv64-unknown-linux-gnu-gcc-wrapper-15.3.0/bin/riscv64-unknown-linux-gnu-ar23TARGET_CC=/nix/store/4j2mwxqjvnyr6da0925sp0bm4jaj5r5i-riscv64-unknown-linux-gnu-gcc-wrapper-15.3.0/bin/riscv64-unknown-linux-gnu-cc24TARGET_CXX=/nix/store/4j2mwxqjvnyr6da0925sp0bm4jaj5r5i-riscv64-unknown-linux-gnu-gcc-wrapper-15.3.0/bin/riscv64-unknown-linux-gnu-c++25----------------------------------------------------------------------------------26decompressing cargo artifacts from /nix/store/wvw90fnwclljn8nc2ri04l954hmiikhy-iets-deps-riscv64-unknown-linux-gnu-0.1.0/target.tar.zst to targetconfigurePhase
27will append /build/source/.cargo-home/config.toml with contents of /nix/store/6d3hja68bqvwgvycz4f6g4vl7rpw6hk7-vendor-cargo-deps/config.toml28default configurePhase, nothing to dobuildPhase
29+++ command cargo --version30cargo 1.98.0 (797e8a9bc 2026-08-05)31+++ command cargo build --release --message-format json-render-diagnostics --locked32 Compiling iets v0.1.0 (/build/source)33error[E0423]: expected function, found module `lz4_flex::block::decompress`34 --> src/treestore/pack.rs:207:935 |36207 | lz4_flex::block::decompress(&stored, loc.raw as usize)37 | ^^^^^^^^^^^^^^^^^^^^^^^^^^^ not a function3839error[E0423]: expected function, found module `lz4_flex::block::compress`40 --> src/treestore/pack.rs:237:1841 |42237 | .then(|| lz4_flex::block::compress(&bytes))43 | ^^^^^^^^^^^^^^^^^^^^^^^^^ not a function4445error[E0603]: module `decompress` is private46 --> src/treestore/pack.rs:207:2647 |48207 | lz4_flex::block::decompress(&stored, loc.raw as usize)49 | ^^^^^^^^^^ private module50 |51note: the module `decompress` is defined here52 --> /nix/store/6d3hja68bqvwgvycz4f6g4vl7rpw6hk7-vendor-cargo-deps/c19b7c6f923b580ac259164a89f2577984ad5ab09ee9d583b888f934adbbe8d0/lz4_flex-0.14.0/src/block/mod.rs:26:1653 |54 26 | pub(crate) use decompress_safe as decompress;55 | ^^^^^^^^^^^^^^^5657error[E0603]: module `compress` is private58 --> src/treestore/pack.rs:237:3559 |60237 | .then(|| lz4_flex::block::compress(&bytes))61 | ^^^^^^^^ private module62 |63note: the module `compress` is defined here64 --> /nix/store/6d3hja68bqvwgvycz4f6g4vl7rpw6hk7-vendor-cargo-deps/c19b7c6f923b580ac259164a89f2577984ad5ab09ee9d583b888f934adbbe8d0/lz4_flex-0.14.0/src/block/mod.rs:19:165 |66 19 | pub(crate) mod compress;67 | ^^^^^^^^^^^^^^^^^^^^^^^6869Some errors have detailed explanations: E0423, E0603.70For more information about an error, try `rustc --explain E0423`.71error: could not compile `iets` (lib) due to 4 previous errors