nixbot

builds

failed iets-nextest-0.1.0 checks.aarch64-linux.test · build #190 · raw

1elastic-arm-0a911f46: building 51l7qbpyppb0drz12i8m5hdyjhpq7c2a-iets-nextest-0.1.0.drv
unpackPhase
2unpacking source archive /nix/store/l6cnbi3k1q45i0wdq7n31r5alm98fkg4-source3source root is source
patchPhase
4Executing configureCargoCommonVars5decompressing cargo artifacts from /nix/store/a4nhfwd4bminlsai07bg0i4q4p1ml6v5-iets-deps-0.1.0/target.tar.zst to target
configurePhase
6will append /build/source/.cargo-home/config.toml with contents of /nix/store/shbr2n0kq1cgw1m56cb2153vlg9n1b7i-vendor-cargo-deps/config.toml7default configurePhase, nothing to do
buildPhase
8+++ command cargo --version9cargo 1.98.0 (797e8a9bc 2026-08-05)10+++ command cargo nextest --version11cargo-nextest 0.9.14312release: 0.9.14313host: aarch64-unknown-linux-gnu
checkPhase
14+++ command cargo nextest run --cargo-profile dev15 Compiling iets v0.1.0 (/build/source)16error[E0423]: expected function, found module `lz4_flex::block::decompress`17 --> src/treestore/pack.rs:207:918 |19207 | lz4_flex::block::decompress(&stored, loc.raw as usize)20 | ^^^^^^^^^^^^^^^^^^^^^^^^^^^ not a function2122error[E0423]: expected function, found module `lz4_flex::block::compress`23 --> src/treestore/pack.rs:237:1824 |25237 | .then(|| lz4_flex::block::compress(&bytes))26 | ^^^^^^^^^^^^^^^^^^^^^^^^^ not a function2728error[E0603]: module `decompress` is private29 --> src/treestore/pack.rs:207:2630 |31207 | lz4_flex::block::decompress(&stored, loc.raw as usize)32 | ^^^^^^^^^^ private module33 |34note: the module `decompress` is defined here35 --> /nix/store/shbr2n0kq1cgw1m56cb2153vlg9n1b7i-vendor-cargo-deps/c19b7c6f923b580ac259164a89f2577984ad5ab09ee9d583b888f934adbbe8d0/lz4_flex-0.14.0/src/block/mod.rs:26:1636 |37 26 | pub(crate) use decompress_safe as decompress;38 | ^^^^^^^^^^^^^^^3940error[E0603]: module `compress` is private41 --> src/treestore/pack.rs:237:3542 |43237 | .then(|| lz4_flex::block::compress(&bytes))44 | ^^^^^^^^ private module45 |46note: the module `compress` is defined here47 --> /nix/store/shbr2n0kq1cgw1m56cb2153vlg9n1b7i-vendor-cargo-deps/c19b7c6f923b580ac259164a89f2577984ad5ab09ee9d583b888f934adbbe8d0/lz4_flex-0.14.0/src/block/mod.rs:19:148 |49 19 | pub(crate) mod compress;50 | ^^^^^^^^^^^^^^^^^^^^^^^5152error[E0423]: expected function, found module `lz4_flex::block::decompress`53 --> src/treestore/pack.rs:207:954 |55207 | lz4_flex::block::decompress(&stored, loc.raw as usize)56 | ^^^^^^^^^^^^^^^^^^^^^^^^^^^ not a function57 |58note: function `crate::source::remote::tests::http::decompress` exists but is inaccessible59 --> src/fetch/http.rs:703:160 |61703 | pub fn decompress(bytes: Vec<u8>) -> Result<Vec<u8>> {62 | ^^^^^^^^^^^^^^^^^^^^^^^^^^^^^^^^^^^^^^^^^^^^^^^^^^^^ not accessible6364Some errors have detailed explanations: E0423, E0603.65For more information about an error, try `rustc --explain E0423`.66error: could not compile `iets` (lib) due to 4 previous errors67warning: build failed, waiting for other jobs to finish...68error: could not compile `iets` (lib test) due to 4 previous errors69error: command `/nix/store/db6sk165478iv0z0yjb4b1v5m5ll9kdc-cargo-1.98.1/bin/cargo test --no-run --message-format json-render-diagnostics --profile dev` exited with code 101