nixbot

builds

failed iets-static-aarch64-unknown-linux-musl-0.1.0 checks.aarch64-linux.static · build #190 · raw

1elastic-arm-f5251078: building p3naa6qyn1pwsb4nsfljkq4gg6iba7m0-iets-static-aarch64-unknown-linux-musl-0.1.0.drv
unpackPhase
2unpacking source archive /nix/store/g2f1sw6n7dhsphwamns6kilrvknsmywj-source3source root is source
patchPhase
4Executing configureCargoCommonVars5----------------------------------------------------------------------------------6NOTICE: setting the following environment variables for cross-compilation purposes7 - if this is unwanted, you can set them to a non-empty value8 - alternatively, you can disable the built-in cross compilation support9 by setting `doIncludeCrossToolchainEnv = false` in the derivation10AR_AARCH64_UNKNOWN_LINUX_GNU=/nix/store/z2qkl46kv87zcs2sfwfjgc75nq0hbzhf-gcc-wrapper-15.3.0/bin/ar11AR_AARCH64_UNKNOWN_LINUX_MUSL=/nix/store/903irvc2221dkpg8nl6yd3m10jy199q7-aarch64-unknown-linux-musl-gcc-wrapper-15.3.0/bin/aarch64-unknown-linux-musl-ar12CARGO_BUILD_TARGET=aarch64-unknown-linux-musl13CARGO_TARGET_AARCH64_UNKNOWN_LINUX_GNU_LINKER=/nix/store/z2qkl46kv87zcs2sfwfjgc75nq0hbzhf-gcc-wrapper-15.3.0/bin/cc14CARGO_TARGET_AARCH64_UNKNOWN_LINUX_MUSL_LINKER=/nix/store/903irvc2221dkpg8nl6yd3m10jy199q7-aarch64-unknown-linux-musl-gcc-wrapper-15.3.0/bin/aarch64-unknown-linux-musl-cc15CC_AARCH64_UNKNOWN_LINUX_GNU=/nix/store/z2qkl46kv87zcs2sfwfjgc75nq0hbzhf-gcc-wrapper-15.3.0/bin/cc16CC_AARCH64_UNKNOWN_LINUX_MUSL=/nix/store/903irvc2221dkpg8nl6yd3m10jy199q7-aarch64-unknown-linux-musl-gcc-wrapper-15.3.0/bin/aarch64-unknown-linux-musl-cc17CXX_AARCH64_UNKNOWN_LINUX_GNU=/nix/store/z2qkl46kv87zcs2sfwfjgc75nq0hbzhf-gcc-wrapper-15.3.0/bin/c++18CXX_AARCH64_UNKNOWN_LINUX_MUSL=/nix/store/903irvc2221dkpg8nl6yd3m10jy199q7-aarch64-unknown-linux-musl-gcc-wrapper-15.3.0/bin/aarch64-unknown-linux-musl-c++19HOST_AR=/nix/store/z2qkl46kv87zcs2sfwfjgc75nq0hbzhf-gcc-wrapper-15.3.0/bin/ar20HOST_CC=/nix/store/z2qkl46kv87zcs2sfwfjgc75nq0hbzhf-gcc-wrapper-15.3.0/bin/cc21HOST_CXX=/nix/store/z2qkl46kv87zcs2sfwfjgc75nq0hbzhf-gcc-wrapper-15.3.0/bin/c++22TARGET_AR=/nix/store/903irvc2221dkpg8nl6yd3m10jy199q7-aarch64-unknown-linux-musl-gcc-wrapper-15.3.0/bin/aarch64-unknown-linux-musl-ar23TARGET_CC=/nix/store/903irvc2221dkpg8nl6yd3m10jy199q7-aarch64-unknown-linux-musl-gcc-wrapper-15.3.0/bin/aarch64-unknown-linux-musl-cc24TARGET_CXX=/nix/store/903irvc2221dkpg8nl6yd3m10jy199q7-aarch64-unknown-linux-musl-gcc-wrapper-15.3.0/bin/aarch64-unknown-linux-musl-c++25----------------------------------------------------------------------------------26decompressing cargo artifacts from /nix/store/gzqgfjlfcx2jjm21hwycxvr4ylzbkvak-iets-deps-static-aarch64-unknown-linux-musl-0.1.0/target.tar.zst to target
configurePhase
27will append /build/source/.cargo-home/config.toml with contents of /nix/store/shbr2n0kq1cgw1m56cb2153vlg9n1b7i-vendor-cargo-deps/config.toml28default configurePhase, nothing to do
buildPhase
29+++ command cargo --version30cargo 1.98.0 (797e8a9bc 2026-08-05)31+++ command cargo build --release --message-format json-render-diagnostics --locked32 Compiling iets v0.1.0 (/build/source)33error[E0423]: expected function, found module `lz4_flex::block::decompress`34 --> src/treestore/pack.rs:207:935 |36207 | lz4_flex::block::decompress(&stored, loc.raw as usize)37 | ^^^^^^^^^^^^^^^^^^^^^^^^^^^ not a function3839error[E0423]: expected function, found module `lz4_flex::block::compress`40 --> src/treestore/pack.rs:237:1841 |42237 | .then(|| lz4_flex::block::compress(&bytes))43 | ^^^^^^^^^^^^^^^^^^^^^^^^^ not a function4445error[E0603]: module `decompress` is private46 --> src/treestore/pack.rs:207:2647 |48207 | lz4_flex::block::decompress(&stored, loc.raw as usize)49 | ^^^^^^^^^^ private module50 |51note: the module `decompress` is defined here52 --> /nix/store/shbr2n0kq1cgw1m56cb2153vlg9n1b7i-vendor-cargo-deps/c19b7c6f923b580ac259164a89f2577984ad5ab09ee9d583b888f934adbbe8d0/lz4_flex-0.14.0/src/block/mod.rs:26:1653 |54 26 | pub(crate) use decompress_safe as decompress;55 | ^^^^^^^^^^^^^^^5657error[E0603]: module `compress` is private58 --> src/treestore/pack.rs:237:3559 |60237 | .then(|| lz4_flex::block::compress(&bytes))61 | ^^^^^^^^ private module62 |63note: the module `compress` is defined here64 --> /nix/store/shbr2n0kq1cgw1m56cb2153vlg9n1b7i-vendor-cargo-deps/c19b7c6f923b580ac259164a89f2577984ad5ab09ee9d583b888f934adbbe8d0/lz4_flex-0.14.0/src/block/mod.rs:19:165 |66 19 | pub(crate) mod compress;67 | ^^^^^^^^^^^^^^^^^^^^^^^6869Some errors have detailed explanations: E0423, E0603.70For more information about an error, try `rustc --explain E0423`.71error: could not compile `iets` (lib) due to 4 previous errors