iets-fuzzers-0.0.0
checks.aarch64-linux.fuzz-wire
· build #190
· raw
1elastic-arm-2204a1ee: building rsjh06sijxg97199vmln4fwdl5mfkhbc-iets-fuzzers-0.0.0.drv
unpackPhase
2unpacking source archive /nix/store/348zizg6xfqmyk3ns37qz500jv7h2bry-source3source root is source4Executing cargoSetupPostUnpackHook5Finished cargoSetupPostUnpackHookpatchPhase
6Executing cargoSetupPostPatchHook7Validating consistency between /build/source/fuzz/Cargo.lock and /build/cargo-vendor-dir/Cargo.lock8Finished cargoSetupPostPatchHookbuildPhase
9 Compiling libc v0.2.19010 Compiling proc-macro2 v1.0.10711 Compiling quote v1.0.4712 Compiling unicode-ident v1.0.2613 Compiling shlex v2.0.114 Compiling find-msvc-tools v0.1.1415 Compiling cfg-if v1.0.516 Compiling memchr v2.8.317 Compiling bytes v1.12.118 Compiling pin-project-lite v0.2.1719 Compiling anyhow v1.0.10420 Compiling either v1.19.021 Compiling regex-syntax v0.8.1122 Compiling futures-core v0.3.3423 Compiling once_cell v1.21.424 Compiling itoa v1.0.1825 Compiling getrandom v0.4.326 Compiling futures-sink v0.3.3427 Compiling slab v0.4.1228 Compiling zeroize v1.9.129 Compiling equivalent v1.0.230 Compiling tracing-core v0.1.3631 Compiling itertools v0.14.032 Compiling fnv v1.0.733 Compiling hashbrown v0.17.134 Compiling typenum v1.20.135 Compiling bitflags v2.13.236 Compiling rustls-pki-types v1.15.137 Compiling httparse v1.10.138 Compiling rustix v1.1.539 Compiling aho-corasick v1.1.540 Compiling pulldown-cmark v0.13.441 Compiling prettyplease v0.2.3742 Compiling http v1.5.043 Compiling unicase v2.10.044 Compiling linux-raw-sys v0.12.145 Compiling atomic-waker v1.1.246 Compiling syn v2.0.11947 Compiling syn v3.0.648 Compiling indexmap v2.14.249 Compiling untrusted v0.9.050 Compiling pkg-config v0.3.3451 Compiling hybrid-array v0.4.1552 Compiling unicode-width v0.1.1453 Compiling try-lock v0.2.554 Compiling futures-task v0.3.3455 Compiling thiserror v2.0.2156 Compiling serde_core v1.0.22957 Compiling foldhash v0.1.558 Compiling hashbrown v0.15.559 Compiling socket2 v0.6.560 Compiling jobserver v0.1.3561 Compiling mio v1.2.462 Compiling http-body v1.1.063 Compiling getrandom v0.2.1764 Compiling regex-automata v0.4.1865 Compiling crypto-common v0.2.266 Compiling block-buffer v0.12.167 Compiling cc v1.6.068 Compiling futures-util v0.3.3469 Compiling want v0.3.270 Compiling futures-channel v0.3.3471 Compiling fixedbitset v0.5.772 Compiling fastrand v2.5.073 Compiling httpdate v1.0.374 Compiling const-oid v0.10.275 Compiling tower-service v0.3.376 Compiling smallvec v1.16.277 Compiling rustls v0.23.4578 Compiling petgraph v0.8.379 Compiling digest v0.11.380 Compiling subtle v2.6.181 Compiling multimap v0.10.182 Compiling heck v0.5.083 Compiling log v0.4.3484 Compiling pulldown-cmark-to-cmark v22.0.385 Compiling cpufeatures v0.3.186 Compiling crc32fast v1.5.287 Compiling zstd-safe v8.1.088 Compiling sync_wrapper v1.0.289 Compiling zmij v1.0.2390 Compiling tower-layer v0.3.391 Compiling http-body-util v0.1.592 Compiling winnow v1.0.493 Compiling percent-encoding v2.3.294 Compiling cty v0.2.295 Compiling base64 v0.22.196 Compiling adler2 v2.0.197 Compiling simd-adler32 v0.3.1098 Compiling serde_json v1.0.15299 Compiling miniz_oxide v0.9.1100 Compiling toml_parser v1.1.5+spec-1.1.0101 Compiling tempfile v3.27.0102 Compiling sha2 v0.11.0103 Compiling filetime v0.2.29104 Compiling ring v0.17.14105 Compiling zstd-sys v2.1.1+zstd.1.5.7106 Compiling libmimalloc-sys v0.1.49107 Compiling blake3 v1.8.7108 Compiling libfuzzer-sys v0.4.13109 Compiling toml_writer v1.1.3+spec-1.1.0110 Compiling openssl-probe v0.2.1111 Compiling constant_time_eq v0.4.2112 Compiling libbz2-rs-sys v0.2.5113 Compiling logos-codegen v0.16.1114 Compiling regex v1.13.1115 Compiling tonic-build v0.14.6116 Compiling arrayvec v0.7.8117 Compiling bzip2 v0.6.1118 Compiling toml_datetime v1.1.2+spec-1.1.0119 Compiling serde_spanned v1.1.2120 Compiling lzma-rust2 v0.21.0121 Compiling rustls-native-certs v0.8.4122 Compiling toml v1.1.8+spec-1.1.0123 Compiling tar v0.4.46124 Compiling tokio-macros v2.7.2125 Compiling thiserror-impl v2.0.21126 Compiling async-trait v0.1.92127 Compiling tokio v1.53.2128 Compiling prost-derive v0.14.4129 Compiling tracing-attributes v0.1.31130 Compiling logos-derive v0.16.1131 Compiling miette-derive v7.6.0132 Compiling pin-project-internal v1.1.13133 Compiling flate2 v1.1.10134 Compiling logos v0.16.1135 Compiling sha1 v0.11.0136 Compiling md-5 v0.11.0137 Compiling webpki-roots v1.0.9138 Compiling lz4_flex v0.14.0139 Compiling arbitrary v1.5.0140 Compiling mimalloc v0.1.52141 Compiling prost v0.14.4142 Compiling tracing v0.1.44143 Compiling miette v7.6.0144 Compiling pin-project v1.1.13145 Compiling prost-types v0.14.4146 Compiling prost-reflect v0.16.5147 Compiling protox-parse v0.10.0148 Compiling prost-build v0.14.4149 Compiling tokio-util v0.7.19150 Compiling rustls-webpki v0.103.15151 Compiling protox v0.10.0152 Compiling tokio-stream v0.1.19153 Compiling h2 v0.4.20154 Compiling tower v0.5.3155 Compiling tonic-prost-build v0.14.6156 Compiling iets v0.1.0 (/build/source)157 Compiling hyper v1.12.0158 Compiling tokio-rustls v0.26.6159 Compiling hyper-util v0.1.21160 Compiling hyper-timeout v0.5.2161 Compiling tonic v0.14.6162 Compiling tonic-prost v0.14.6163 Compiling zstd v0.14.2164error[E0423]: expected function, found module `lz4_flex::block::decompress`165 --> /build/source/src/treestore/pack.rs:207:9166 |167207 | lz4_flex::block::decompress(&stored, loc.raw as usize)168 | ^^^^^^^^^^^^^^^^^^^^^^^^^^^ not a function169170error[E0423]: expected function, found module `lz4_flex::block::compress`171 --> /build/source/src/treestore/pack.rs:237:18172 |173237 | .then(|| lz4_flex::block::compress(&bytes))174 | ^^^^^^^^^^^^^^^^^^^^^^^^^ not a function175176error[E0603]: module `decompress` is private177 --> /build/source/src/treestore/pack.rs:207:26178 |179207 | lz4_flex::block::decompress(&stored, loc.raw as usize)180 | ^^^^^^^^^^ private module181 |182note: the module `decompress` is defined here183 --> /build/cargo-vendor-dir/lz4_flex-0.14.0/src/block/mod.rs:26:16184 |185 26 | pub(crate) use decompress_safe as decompress;186 | ^^^^^^^^^^^^^^^187188error[E0603]: module `compress` is private189 --> /build/source/src/treestore/pack.rs:237:35190 |191237 | .then(|| lz4_flex::block::compress(&bytes))192 | ^^^^^^^^ private module193 |194note: the module `compress` is defined here195 --> /build/cargo-vendor-dir/lz4_flex-0.14.0/src/block/mod.rs:19:1196 |197 19 | pub(crate) mod compress;198 | ^^^^^^^^^^^^^^^^^^^^^^^199200Some errors have detailed explanations: E0423, E0603.201For more information about an error, try `rustc --explain E0423`.202error: could not compile `iets` (lib) due to 4 previous errors203warning: build failed, waiting for other jobs to finish...204Error: failed to build fuzz script: RUSTFLAGS=" -Cpasses=sancov-module -Cllvm-args=-sanitizer-coverage-level=4 -Cllvm-args=-sanitizer-coverage-inline-8bit-counters -Cllvm-args=-sanitizer-coverage-pc-table -Cllvm-args=-sanitizer-coverage-trace-compares --cfg fuzzing -Cllvm-args=-simplifycfg-branch-fold-threshold=0 -Cllvm-args=-sanitizer-coverage-stack-depth -Ccodegen-units=1" "cargo" "build" "--manifest-path" "/build/source/fuzz/Cargo.toml" "--target" "aarch64-unknown-linux-gnu" "--release" "--config" "profile.release.debug=\"line-tables-only\"" "--bin" "drv-eval"