iets-fuzz-diff-0.0.0
checks.aarch64-linux.fuzz-parse
· build #190
· raw
1elastic-arm-f5251078: building 6h7n768gjg3v65a5ihdmws5ii7irhja4-iets-fuzz-diff-0.0.0.drv
unpackPhase
2unpacking source archive /nix/store/348zizg6xfqmyk3ns37qz500jv7h2bry-source3source root is sourcepatchPhase
4moving Cargo.lock to Cargo.lock.orig, then will use /nix/store/x5fb9rdfs3v03iygc1a65rdpqkn584p0-Cargo.lock as Cargo.lock5Executing configureCargoCommonVars6decompressing cargo artifacts from /nix/store/idl610rg9d69smk953i9r9dnzskp3gns-iets-fuzz-diff-deps-0.0.0/target.tar.zst to targetconfigurePhase
7will append /build/source/fuzz/.cargo-home/config.toml with contents of /nix/store/7msqw3wfyv4s1b1jl1515bapq3rv670q-vendor-cargo-deps/config.toml8default configurePhase, nothing to dobuildPhase
9+++ command cargo --version10cargo 1.98.0 (797e8a9bc 2026-08-05)11+++ command cargo build --release --message-format json-render-diagnostics --locked --bin fuzz-diff --bin conformance-adapter12 Compiling iets v0.1.0 (/build/source)13error[E0423]: expected function, found module `lz4_flex::block::decompress`14 --> /build/source/src/treestore/pack.rs:207:915 |16207 | lz4_flex::block::decompress(&stored, loc.raw as usize)17 | ^^^^^^^^^^^^^^^^^^^^^^^^^^^ not a function1819error[E0423]: expected function, found module `lz4_flex::block::compress`20 --> /build/source/src/treestore/pack.rs:237:1821 |22237 | .then(|| lz4_flex::block::compress(&bytes))23 | ^^^^^^^^^^^^^^^^^^^^^^^^^ not a function2425error[E0603]: module `decompress` is private26 --> /build/source/src/treestore/pack.rs:207:2627 |28207 | lz4_flex::block::decompress(&stored, loc.raw as usize)29 | ^^^^^^^^^^ private module30 |31note: the module `decompress` is defined here32 --> /nix/store/7msqw3wfyv4s1b1jl1515bapq3rv670q-vendor-cargo-deps/c19b7c6f923b580ac259164a89f2577984ad5ab09ee9d583b888f934adbbe8d0/lz4_flex-0.14.0/src/block/mod.rs:26:1633 |34 26 | pub(crate) use decompress_safe as decompress;35 | ^^^^^^^^^^^^^^^3637error[E0603]: module `compress` is private38 --> /build/source/src/treestore/pack.rs:237:3539 |40237 | .then(|| lz4_flex::block::compress(&bytes))41 | ^^^^^^^^ private module42 |43note: the module `compress` is defined here44 --> /nix/store/7msqw3wfyv4s1b1jl1515bapq3rv670q-vendor-cargo-deps/c19b7c6f923b580ac259164a89f2577984ad5ab09ee9d583b888f934adbbe8d0/lz4_flex-0.14.0/src/block/mod.rs:19:145 |46 19 | pub(crate) mod compress;47 | ^^^^^^^^^^^^^^^^^^^^^^^4849Some errors have detailed explanations: E0423, E0603.50For more information about an error, try `rustc --explain E0423`.51error: could not compile `iets` (lib) due to 4 previous errors