iets-fuzzers-0.0.0
checks.aarch64-linux.fuzz-nar
· build #190
· raw
1elastic-arm-2204a1ee: building rsjh06sijxg97199vmln4fwdl5mfkhbc-iets-fuzzers-0.0.0.drv
unpackPhase
2unpacking source archive /nix/store/348zizg6xfqmyk3ns37qz500jv7h2bry-source3source root is source4Executing cargoSetupPostUnpackHook5Finished cargoSetupPostUnpackHookpatchPhase
6Executing cargoSetupPostPatchHook7Validating consistency between /build/source/fuzz/Cargo.lock and /build/cargo-vendor-dir/Cargo.lock8Finished cargoSetupPostPatchHookbuildPhase
9 Compiling libc v0.2.19010 Compiling proc-macro2 v1.0.10711 Compiling quote v1.0.4712 Compiling unicode-ident v1.0.2613 Compiling find-msvc-tools v0.1.1414 Compiling shlex v2.0.115 Compiling cfg-if v1.0.516 Compiling memchr v2.8.317 Compiling bytes v1.12.118 Compiling pin-project-lite v0.2.1719 Compiling anyhow v1.0.10420 Compiling either v1.19.021 Compiling futures-core v0.3.3422 Compiling regex-syntax v0.8.1123 Compiling once_cell v1.21.424 Compiling itoa v1.0.1825 Compiling getrandom v0.4.326 Compiling bitflags v2.13.227 Compiling fnv v1.0.728 Compiling zeroize v1.9.129 Compiling tracing-core v0.1.3630 Compiling itertools v0.14.031 Compiling futures-sink v0.3.3432 Compiling equivalent v1.0.233 Compiling typenum v1.20.134 Compiling slab v0.4.1235 Compiling hashbrown v0.17.136 Compiling httparse v1.10.137 Compiling rustix v1.1.538 Compiling rustls-pki-types v1.15.139 Compiling prettyplease v0.2.3740 Compiling aho-corasick v1.1.541 Compiling pulldown-cmark v0.13.442 Compiling futures-task v0.3.3443 Compiling atomic-waker v1.1.244 Compiling try-lock v0.2.545 Compiling http v1.5.046 Compiling serde_core v1.0.22947 Compiling syn v2.0.11948 Compiling syn v3.0.649 Compiling indexmap v2.14.250 Compiling foldhash v0.1.551 Compiling unicode-width v0.1.1452 Compiling hybrid-array v0.4.1553 Compiling thiserror v2.0.2154 Compiling pkg-config v0.3.3455 Compiling untrusted v0.9.056 Compiling linux-raw-sys v0.12.157 Compiling unicase v2.10.058 Compiling hashbrown v0.15.559 Compiling jobserver v0.1.3560 Compiling http-body v1.1.061 Compiling cc v1.6.062 Compiling mio v1.2.463 Compiling socket2 v0.6.564 Compiling regex-automata v0.4.1865 Compiling getrandom v0.2.1766 Compiling block-buffer v0.12.167 Compiling crypto-common v0.2.268 Compiling futures-util v0.3.3469 Compiling want v0.3.270 Compiling futures-channel v0.3.3471 Compiling smallvec v1.16.272 Compiling fixedbitset v0.5.773 Compiling httpdate v1.0.374 Compiling rustls v0.23.4575 Compiling tower-service v0.3.376 Compiling const-oid v0.10.277 Compiling fastrand v2.5.078 Compiling petgraph v0.8.379 Compiling pulldown-cmark-to-cmark v22.0.380 Compiling digest v0.11.381 Compiling heck v0.5.082 Compiling subtle v2.6.183 Compiling log v0.4.3484 Compiling multimap v0.10.185 Compiling cpufeatures v0.3.186 Compiling crc32fast v1.5.287 Compiling zstd-safe v8.1.088 Compiling sync_wrapper v1.0.289 Compiling tower-layer v0.3.390 Compiling zmij v1.0.2391 Compiling http-body-util v0.1.592 Compiling simd-adler32 v0.3.1093 Compiling cty v0.2.294 Compiling adler2 v2.0.195 Compiling winnow v1.0.496 Compiling percent-encoding v2.3.297 Compiling serde_json v1.0.15298 Compiling base64 v0.22.199 Compiling miniz_oxide v0.9.1100 Compiling sha2 v0.11.0101 Compiling toml_parser v1.1.5+spec-1.1.0102 Compiling tempfile v3.27.0103 Compiling filetime v0.2.29104 Compiling ring v0.17.14105 Compiling zstd-sys v2.1.1+zstd.1.5.7106 Compiling libmimalloc-sys v0.1.49107 Compiling blake3 v1.8.7108 Compiling libfuzzer-sys v0.4.13109 Compiling openssl-probe v0.2.1110 Compiling toml_writer v1.1.3+spec-1.1.0111 Compiling libbz2-rs-sys v0.2.5112 Compiling constant_time_eq v0.4.2113 Compiling logos-codegen v0.16.1114 Compiling regex v1.13.1115 Compiling tonic-build v0.14.6116 Compiling arrayvec v0.7.8117 Compiling bzip2 v0.6.1118 Compiling serde_spanned v1.1.2119 Compiling toml_datetime v1.1.2+spec-1.1.0120 Compiling rustls-native-certs v0.8.4121 Compiling lzma-rust2 v0.21.0122 Compiling tokio-macros v2.7.2123 Compiling thiserror-impl v2.0.21124 Compiling async-trait v0.1.92125 Compiling toml v1.1.8+spec-1.1.0126 Compiling flate2 v1.1.10127 Compiling tokio v1.53.2128 Compiling tar v0.4.46129 Compiling prost-derive v0.14.4130 Compiling tracing-attributes v0.1.31131 Compiling miette-derive v7.6.0132 Compiling logos-derive v0.16.1133 Compiling pin-project-internal v1.1.13134 Compiling sha1 v0.11.0135 Compiling logos v0.16.1136 Compiling md-5 v0.11.0137 Compiling webpki-roots v1.0.9138 Compiling lz4_flex v0.14.0139 Compiling arbitrary v1.5.0140 Compiling miette v7.6.0141 Compiling mimalloc v0.1.52142 Compiling prost v0.14.4143 Compiling tracing v0.1.44144 Compiling pin-project v1.1.13145 Compiling prost-types v0.14.4146 Compiling protox-parse v0.10.0147 Compiling prost-reflect v0.16.5148 Compiling prost-build v0.14.4149 Compiling tokio-util v0.7.19150 Compiling rustls-webpki v0.103.15151 Compiling h2 v0.4.20152 Compiling tower v0.5.3153 Compiling tokio-stream v0.1.19154 Compiling protox v0.10.0155 Compiling tonic-prost-build v0.14.6156 Compiling iets v0.1.0 (/build/source)157 Compiling hyper v1.12.0158 Compiling tokio-rustls v0.26.6159 Compiling hyper-util v0.1.21160 Compiling hyper-timeout v0.5.2161 Compiling tonic v0.14.6162 Compiling tonic-prost v0.14.6163 Compiling zstd v0.14.2164error[E0423]: expected function, found module `lz4_flex::block::decompress`165 --> /build/source/src/treestore/pack.rs:207:9166 |167207 | lz4_flex::block::decompress(&stored, loc.raw as usize)168 | ^^^^^^^^^^^^^^^^^^^^^^^^^^^ not a function169170error[E0423]: expected function, found module `lz4_flex::block::compress`171 --> /build/source/src/treestore/pack.rs:237:18172 |173237 | .then(|| lz4_flex::block::compress(&bytes))174 | ^^^^^^^^^^^^^^^^^^^^^^^^^ not a function175176error[E0603]: module `decompress` is private177 --> /build/source/src/treestore/pack.rs:207:26178 |179207 | lz4_flex::block::decompress(&stored, loc.raw as usize)180 | ^^^^^^^^^^ private module181 |182note: the module `decompress` is defined here183 --> /build/cargo-vendor-dir/lz4_flex-0.14.0/src/block/mod.rs:26:16184 |185 26 | pub(crate) use decompress_safe as decompress;186 | ^^^^^^^^^^^^^^^187188error[E0603]: module `compress` is private189 --> /build/source/src/treestore/pack.rs:237:35190 |191237 | .then(|| lz4_flex::block::compress(&bytes))192 | ^^^^^^^^ private module193 |194note: the module `compress` is defined here195 --> /build/cargo-vendor-dir/lz4_flex-0.14.0/src/block/mod.rs:19:1196 |197 19 | pub(crate) mod compress;198 | ^^^^^^^^^^^^^^^^^^^^^^^199200Some errors have detailed explanations: E0423, E0603.201For more information about an error, try `rustc --explain E0423`.202error: could not compile `iets` (lib) due to 4 previous errors203warning: build failed, waiting for other jobs to finish...204Error: failed to build fuzz script: RUSTFLAGS=" -Cpasses=sancov-module -Cllvm-args=-sanitizer-coverage-level=4 -Cllvm-args=-sanitizer-coverage-inline-8bit-counters -Cllvm-args=-sanitizer-coverage-pc-table -Cllvm-args=-sanitizer-coverage-trace-compares --cfg fuzzing -Cllvm-args=-simplifycfg-branch-fold-threshold=0 -Cllvm-args=-sanitizer-coverage-stack-depth -Ccodegen-units=1" "cargo" "build" "--manifest-path" "/build/source/fuzz/Cargo.toml" "--target" "aarch64-unknown-linux-gnu" "--release" "--config" "profile.release.debug=\"line-tables-only\"" "--bin" "drv-eval"