nixbot

builds

failed iets-examples-0.1.0 checks.aarch64-linux.examples · build #190 · raw

1elastic-arm-0a911f46: building 4mi7ngigd6h1g3ipy9infcdl59imxwm0-iets-examples-0.1.0.drv
unpackPhase
2unpacking source archive /nix/store/l6cnbi3k1q45i0wdq7n31r5alm98fkg4-source3source root is source
patchPhase
4Executing configureCargoCommonVars5decompressing cargo artifacts from /nix/store/a4nhfwd4bminlsai07bg0i4q4p1ml6v5-iets-deps-0.1.0/target.tar.zst to target
configurePhase
6will append /build/source/.cargo-home/config.toml with contents of /nix/store/shbr2n0kq1cgw1m56cb2153vlg9n1b7i-vendor-cargo-deps/config.toml7default configurePhase, nothing to do
buildPhase
8+++ command cargo --version9cargo 1.98.0 (797e8a9bc 2026-08-05)10+++ command cargo build --profile dev --examples11 Compiling iets v0.1.0 (/build/source)12error[E0423]: expected function, found module `lz4_flex::block::decompress`13 --> src/treestore/pack.rs:207:914 |15207 | lz4_flex::block::decompress(&stored, loc.raw as usize)16 | ^^^^^^^^^^^^^^^^^^^^^^^^^^^ not a function1718error[E0423]: expected function, found module `lz4_flex::block::compress`19 --> src/treestore/pack.rs:237:1820 |21237 | .then(|| lz4_flex::block::compress(&bytes))22 | ^^^^^^^^^^^^^^^^^^^^^^^^^ not a function2324error[E0603]: module `decompress` is private25 --> src/treestore/pack.rs:207:2626 |27207 | lz4_flex::block::decompress(&stored, loc.raw as usize)28 | ^^^^^^^^^^ private module29 |30note: the module `decompress` is defined here31 --> /nix/store/shbr2n0kq1cgw1m56cb2153vlg9n1b7i-vendor-cargo-deps/c19b7c6f923b580ac259164a89f2577984ad5ab09ee9d583b888f934adbbe8d0/lz4_flex-0.14.0/src/block/mod.rs:26:1632 |33 26 | pub(crate) use decompress_safe as decompress;34 | ^^^^^^^^^^^^^^^3536error[E0603]: module `compress` is private37 --> src/treestore/pack.rs:237:3538 |39237 | .then(|| lz4_flex::block::compress(&bytes))40 | ^^^^^^^^ private module41 |42note: the module `compress` is defined here43 --> /nix/store/shbr2n0kq1cgw1m56cb2153vlg9n1b7i-vendor-cargo-deps/c19b7c6f923b580ac259164a89f2577984ad5ab09ee9d583b888f934adbbe8d0/lz4_flex-0.14.0/src/block/mod.rs:19:144 |45 19 | pub(crate) mod compress;46 | ^^^^^^^^^^^^^^^^^^^^^^^4748Some errors have detailed explanations: E0423, E0603.49For more information about an error, try `rustc --explain E0423`.50error: could not compile `iets` (lib) due to 4 previous errors