iets-0.1.0
checks.aarch64-darwin.build
· build #190
· raw
1mac02: building abb7vpb1g18gymnsqy6v9cz9q09lq587-iets-0.1.0.drv
unpackPhase
2unpacking source archive /nix/store/g2f1sw6n7dhsphwamns6kilrvknsmywj-source3source root is sourcepatchPhase
4Executing configureCargoCommonVars5decompressing cargo artifacts from /nix/store/zpbp0bm11fwmi2grpkn5sxlgds8mgi22-iets-deps-0.1.0/target.tar.zst to target6patchPhase completed in 35 secondsconfigurePhase
7will append /nix/var/nix/builds/nix-68704-1732103268/source/.cargo-home/config.toml with contents of /nix/store/9h4jxf2wrmpxmc9chvd9b6jd61bc3rnr-vendor-cargo-deps/config.toml8default configurePhase, nothing to dobuildPhase
9+++ command cargo --version10cargo 1.98.0 (797e8a9bc 2026-08-05)11+++ command cargo build --release --message-format json-render-diagnostics --locked12 Compiling iets v0.1.0 (/nix/var/nix/builds/nix-68704-1732103268/source)13error[E0423]: expected function, found module `lz4_flex::block::decompress`14 --> src/treestore/pack.rs:207:915 |16207 | lz4_flex::block::decompress(&stored, loc.raw as usize)17 | ^^^^^^^^^^^^^^^^^^^^^^^^^^^ not a function1819error[E0423]: expected function, found module `lz4_flex::block::compress`20 --> src/treestore/pack.rs:237:1821 |22237 | .then(|| lz4_flex::block::compress(&bytes))23 | ^^^^^^^^^^^^^^^^^^^^^^^^^ not a function2425error[E0603]: module `decompress` is private26 --> src/treestore/pack.rs:207:2627 |28207 | lz4_flex::block::decompress(&stored, loc.raw as usize)29 | ^^^^^^^^^^ private module30 |31note: the module `decompress` is defined here32 --> /nix/store/9h4jxf2wrmpxmc9chvd9b6jd61bc3rnr-vendor-cargo-deps/c19b7c6f923b580ac259164a89f2577984ad5ab09ee9d583b888f934adbbe8d0/lz4_flex-0.14.0/src/block/mod.rs:26:1633 |34 26 | pub(crate) use decompress_safe as decompress;35 | ^^^^^^^^^^^^^^^3637error[E0603]: module `compress` is private38 --> src/treestore/pack.rs:237:3539 |40237 | .then(|| lz4_flex::block::compress(&bytes))41 | ^^^^^^^^ private module42 |43note: the module `compress` is defined here44 --> /nix/store/9h4jxf2wrmpxmc9chvd9b6jd61bc3rnr-vendor-cargo-deps/c19b7c6f923b580ac259164a89f2577984ad5ab09ee9d583b888f934adbbe8d0/lz4_flex-0.14.0/src/block/mod.rs:19:145 |46 19 | pub(crate) mod compress;47 | ^^^^^^^^^^^^^^^^^^^^^^^4849Some errors have detailed explanations: E0423, E0603.50For more information about an error, try `rustc --explain E0423`.51error: could not compile `iets` (lib) due to 4 previous errors