nixbot

builds

cancelled checks.x86_64-linux.classic-e2e build #183 · raw · eval 10.1 s · 435.4 MiB allocated · ·

1these 6 derivations will be built:2  /nix/store/kmnz54srl5xfqnidr2xfr913c10cvr4z-iets-0.1.0.drv3  /nix/store/d5nmnlq3r85mqa4aahn8f3hry9gjrfwl-closure-info.drv4  /nix/store/bnd435rx5019f96kf9fl0zfjlnn1nf2w-test-script.drv5  /nix/store/5wwif5gq5nvw8cmfpxql4p904blir52x-driverConfiguration.json.drv6  /nix/store/12z70blkvwadfnvzhx976rxlh1i57x3k-nixos-test-driver-iets-classic-e2e.drv7  /nix/store/14qkjs7f67zikimcn927g7k3c93nallb-container-test-run-iets-classic-e2e.drv8building '/nix/store/d5nmnlq3r85mqa4aahn8f3hry9gjrfwl-closure-info.drv'9closure-info> structuredAttrs is enabled10building '/nix/store/bnd435rx5019f96kf9fl0zfjlnn1nf2w-test-script.drv'11test-script> structuredAttrs is enabled12building '/nix/store/5wwif5gq5nvw8cmfpxql4p904blir52x-driverConfiguration.json.drv'13driverConfiguration.json> structuredAttrs is enabled14building '/nix/store/12z70blkvwadfnvzhx976rxlh1i57x3k-nixos-test-driver-iets-classic-e2e.drv'15nixos-test-driver-iets-classic-e2e> Running type check (enable/disable: config.skipTypeCheck)16nixos-test-driver-iets-classic-e2e> See https://nixos.org/manual/nixos/stable/#test-opt-skipTypeCheck17nixos-test-driver-iets-classic-e2e> All checks passed!18nixos-test-driver-iets-classic-e2e> Linting test script (enable/disable: config.skipLint)19nixos-test-driver-iets-classic-e2e> See https://nixos.org/manual/nixos/stable/#test-opt-skipLint20nixos-test-driver-iets-classic-e2e> All checks passed!21building '/nix/store/14qkjs7f67zikimcn927g7k3c93nallb-container-test-run-iets-classic-e2e.drv'22container-test-run-iets-classic-e2e> Machine state will be reset. To keep it, pass --keep-machine-state23container-test-run-iets-classic-e2e> start all VLans24container-test-run-iets-classic-e2e> (finished: start all VLans, in 0.28 seconds)25container-test-run-iets-classic-e2e> 26container-test-run-iets-classic-e2e> Test will time out and terminate in 3600.0 seconds27container-test-run-iets-classic-e2e> run the VM test script28container-test-run-iets-classic-e2e> additionally exposed symbols:29container-test-run-iets-classic-e2e>     machine,30container-test-run-iets-classic-e2e>     vlan1,31container-test-run-iets-classic-e2e>     start_all, test_script, machines, machines_qemu, machines_nspawn, vlans, driver, log, os, create_machine, subtest, run_tests, join_all, retry, serial_stdout_off, serial_stdout_on, polling_condition, BaseMachine, QemuMachine, NspawnMachine, t, debug, dump_machine_ssh32container-test-run-iets-classic-e2e> machine: waiting for unit multi-user.target33container-test-run-iets-classic-e2e> machine: systemd-nspawn running (pid 50)34container-test-run-iets-classic-e2e> machine: Waiting for journal at /build/vm-state-machine/var/log/journal...35container-test-run-iets-classic-e2e> nixos-nspawn(machine): TAP vde-tap1 not found; container will be isolated from VDE36container-test-run-iets-classic-e2e> nixos-nspawn(machine): A common reason for this is that /dev/net is not available in the Nix sandbox. Try adding /dev/net to extra-sandbox-paths.37container-test-run-iets-classic-e2e> Note: in a future version of systemd-nspawn the default set of permitted socket address families will be restricted to AF_INET, AF_INET6 and AF_UNIX. Use --restrict-address-families= to configure the set of permitted socket address families, or set RestrictAddressFamilies= in a .nspawn file.38container-test-run-iets-classic-e2e> ░ Spawning container machine on /build/vm-state-machine.39container-test-run-iets-classic-e2e> machine # No journal files were found.40container-test-run-iets-classic-e2e> machine # No journal boot entry found for the specified boot (+0).41container-test-run-iets-classic-e2e> machine # [1630105.013715] machine systemd-journald[57]: Journal started42container-test-run-iets-classic-e2e> machine # [1630105.013785] machine systemd-journald[57]: Runtime Journal (/run/log/journal/9c64afb548ea4a8f9e51ffdb9c421010) is 8M, max 2.5G, 2.5G free.43container-test-run-iets-classic-e2e> machine # [1630105.027486] machine systemd[1]: Listening on Journal Log Access Socket.44container-test-run-iets-classic-e2e> machine # [1630105.043232] machine systemd[1]: Finished Apply Kernel Variables.45container-test-run-iets-classic-e2e> machine # [1630105.064156] machine systemd[1]: Finished Create Static Device Nodes in /dev gracefully.46container-test-run-iets-classic-e2e> machine # [1630105.089598] machine systemd[1]: Starting Flush Journal to Persistent Storage...47container-test-run-iets-classic-e2e> machine # [1630105.090601] machine systemd[1]: Starting Create Static Device Nodes in /dev...48container-test-run-iets-classic-e2e> machine # [1630105.132271] machine systemd-journald[57]: Time spent on flushing to /var/log/journal/9c64afb548ea4a8f9e51ffdb9c421010 is 1.623ms for 7 entries.49container-test-run-iets-classic-e2e> machine # [1630105.132271] machine systemd-journald[57]: System Journal (/var/log/journal/9c64afb548ea4a8f9e51ffdb9c421010) is 512B, max 4G, 3.9G free.50container-test-run-iets-classic-e2e> machine # [1630105.155829] machine systemd[1]: Finished Create Static Device Nodes in /dev.51container-test-run-iets-classic-e2e> machine # [1630105.156595] machine systemd[1]: Reached target Preparation for Local File Systems.52container-test-run-iets-classic-e2e> machine # [1630105.156713] machine systemd[1]: Rule-based Manager for Device Events and Files skipped, unmet condition check ConditionPathIsReadWrite=/sys53container-test-run-iets-classic-e2e> machine # [1630105.159065] machine systemd[1]: Finished Flush Journal to Persistent Storage.54container-test-run-iets-classic-e2e> machine # [1630105.380298] machine systemd[1]: Finished Firewall.55container-test-run-iets-classic-e2e> machine # [1630106.054097] machine systemd[1]: Mounting /run/wrappers...56container-test-run-iets-classic-e2e> machine # [1630106.076649] machine systemd[1]: Mounted /run/wrappers.57container-test-run-iets-classic-e2e> machine # [1630106.077302] machine systemd[1]: Reached target Local File Systems.58container-test-run-iets-classic-e2e> machine # [1630106.078587] machine systemd[1]: Listening on Boot Loader Control Service Socket.59container-test-run-iets-classic-e2e> machine # [1630106.081100] machine systemd[1]: Starting Create SUID/SGID Wrappers...60container-test-run-iets-classic-e2e> machine # [1630106.081142] machine systemd[1]: Update Boot Loader Random Seed skipped, unmet condition check ConditionVirtualization=!container61container-test-run-iets-classic-e2e> machine # [1630106.083745] machine systemd[1]: Starting Save Transient machine-id to Disk...62container-test-run-iets-classic-e2e> machine # [1630106.112787] machine systemd[1]: Starting Create System Files and Directories...63container-test-run-iets-classic-e2e> machine # [1630106.142841] machine systemd-tmpfiles[161]: Cannot set file attributes for '/var/empty', value=0x00000010, mask=0x00000010, ignoring: Operation not permitted64container-test-run-iets-classic-e2e> machine # [1630106.239184] machine suid-sgid-wrappers-start[168]: chmod: changing permissions of '/run/wrappers/wrappers.cDIrTPmZpt/chsh': Operation not permitted65container-test-run-iets-classic-e2e> machine # [1630106.142982] machine systemd-tmpfiles[161]: fchmod() of /var/log/journal failed: Operation not permitted66container-test-run-iets-classic-e2e> machine # [1630106.143089] machine systemd-tmpfiles[161]: fchmod() of /var/log/journal/9c64afb548ea4a8f9e51ffdb9c421010 failed: Operation not permitted67container-test-run-iets-classic-e2e> machine # [1630106.143310] machine systemd-tmpfiles[161]: fchmod() of /run/log/journal failed: Operation not permitted68container-test-run-iets-classic-e2e> machine # [1630106.212114] machine systemd[1]: Finished Create System Files and Directories.69container-test-run-iets-classic-e2e> machine # [1630106.248406] machine systemd[1]: suid-sgid-wrappers.service: Main process exited, code=exited, status=1/FAILURE70container-test-run-iets-classic-e2e> machine # [1630106.248484] machine systemd[1]: suid-sgid-wrappers.service: Failed with result 'exit-code'.71container-test-run-iets-classic-e2e> machine # [1630106.372195] machine systemd[1]: Failed to start Create SUID/SGID Wrappers.72container-test-run-iets-classic-e2e> machine # [1630106.384847] machine systemd[1]: Starting Rebuild Journal Catalog...73container-test-run-iets-classic-e2e> machine # [1630106.390125] machine systemd[1]: Starting Record System Boot/Shutdown in UTMP...74container-test-run-iets-classic-e2e> machine # [1630106.411575] machine systemd[1]: Finished Record System Boot/Shutdown in UTMP.75container-test-run-iets-classic-e2e> machine # [1630106.440850] machine systemd[1]: Finished Rebuild Journal Catalog.76container-test-run-iets-classic-e2e> machine # [1630106.456128] machine systemd[1]: Starting Update is Completed...77container-test-run-iets-classic-e2e> machine # [1630106.469277] machine systemd[1]: Finished Update is Completed.78container-test-run-iets-classic-e2e> machine # [1630106.469395] machine systemd[1]: Reached target System Initialization.79container-test-run-iets-classic-e2e> machine # [1630106.469489] machine systemd[1]: Discard unused filesystem blocks once a week skipped, unmet condition check ConditionVirtualization=!container80container-test-run-iets-classic-e2e> machine # [1630106.469530] machine systemd[1]: Started Daily Cleanup of Temporary Directories.81container-test-run-iets-classic-e2e> machine # [1630106.469550] machine systemd[1]: Reached target Timer Units.82container-test-run-iets-classic-e2e> machine # [1630106.469665] machine systemd[1]: Listening on D-Bus System Message Bus Socket.83container-test-run-iets-classic-e2e> machine # [1630106.469974] machine systemd[1]: Listening on Virtual Machine and Container Registration Service Socket.84container-test-run-iets-classic-e2e> machine # [1630106.470009] machine systemd[1]: Reached target Socket Units.85container-test-run-iets-classic-e2e> machine # [1630106.470037] machine systemd[1]: Reached target Basic System.86container-test-run-iets-classic-e2e> machine # [1630106.473679] machine systemd[1]: Starting Import lastlog data into lastlog2 database...87container-test-run-iets-classic-e2e> machine # [1630106.478112] machine systemd[1]: Starting Name Service Cache Daemon (nsncd)...88container-test-run-iets-classic-e2e> machine # [1630106.480999] machine systemd[1]: Starting resolvconf update...89container-test-run-iets-classic-e2e> machine # [1630106.496986] machine systemd[1]: Finished Import lastlog data into lastlog2 database.90container-test-run-iets-classic-e2e> machine # [1630106.589895] machine systemd[1]: nscd.service: Deactivated successfully.91container-test-run-iets-classic-e2e> machine # [1630106.590034] machine systemd[1]: Stopped Name Service Cache Daemon (nsncd).92container-test-run-iets-classic-e2e> machine # [1630106.592148] machine systemd[1]: Starting Name Service Cache Daemon (nsncd)...93container-test-run-iets-classic-e2e> machine # [1630106.630310] machine resolvconf-start[235]: setfacl: /run/resolvconf: Operation not supported94container-test-run-iets-classic-e2e> machine # [1630106.632115] machine systemd[1]: resolvconf.service: Main process exited, code=exited, status=1/FAILURE95container-test-run-iets-classic-e2e> machine # [1630106.632191] machine systemd[1]: resolvconf.service: Failed with result 'exit-code'.96container-test-run-iets-classic-e2e> machine # [1630106.632353] machine systemd[1]: Failed to start resolvconf update.97container-test-run-iets-classic-e2e> machine # [1630106.632958] machine systemd[1]: Reached target Preparation for Network.98container-test-run-iets-classic-e2e> machine # [1630106.637122] machine systemd[1]: Starting Address configuration of eth1...99container-test-run-iets-classic-e2e> machine # [1630106.654169] machine systemd[1]: Starting Extra networking commands....100container-test-run-iets-classic-e2e> machine # [1630106.684523] machine network-addresses-eth1-start[237]: adding address 192.168.1.1/24... done101container-test-run-iets-classic-e2e> machine # [1630106.687320] machine network-addresses-eth1-start[237]: adding address 2001:db8:1::1/64... done102container-test-run-iets-classic-e2e> machine # [1630106.692304] machine systemd[1]: Finished Address configuration of eth1.103container-test-run-iets-classic-e2e> machine # [1630106.726495] machine systemd[1]: Finished Extra networking commands..104container-test-run-iets-classic-e2e> machine # [1630106.726594] machine systemd[1]: Reached target Network.105container-test-run-iets-classic-e2e> machine # [1630107.174482] machine systemd[1]: etc-machine\x2did.mount: Deactivated successfully.106container-test-run-iets-classic-e2e> machine # [1630107.196970] machine systemd[1]: Finished Save Transient machine-id to Disk.107container-test-run-iets-classic-e2e> machine # [1630107.984119] machine nsncd[226]: Oct 13 19:47:58.714 INFO started, config: Config { ignored_request_types: {}, worker_count: 8, handoff_timeout: 10s }, path: "/var/run/nscd/socket"108container-test-run-iets-classic-e2e> machine # [1630108.004987] machine systemd[1]: Started Name Service Cache Daemon (nsncd).109container-test-run-iets-classic-e2e> machine # [1630108.005081] machine systemd[1]: Reached target Host and Network Name Lookups.110container-test-run-iets-classic-e2e> machine # [1630108.005145] machine systemd[1]: Reached target User and Group Name Lookups.111container-test-run-iets-classic-e2e> machine # [1630108.037199] machine systemd[1]: Starting User Login Management...112container-test-run-iets-classic-e2e> machine # [1630108.058912] machine systemd[1]: Starting Permit User Sessions...113container-test-run-iets-classic-e2e> machine # [1630108.071197] machine systemd[1]: Finished Permit User Sessions.114container-test-run-iets-classic-e2e> machine # [1630108.074159] machine systemd[1]: Started Console Getty.115container-test-run-iets-classic-e2e> machine # [1630108.074240] machine systemd[1]: Getty on tty1 skipped, unmet condition check ConditionPathExists=/dev/tty0116container-test-run-iets-classic-e2e> machine # [1630108.074264] machine systemd[1]: Reached target Login Prompts.117container-test-run-iets-classic-e2e> machine: still waiting for container 'machine' to reach ready state...118container-test-run-iets-classic-e2e> machine # [1630115.728398] machine systemd-logind[306]: New seat seat0.119container-test-run-iets-classic-e2e> machine # [1630115.743169] machine systemd[1]: Starting D-Bus System Message Bus...120container-test-run-iets-classic-e2e> machine # [1630115.743340] machine systemd[1]: Started User Login Management.121container-test-run-iets-classic-e2e> machine # [1630115.753160] machine systemd[1]: Starting linger-users.service...122container-test-run-iets-classic-e2e> machine # [1630115.872518] machine systemd[1]: linger-users.service: Deactivated successfully.123container-test-run-iets-classic-e2e> machine # [1630115.872990] machine systemd[1]: Finished linger-users.service.124container-test-run-iets-classic-e2e> machine # [1630115.873945] machine systemd[1]: Reached target Multi-User System.125container-test-run-iets-classic-e2e> machine # [1630119.366149] machine dbus-broker-launch[316]: Looking up NSS user entry for 'systemd-timesync'...126container-test-run-iets-classic-e2e> machine # [1630119.375290] machine dbus-broker-launch[316]: NSS returned no entry for 'systemd-timesync'127container-test-run-iets-classic-e2e> machine # [1630119.375290] machine dbus-broker-launch[316]: Invalid user-name in /nix/store/z441alblwy32lyxiy8466qf85iyi2sdj-system-path/share/dbus-1/system.d/org.freedesktop.timesync1.conf +16: user="systemd-timesync"128container-test-run-iets-classic-e2e> machine # [1630119.381169] machine systemd[1]: Started D-Bus System Message Bus.129container-test-run-iets-classic-e2e> machine # [1630119.383092] machine systemd[1]: Startup finished in 15.125s.130container-test-run-iets-classic-e2e> machine # [1630119.395223] machine dbus-broker-launch[316]: Ready131container-test-run-iets-classic-e2e> machine: (finished: waiting for unit multi-user.target, in 16.27 seconds)132container-test-run-iets-classic-e2e> machine: must succeed: /nix/store/hbyzr3c9k3n51a3zyb3h74dqi8a2n1p5-writable-store /nix/store/b1lxmpw4z86gv8bxv93a9smsmv487him-closure-info133container-test-run-iets-classic-e2e> warning: '--json' without '--json-format' is deprecated; please specify '--json-format 1' or '--json-format 2'. This will become an error in a future release.134container-test-run-iets-classic-e2e> machine: (finished: must succeed: /nix/store/hbyzr3c9k3n51a3zyb3h74dqi8a2n1p5-writable-store /nix/store/b1lxmpw4z86gv8bxv93a9smsmv487him-closure-info, in 55.05 seconds)135container-test-run-iets-classic-e2e> machine: must succeed: systemctl start nix-daemon.socket136container-test-run-iets-classic-e2e> machine: (finished: must succeed: systemctl start nix-daemon.socket, in 0.02 seconds)137container-test-run-iets-classic-e2e> machine: must succeed: /nix/store/cgg4r9lrvb6gcsr7ffpvi9ka3xkldmk9-leftovers138container-test-run-iets-classic-e2e> machine # [1630174.945077] machine systemd[1]: Listening on Nix Daemon Socket.139container-test-run-iets-classic-e2e> machine: (finished: must succeed: /nix/store/cgg4r9lrvb6gcsr7ffpvi9ka3xkldmk9-leftovers, in 1.23 seconds)140container-test-run-iets-classic-e2e> machine: must succeed: cp -r /nix/store/m5bjs3i077bkyzfhpn2jfng92fb0ffjc-source /home/alice/iets && chmod -R u+w /home/alice/iets && chown -R alice /home/alice/iets141container-test-run-iets-classic-e2e> machine: (finished: must succeed: cp -r /nix/store/m5bjs3i077bkyzfhpn2jfng92fb0ffjc-source /home/alice/iets && chmod -R u+w /home/alice/iets && chown -R alice /home/alice/iets, in 0.46 seconds)142container-test-run-iets-classic-e2e> machine: must succeed: runuser -l alice -c 'cd iets && git init -q && git add -A && git -c user.name=e2e -c user.email=e2e@example.com commit -q -m e2e'143container-test-run-iets-classic-e2e> machine # [1630176.684664] machine runuser[4978]: pam_unix(runuser-l:session): session opened for user alice(uid=1000) by (uid=0)144container-test-run-iets-classic-e2e> machine # [1630177.058508] machine runuser[4978]: pam_unix(runuser-l:session): session closed for user alice145container-test-run-iets-classic-e2e> machine: (finished: must succeed: runuser -l alice -c 'cd iets && git init -q && git add -A && git -c user.name=e2e -c user.email=e2e@example.com commit -q -m e2e', in 0.42 seconds)146container-test-run-iets-classic-e2e> machine: must succeed: runuser -l alice -c 'cd iets && IETS=/nix/store/whrzl4sdwrz8nkvhjmannyp274f9hdvn-iets-0.1.0/bin/iets NIXPKGS=/nix/store/hhfnpma32czw4h3bqpag8dciax0bcmar-source E2E_OFFLINE=1   nu scripts/classic-e2e.nu' >&2147container-test-run-iets-classic-e2e> machine # [1630177.076469] machine runuser[4990]: pam_unix(runuser-l:session): session opened for user alice(uid=1000) by (uid=0)148container-test-run-iets-classic-e2e> real nix: /nix/store/6ph2h5b0v19yihxr0id244wh83whwasq-nix-2.34.8/bin149container-test-run-iets-classic-e2e> ok   builtins --impure []: the same names nix has150container-test-run-iets-classic-e2e> ok   builtins --impure [dynamic-derivations]: the same names nix has151container-test-run-iets-classic-e2e> ok   builtins --impure [dynamic-derivations fetch-closure fetch-tree]: the same names nix has152container-test-run-iets-classic-e2e> ok   builtins --pure-eval []: the same names nix has153container-test-run-iets-classic-e2e> ok   builtins --pure-eval [dynamic-derivations]: the same names nix has154container-test-run-iets-classic-e2e> ok   builtins --pure-eval [dynamic-derivations fetch-closure fetch-tree]: the same names nix has155container-test-run-iets-classic-e2e> machine # [1630189.803648] machine systemd[1]: Started Nix Daemon.156container-test-run-iets-classic-e2e> machine # [1630190.043461] machine nix-daemon[5312]: accepted connection from pid 5305, user alice (trusted)157container-test-run-iets-classic-e2e> machine # [1630191.493940] machine nix-daemon[5312]: accepted connection from pid 5429, user alice (trusted)158container-test-run-iets-classic-e2e> ok   instantiate <nixpkgs> -A hello159container-test-run-iets-classic-e2e> machine # [1630194.834193] machine nix-daemon[5312]: accepted connection from pid 5450, user alice (trusted)160container-test-run-iets-classic-e2e> machine # [1630195.712022] machine nix-daemon[5312]: accepted connection from pid 5461, user alice (trusted)161container-test-run-iets-classic-e2e> ok   instantiate <nixpkgs> -A glibc (multi-output)162container-test-run-iets-classic-e2e> machine # [1630200.553024] machine nix-daemon[5312]: accepted connection from pid 5482, user alice (trusted)163container-test-run-iets-classic-e2e> machine # [1630203.577028] machine nix-daemon[5312]: accepted connection from pid 5493, user alice (trusted)164container-test-run-iets-classic-e2e> ok   instantiate <nixpkgs> -A glibc.dev (!output suffix)165container-test-run-iets-classic-e2e> machine # [1630209.974762] machine nix-daemon[5312]: accepted connection from pid 5514, user alice (trusted)166container-test-run-iets-classic-e2e> machine # [1630210.671263] machine nix-daemon[5312]: accepted connection from pid 5525, user alice (trusted)167container-test-run-iets-classic-e2e> ok   instantiate two -A in one run168container-test-run-iets-classic-e2e> machine # [1630214.604478] machine nix-daemon[5312]: accepted connection from pid 5546, user alice (trusted)169container-test-run-iets-classic-e2e> machine # [1630216.799319] machine nix-daemon[5312]: accepted connection from pid 5557, user alice (trusted)170container-test-run-iets-classic-e2e> ok   instantiate two -A that name one derivation171container-test-run-iets-classic-e2e> machine # [1630238.560938] machine nix-daemon[5312]: accepted connection from pid 5578, user alice (trusted)172container-test-run-iets-classic-e2e> machine # [1630240.176026] machine nix-daemon[5312]: accepted connection from pid 5589, user alice (trusted)173container-test-run-iets-classic-e2e> ok   instantiate --add-root ''174container-test-run-iets-classic-e2e> ok   instantiate --eval --strict --json175container-test-run-iets-classic-e2e> ok   instantiate --eval176container-test-run-iets-classic-e2e> ok   instantiate --eval --raw177container-test-run-iets-classic-e2e> ok   instantiate --eval --raw a path178container-test-run-iets-classic-e2e> ok   instantiate --eval --raw an outPath179container-test-run-iets-classic-e2e> ok   instantiate --eval, one --arg name twice180container-test-run-iets-classic-e2e> ok   instantiate --eval, --arg then --argstr of one name181container-test-run-iets-classic-e2e> ok   instantiate --eval, a later expression throws182container-test-run-iets-classic-e2e> ok   instantiate --eval --argstr183container-test-run-iets-classic-e2e> machine # [1630248.569025] machine nix-daemon[5312]: accepted connection from pid 5844, user alice (trusted)184container-test-run-iets-classic-e2e> ok   instantiate a custom drv185container-test-run-iets-classic-e2e> machine # [1630249.695902] machine nix-daemon[5312]: accepted connection from pid 5856, user alice (trusted)186container-test-run-iets-classic-e2e> machine # [1630250.271831] machine nix-daemon[5312]: accepted connection from pid 5877, user alice (trusted)187container-test-run-iets-classic-e2e> ok   drv closure follows the references of a toFile188container-test-run-iets-classic-e2e> machine # [1630250.993125] machine nix-daemon[5312]: accepted connection from pid 5892, user alice (trusted)189container-test-run-iets-classic-e2e> machine # [1630251.160235] machine nix-daemon[5312]: accepted connection from pid 5913, user alice (trusted)190container-test-run-iets-classic-e2e> ok   instantiate builtins.outputOf, once and nested191container-test-run-iets-classic-e2e> machine # [1630251.320016] machine nix-daemon[5312]: accepted connection from pid 5935, user alice (trusted)192container-test-run-iets-classic-e2e> machine # [1630251.619223] machine nix-daemon[5312]: accepted connection from pid 5956, user alice (trusted)193container-test-run-iets-classic-e2e> ok   eval builtins.outputOf placeholders194container-test-run-iets-classic-e2e> machine # [1630251.784777] machine nix-daemon[5312]: accepted connection from pid 5978, user alice (trusted)195container-test-run-iets-classic-e2e> machine # [1630251.897394] machine nix-daemon[5312]: accepted connection from pid 5999, user alice (trusted)196container-test-run-iets-classic-e2e> machine # [1630252.095130] machine nix-daemon[5312]: accepted connection from pid 6021, user alice (trusted)197container-test-run-iets-classic-e2e> ok   two consumers of one dynamic producer stay apart198container-test-run-iets-classic-e2e> ok   instantiate --readonly-mode199container-test-run-iets-classic-e2e> machine # [1630252.716109] machine nix-daemon[5312]: accepted connection from pid 6068, user alice (trusted)200container-test-run-iets-classic-e2e> machine # [1630252.919313] machine nix-daemon[5312]: accepted connection from pid 6091, user alice (trusted)201container-test-run-iets-classic-e2e> machine # [1630253.405768] machine nix-daemon[5312]: accepted connection from pid 6112, user alice (trusted)202container-test-run-iets-classic-e2e> machine # [1630253.590632] machine nix-daemon[5312]: accepted connection from pid 6125, user alice (trusted)203container-test-run-iets-classic-e2e> ok   --add-root links and registers a gc root204container-test-run-iets-classic-e2e> machine # [1630253.872196] machine nix-daemon[5312]: accepted connection from pid 6146, user alice (trusted)205container-test-run-iets-classic-e2e> machine # [1630255.002427] machine nix-daemon[5312]: accepted connection from pid 6196, user alice (trusted)206container-test-run-iets-classic-e2e> machine # [1630256.349246] machine nix-daemon[5312]: accepted connection from pid 6237, user alice (trusted)207container-test-run-iets-classic-e2e> machine # [1630258.710030] machine nix-daemon[5312]: accepted connection from pid 6287, user alice (trusted)208container-test-run-iets-classic-e2e> machine # [1630259.779498] machine nix-daemon[5312]: accepted connection from pid 6330, user alice (trusted)209container-test-run-iets-classic-e2e> machine # [1630265.160810] machine nix-daemon[5312]: accepted connection from pid 6382, user alice (trusted)210container-test-run-iets-classic-e2e> machine # [1630265.672908] machine nix-daemon[5312]: accepted connection from pid 6425, user alice (trusted)211container-test-run-iets-classic-e2e> ok   -o over an existing path acts as Nix does212container-test-run-iets-classic-e2e> machine # [1630267.495104] machine nix-daemon[5312]: accepted connection from pid 6477, user alice (trusted)213container-test-run-iets-classic-e2e> machine # [1630267.728068] machine nix-daemon[5312]: accepted connection from pid 6518, user alice (trusted)214container-test-run-iets-classic-e2e> machine # [1630269.104780] machine nix-daemon[5312]: accepted connection from pid 6562, user alice (trusted)215container-test-run-iets-classic-e2e> ok   build a custom drv, default result216container-test-run-iets-classic-e2e> machine # [1630269.531948] machine nix-daemon[5312]: accepted connection from pid 6597, user alice (trusted)217container-test-run-iets-classic-e2e> machine # [1630271.378343] machine nix-daemon[5312]: accepted connection from pid 6641, user alice (trusted)218container-test-run-iets-classic-e2e> ok   build -o link219container-test-run-iets-classic-e2e> machine # [1630271.953354] machine nix-daemon[5312]: accepted connection from pid 6676, user alice (trusted)220container-test-run-iets-classic-e2e> machine # [1630279.735133] machine nix-daemon[5312]: accepted connection from pid 6720, user alice (trusted)221container-test-run-iets-classic-e2e> ok   build --no-out-link222container-test-run-iets-classic-e2e> machine # [1630280.666080] machine nix-daemon[5312]: accepted connection from pid 6755, user alice (trusted)223container-test-run-iets-classic-e2e> ok   build two outputs of one drv224container-test-run-iets-classic-e2e> machine # [1630285.619318] machine nix-daemon[5312]: accepted connection from pid 6807, user alice (trusted)225container-test-run-iets-classic-e2e> machine # [1630285.936892] machine nix-daemon[5312]: accepted connection from pid 6823, user alice (trusted)226container-test-run-iets-classic-e2e> machine # [1630292.878026] machine nix-daemon[5312]: accepted connection from pid 6872, user alice (trusted)227container-test-run-iets-classic-e2e> ok   build two drvs228container-test-run-iets-classic-e2e> machine # [1630300.844952] machine nix-daemon[5312]: accepted connection from pid 6930, user alice (trusted)229container-test-run-iets-classic-e2e> machine # [1630301.130218] machine nix-daemon[5312]: accepted connection from pid 6967, user alice (trusted)230container-test-run-iets-classic-e2e> machine # [1630301.365198] machine nix-daemon[5312]: accepted connection from pid 6988, user alice (trusted)231container-test-run-iets-classic-e2e> ok   builder = unix://SCRATCH builds there and registers here232container-test-run-iets-classic-e2e> machine # [1630303.124317] machine nix-daemon[5312]: accepted connection from pid 7057, user alice (trusted)233container-test-run-iets-classic-e2e> ok   fetchGit of a clean working tree234container-test-run-iets-classic-e2e> ok   fetchGit of a file URL235container-test-run-iets-classic-e2e> machine # [1630305.038233] machine nix-daemon[5312]: accepted connection from pid 7094, user alice (trusted)236container-test-run-iets-classic-e2e> ok   fetchGit with name, shallow and exportIgnore = false237container-test-run-iets-classic-e2e> machine # [1630305.617781] machine nix-daemon[5312]: accepted connection from pid 7127, user alice (trusted)238container-test-run-iets-classic-e2e> machine # [1630306.263247] machine nix-daemon[5312]: accepted connection from pid 7149, user alice (trusted)239container-test-run-iets-classic-e2e> machine # [1630306.527274] machine nix-daemon[5312]: accepted connection from pid 7168, user alice (trusted)240container-test-run-iets-classic-e2e> ok   fetchGit of a rev241container-test-run-iets-classic-e2e> machine # [1630307.690152] machine nix-daemon[5312]: accepted connection from pid 7190, user alice (trusted)242container-test-run-iets-classic-e2e> ok   fetchGit of a rev in pure mode243container-test-run-iets-classic-e2e> machine # [1630310.097138] machine nix-daemon[5312]: accepted connection from pid 7209, user alice (trusted)244container-test-run-iets-classic-e2e> machine # [1630311.598020] machine nix-daemon[5312]: accepted connection from pid 7231, user alice (trusted)245container-test-run-iets-classic-e2e> ok   fetchGit of a ref246container-test-run-iets-classic-e2e> machine # [1630312.221132] machine nix-daemon[5312]: accepted connection from pid 7252, user alice (trusted)247container-test-run-iets-classic-e2e> ok   fetchGit of an unlocked tree in pure mode248container-test-run-iets-classic-e2e> machine # [1630317.715022] machine nix-daemon[5312]: accepted connection from pid 7301, user alice (trusted)249container-test-run-iets-classic-e2e> ok   fetchGit of a ref that is a tag250container-test-run-iets-classic-e2e> machine # [1630318.007083] machine nix-daemon[5312]: accepted connection from pid 7322, user alice (trusted)251container-test-run-iets-classic-e2e> machine # [1630318.454054] machine nix-daemon[5312]: accepted connection from pid 7344, user alice (trusted)252container-test-run-iets-classic-e2e> ok   fetchGit of a ref that is an annotated tag253container-test-run-iets-classic-e2e> machine # [1630319.215076] machine nix-daemon[5312]: accepted connection from pid 7365, user alice (trusted)254container-test-run-iets-classic-e2e> ok   fetchGit of a branch with an executable, a symlink and a submodule255container-test-run-iets-classic-e2e> machine # [1630319.811666] machine nix-daemon[5312]: accepted connection from pid 7412, user alice (trusted)256container-test-run-iets-classic-e2e> machine # [1630320.228308] machine nix-daemon[5312]: accepted connection from pid 7434, user alice (trusted)257container-test-run-iets-classic-e2e> machine # [1630320.484377] machine nix-daemon[5312]: accepted connection from pid 7453, user alice (trusted)258container-test-run-iets-classic-e2e> ok   fetchGit of a rev and a ref259container-test-run-iets-classic-e2e> ok   fetchGit of a rev with exportIgnore = false260container-test-run-iets-classic-e2e> machine # [1630321.080132] machine nix-daemon[5312]: accepted connection from pid 7492, user alice (trusted)261container-test-run-iets-classic-e2e> ok   fetchGit of a ref that names nothing262container-test-run-iets-classic-e2e> ok   fetchGit { url = "/tmp/iets-classic-e2e.E0Ch5q/fetchgit repo"; rev = "a662c0d65080bd5559611539bfd0f923486baa64"; } runs no nix263container-test-run-iets-classic-e2e> machine # [1630322.035020] machine nix-daemon[5312]: accepted connection from pid 7565, user alice (trusted)264container-test-run-iets-classic-e2e> ok   fetchGit { url = "/tmp/iets-classic-e2e.E0Ch5q/fetchgit repo"; ref = "ann"; } runs no nix265container-test-run-iets-classic-e2e> machine # [1630322.546098] machine nix-daemon[5312]: accepted connection from pid 7584, user alice (trusted)266container-test-run-iets-classic-e2e> ok   fetchGit of a dirty working tree267container-test-run-iets-classic-e2e> machine # [1630323.459154] machine nix-daemon[5312]: accepted connection from pid 7630, user alice (trusted)268container-test-run-iets-classic-e2e> ok   fetchGit of a dirty working tree warns as Nix does269container-test-run-iets-classic-e2e> ok   lib.fileset.gitTracked of a dirty working tree270container-test-run-iets-classic-e2e> machine # [1630328.160070] machine nix-daemon[5312]: accepted connection from pid 7682, user alice (trusted)271container-test-run-iets-classic-e2e> machine # [1630328.297025] machine nix-daemon[5312]: accepted connection from pid 7682, user alice (trusted)272container-test-run-iets-classic-e2e> ok   lib.fileset.gitTracked of a clean working tree273container-test-run-iets-classic-e2e> machine # [1630333.089091] machine nix-daemon[5312]: accepted connection from pid 7731, user alice (trusted)274container-test-run-iets-classic-e2e> machine # [1630333.299028] machine nix-daemon[5312]: accepted connection from pid 7731, user alice (trusted)275container-test-run-iets-classic-e2e> ok   --parse execs the real nix-instantiate276container-test-run-iets-classic-e2e> ok   --iets-option never reaches the fallback nix277container-test-run-iets-classic-e2e> ok   the fallback prints one line on stderr278container-test-run-iets-classic-e2e> ok   IETS_NO_FALLBACK=1 exits 1279container-test-run-iets-classic-e2e> ok   nix-bin-dir full of iets: the fallback stops, it does not loop280container-test-run-iets-classic-e2e> ok   nix eval > /dev/full281container-test-run-iets-classic-e2e> ok   nix-instantiate --eval > /dev/full282container-test-run-iets-classic-e2e> ok   iets version > /dev/full reports, not aborts283container-test-run-iets-classic-e2e> ok   iets parse /tmp/iets-classic-e2e.E0Ch5q/case/multi.nix > /dev/full reports, not aborts284container-test-run-iets-classic-e2e> ok   iets --help > /dev/full reports, not aborts285container-test-run-iets-classic-e2e> ok   iets lint list > /dev/full reports, not aborts286container-test-run-iets-classic-e2e> ok   a bad iets.toml and 'iets version'287container-test-run-iets-classic-e2e> ok   a bad iets.toml and 'iets --help'288container-test-run-iets-classic-e2e> ok   a bad iets.toml and 'iets eval -E 1'289container-test-run-iets-classic-e2e> ok   an early error is a record under internal-json290container-test-run-iets-classic-e2e> machine # [1630349.074127] machine nix-daemon[5312]: accepted connection from pid 7962, user alice (trusted)291container-test-run-iets-classic-e2e> machine # [1630349.281517] machine nix-daemon[5312]: accepted connection from pid 7988, user alice (trusted)292container-test-run-iets-classic-e2e> ok   fetchTarball falls back and prints the real result293container-test-run-iets-classic-e2e> ok   fetchMercurial falls back with one 'iets:' prefix294container-test-run-iets-classic-e2e> ok   iets eval fetchMercurial names fetchTree on stderr295container-test-run-iets-classic-e2e> ok   fetchurl with a sha256 has nix's store path296container-test-run-iets-classic-e2e> machine # [1630353.260911] machine nix-daemon[5312]: accepted connection from pid 8034, user alice (trusted)297container-test-run-iets-classic-e2e> ok   nix eval reads what fetchurl got298container-test-run-iets-classic-e2e> machine # [1630353.935813] machine nix-daemon[5312]: accepted connection from pid 8066, user alice (trusted)299container-test-run-iets-classic-e2e> ok   fetchurl without a hash falls back in an impure evaluation300container-test-run-iets-classic-e2e> machine # [1630354.468174] machine nix-daemon[5312]: accepted connection from pid 8089, user alice (trusted)301container-test-run-iets-classic-e2e> machine # [1630354.640148] machine nix-daemon[5312]: accepted connection from pid 8114, user alice (trusted)302container-test-run-iets-classic-e2e> ok   fetchurl without a hash in a pure evaluation303container-test-run-iets-classic-e2e> machine # [1630355.469050] machine nix-daemon[5312]: accepted connection from pid 8162, user alice (trusted)304container-test-run-iets-classic-e2e> machine # [1630355.630801] machine nix-daemon[5312]: accepted connection from pid 8174, user alice (trusted)305container-test-run-iets-classic-e2e> ok   fetchurl does not take an invalid path306container-test-run-iets-classic-e2e> machine # [1630356.890019] machine nix-daemon[5312]: accepted connection from pid 8197, user alice (trusted)307container-test-run-iets-classic-e2e> ok   fetchurl with a wrong hash does not take an invalid path308container-test-run-iets-classic-e2e> machine # [1630357.802520] machine nix-daemon[5312]: accepted connection from pid 8209, user alice (trusted)309container-test-run-iets-classic-e2e> machine # [1630358.218879] machine nix-daemon[5312]: accepted connection from pid 8249, user alice (trusted)310container-test-run-iets-classic-e2e> machine # [1630358.291204] machine nix-daemon[5312]: accepted connection from pid 8249, user alice (trusted)311container-test-run-iets-classic-e2e> machine # [1630358.433479] machine nix-daemon[5312]: accepted connection from pid 8263, user alice (trusted)312container-test-run-iets-classic-e2e> ok   fetchTarball does not take an invalid path313container-test-run-iets-classic-e2e> ok   import from derivation falls back314container-test-run-iets-classic-e2e> machine # [1630358.957309] machine nix-daemon[5312]: accepted connection from pid 8285, user alice (trusted)315container-test-run-iets-classic-e2e> machine # [1630359.111969] machine nix-daemon[5312]: accepted connection from pid 8310, user alice (trusted)316container-test-run-iets-classic-e2e> ok   iets eval refuses import from derivation317container-test-run-iets-classic-e2e> ok   instantiate --eval a non-UTF-8 file name318container-test-run-iets-classic-e2e> ok   iets eval a non-UTF-8 file name319container-test-run-iets-classic-e2e> ok   a non-UTF-8 file name reaches the fallback intact320container-test-run-iets-classic-e2e> ok   the 'nix' name falls back321container-test-run-iets-classic-e2e> ok   nix eval --json .#x322container-test-run-iets-classic-e2e> machine # [1630362.112076] machine nix-daemon[5312]: accepted connection from pid 8442, user alice (trusted)323container-test-run-iets-classic-e2e> ok   nix eval --raw .#x324container-test-run-iets-classic-e2e> machine # [1630362.743817] machine nix-daemon[5312]: accepted connection from pid 8471, user alice (trusted)325container-test-run-iets-classic-e2e> ok   nix eval .#s (attrset, list, float)326container-test-run-iets-classic-e2e> machine # [1630363.158524] machine nix-daemon[5312]: accepted connection from pid 8500, user alice (trusted)327container-test-run-iets-classic-e2e> machine # [1630363.811028] machine nix-daemon[5312]: accepted connection from pid 8529, user alice (trusted)328container-test-run-iets-classic-e2e> ok   nix eval .#l329container-test-run-iets-classic-e2e> ok   nix flake prefetch-inputs, no inputs330container-test-run-iets-classic-e2e> ok   nix flake prefetch-inputs is iets's own331container-test-run-iets-classic-e2e> machine # [1630366.013033] machine nix-daemon[5312]: accepted connection from pid 8555, user alice (trusted)332container-test-run-iets-classic-e2e> ok   nix eval .#x, no flake.lock333container-test-run-iets-classic-e2e> ok   nix eval .#x, no flake.lock is iets's own334container-test-run-iets-classic-e2e> machine # [1630366.572255] machine nix-daemon[5312]: accepted connection from pid 8584, user alice (trusted)335container-test-run-iets-classic-e2e> ok   nix eval .#pkg.drvPath, no flake.lock336container-test-run-iets-classic-e2e> ok   nix eval .#pkg.drvPath, no flake.lock is iets's own337container-test-run-iets-classic-e2e> machine # [1630366.968874] machine nix-daemon[5312]: accepted connection from pid 8613, user alice (trusted)338container-test-run-iets-classic-e2e> machine # [1630367.211755] machine nix-daemon[5312]: accepted connection from pid 8635, user alice (trusted)339container-test-run-iets-classic-e2e> ok   nix build .#pkg, no flake.lock340container-test-run-iets-classic-e2e> ok   nix build .#pkg, no flake.lock is iets's own341container-test-run-iets-classic-e2e> ok   no flake.lock: neither side writes one342container-test-run-iets-classic-e2e> machine # [1630367.488244] machine nix-daemon[5312]: accepted connection from pid 8635, user alice (trusted)343container-test-run-iets-classic-e2e> machine # [1630367.630196] machine nix-daemon[5312]: accepted connection from pid 8672, user alice (trusted)344container-test-run-iets-classic-e2e> ok   nix eval, farm first on PATH, fresh tree345container-test-run-iets-classic-e2e> ok   fallback through the farm marker, real nix off PATH346container-test-run-iets-classic-e2e> machine # [1630367.984166] machine nix-daemon[5312]: accepted connection from pid 8701, user alice (trusted)347container-test-run-iets-classic-e2e> machine # [1630368.401513] machine nix-daemon[5312]: accepted connection from pid 8771, user alice (trusted)348container-test-run-iets-classic-e2e> ok   nix eval .#pkg (a derivation)349container-test-run-iets-classic-e2e> ok   nix eval . (packages.<system>.default)350container-test-run-iets-classic-e2e> machine # [1630369.226929] machine nix-daemon[5312]: accepted connection from pid 8800, user alice (trusted)351container-test-run-iets-classic-e2e> ok   nix eval --expr352container-test-run-iets-classic-e2e> ok   nix eval --expr is pure353container-test-run-iets-classic-e2e> ok   nix eval --impure --expr354container-test-run-iets-classic-e2e> ok   nix --option pure-eval false eval --expr355container-test-run-iets-classic-e2e> ok   nix eval -f is impure356container-test-run-iets-classic-e2e> ok   nix eval .#x is pure357container-test-run-iets-classic-e2e> machine # [1630371.485202] machine nix-daemon[5312]: accepted connection from pid 8962, user alice (trusted)358container-test-run-iets-classic-e2e> ok   nix-instantiate is impure359container-test-run-iets-classic-e2e> ok   nix-instantiate --pure-eval360container-test-run-iets-classic-e2e> ok   nix-instantiate --option pure-eval true361container-test-run-iets-classic-e2e> ok   nix-instantiate --pure-eval refuses a local file362container-test-run-iets-classic-e2e> ok   nix.conf system reaches builtins.currentSystem363container-test-run-iets-classic-e2e> ok   NIX_USER_CONF_FILES empty364container-test-run-iets-classic-e2e> ok   NIX_USER_CONF_FILES unset365container-test-run-iets-classic-e2e> ok   nix eval -f with pure-eval from the system nix.conf366container-test-run-iets-classic-e2e> ok   nix eval -f with pure-eval from a user nix.conf367container-test-run-iets-classic-e2e> ok   nix eval -f with pure-eval from NIX_CONFIG368container-test-run-iets-classic-e2e> ok   nix eval -f with pure-eval from --option369container-test-run-iets-classic-e2e> ok   nix eval -f with pure-eval from --impure370container-test-run-iets-classic-e2e> ok   instantiate -j 4294967296371container-test-run-iets-classic-e2e> ok   instantiate --cores 4294967296372container-test-run-iets-classic-e2e> ok   instantiate -j auto373container-test-run-iets-classic-e2e> ok   instantiate --cores 1K374container-test-run-iets-classic-e2e> ok   instantiate -j 2375container-test-run-iets-classic-e2e> ok   instantiate -Ifoo=/etc376container-test-run-iets-classic-e2e> ok   nix-eval-jobs prints no summary377container-test-run-iets-classic-e2e> ok   iets eval-jobs keeps its summary378container-test-run-iets-classic-e2e> ok   nix.conf 'pure-eval = maybe'379container-test-run-iets-classic-e2e> ok   nix.conf 'show-trace = maybe'380container-test-run-iets-classic-e2e> ok   nix.conf 'sandbox = maybe'381container-test-run-iets-classic-e2e> ok   nix.conf 'eval-cache = 2'382container-test-run-iets-classic-e2e> ok   nix.conf 'connect-timeout = abc'383container-test-run-iets-classic-e2e> ok   nix.conf 'cores = -1'384container-test-run-iets-classic-e2e> ok   nix.conf 'cores = 4294967296'385container-test-run-iets-classic-e2e> ok   nix.conf 'max-jobs = abc'386container-test-run-iets-classic-e2e> ok   nix.conf 'cores = 1K'387container-test-run-iets-classic-e2e> ok   nix.conf 'min-free = 2G'388container-test-run-iets-classic-e2e> ok   nix.conf 'max-jobs = auto'389container-test-run-iets-classic-e2e> ok   nix.conf 'sandbox = relaxed'390container-test-run-iets-classic-e2e> ok   nix eval --expr, a nested error391container-test-run-iets-classic-e2e> ok   nix eval --expr, repeated and empty values392container-test-run-iets-classic-e2e> ok   nix eval --expr, functions393container-test-run-iets-classic-e2e> machine # [1630386.528188] machine nix-daemon[5312]: accepted connection from pid 9803, user alice (trusted)394container-test-run-iets-classic-e2e> ok   symlink: readFile through a copy of the link itself395container-test-run-iets-classic-e2e> machine # [1630387.146851] machine nix-daemon[5312]: accepted connection from pid 9832, user alice (trusted)396container-test-run-iets-classic-e2e> ok   symlink: readFile of a target the filter left out397container-test-run-iets-classic-e2e> machine # [1630389.084334] machine nix-daemon[5312]: accepted connection from pid 9861, user alice (trusted)398container-test-run-iets-classic-e2e> ok   symlink: readDir through a copy of the link itself399container-test-run-iets-classic-e2e> machine # [1630389.788929] machine nix-daemon[5312]: accepted connection from pid 9890, user alice (trusted)400container-test-run-iets-classic-e2e> ok   symlink: hashFile through a copy of the link itself401container-test-run-iets-classic-e2e> machine # [1630392.303015] machine nix-daemon[5312]: accepted connection from pid 9919, user alice (trusted)402container-test-run-iets-classic-e2e> ok   symlink: readFile below a link in a copied tree403container-test-run-iets-classic-e2e> machine # [1630393.206317] machine nix-daemon[5312]: accepted connection from pid 9948, user alice (trusted)404container-test-run-iets-classic-e2e> machine # [1630393.887084] machine nix-daemon[5312]: accepted connection from pid 9977, user alice (trusted)405container-test-run-iets-classic-e2e> ok   symlink: readDir of a link in a copied tree406container-test-run-iets-classic-e2e> ok   symlink: pathExists below a link in a copied tree407container-test-run-iets-classic-e2e> machine # [1630395.312212] machine nix-daemon[5312]: accepted connection from pid 10006, user alice (trusted)408container-test-run-iets-classic-e2e> ok   symlink: path of a link in a copied tree409container-test-run-iets-classic-e2e> machine # [1630398.093714] machine nix-daemon[5312]: accepted connection from pid 10035, user alice (trusted)410container-test-run-iets-classic-e2e> ok   symlink: path of a link, local and copied agree411container-test-run-iets-classic-e2e> machine # [1630400.555030] machine nix-daemon[5312]: accepted connection from pid 10064, user alice (trusted)412container-test-run-iets-classic-e2e> ok   symlink: path of a dangling link413container-test-run-iets-classic-e2e> machine # [1630403.712562] machine nix-daemon[5312]: accepted connection from pid 10093, user alice (trusted)414container-test-run-iets-classic-e2e> machine # [1630403.787417] machine nix-daemon[10113]: unexpected Nix daemon error: error: write of 128 bytes: Broken pipe415container-test-run-iets-classic-e2e> ok   symlink: path of a dangling link in a copied tree416container-test-run-iets-classic-e2e> machine # [1630405.087843] machine nix-daemon[5312]: accepted connection from pid 10122, user alice (trusted)417container-test-run-iets-classic-e2e> ok   symlink: storePath below a link in a copied tree418container-test-run-iets-classic-e2e> machine # [1630406.259200] machine nix-daemon[5312]: accepted connection from pid 10152, user alice (trusted)419container-test-run-iets-classic-e2e> ok   symlink: filterSource sees the store path of an unfiltered copy420container-test-run-iets-classic-e2e> machine # [1630406.964670] machine nix-daemon[5312]: accepted connection from pid 10181, user alice (trusted)421container-test-run-iets-classic-e2e> ok   symlink: path keeps the references of a store path422container-test-run-iets-classic-e2e> machine # [1630407.548341] machine nix-daemon[5312]: accepted connection from pid 10210, user alice (trusted)423container-test-run-iets-classic-e2e> machine # [1630407.603658] machine nix-daemon[5312]: accepted connection from pid 10230, user alice (trusted)424container-test-run-iets-classic-e2e> ok   symlink: path flat refuses a store path with references425container-test-run-iets-classic-e2e> ok   nix eval -f FILE ATTR426container-test-run-iets-classic-e2e> machine # [1630408.455016] machine nix-daemon[5312]: accepted connection from pid 10259, user alice (trusted)427container-test-run-iets-classic-e2e> machine # [1630408.596156] machine nix-daemon[5312]: accepted connection from pid 10279, user alice (trusted)428container-test-run-iets-classic-e2e> ok   nix eval --json -f FILE ATTR429container-test-run-iets-classic-e2e> ok   auto-call a function file, defaults: nix-instantiate430container-test-run-iets-classic-e2e> ok   auto-call a function file, defaults: iets eval431container-test-run-iets-classic-e2e> ok   auto-call a '...' function file, defaults: nix-instantiate432container-test-run-iets-classic-e2e> ok   auto-call a '...' function file, defaults: iets eval433container-test-run-iets-classic-e2e> ok   auto-call a function file, --arg: nix-instantiate434container-test-run-iets-classic-e2e> ok   auto-call a function file, --arg: iets eval435container-test-run-iets-classic-e2e> ok   auto-call a '...' function file, --arg: nix-instantiate