nixbot

builds

cancelled checks.x86_64-linux.test build #178 · raw · eval 206 ms · 9.9 MiB allocated · ·

1this derivation will be built:2  /nix/store/i6ls1kg1dn4gn6s9x2v97mdxrc41nc75-iets-nextest-0.1.0.drv3building '/nix/store/i6ls1kg1dn4gn6s9x2v97mdxrc41nc75-iets-nextest-0.1.0.drv'4iets-nextest-0.1.0> Running phase: unpackPhase5iets-nextest-0.1.0> unpacking source archive /nix/store/b8zhw6s7863li6nnl4nwmqbd68y6hz1f-source6iets-nextest-0.1.0> source root is source7iets-nextest-0.1.0> Running phase: patchPhase8iets-nextest-0.1.0> Executing configureCargoCommonVars9iets-nextest-0.1.0> decompressing cargo artifacts from /nix/store/390hmqly6vn927zlvdv198s4nqrqxsh9-iets-deps-0.1.0/target.tar.zst to target10iets-nextest-0.1.0> Running phase: updateAutotoolsGnuConfigScriptsPhase11iets-nextest-0.1.0> Running phase: configurePhase12iets-nextest-0.1.0> will append /build/source/.cargo-home/config.toml with contents of /nix/store/kcp4b936hbdmdqyk70cz6fyd4gnf3msb-vendor-cargo-deps/config.toml13iets-nextest-0.1.0> default configurePhase, nothing to do14iets-nextest-0.1.0> Running phase: buildPhase15iets-nextest-0.1.0> +++ command cargo --version16iets-nextest-0.1.0> cargo 1.98.0 (797e8a9bc 2026-08-05)17iets-nextest-0.1.0> +++ command cargo nextest --version18iets-nextest-0.1.0> cargo-nextest 0.9.14319iets-nextest-0.1.0> release: 0.9.14320iets-nextest-0.1.0> host: x86_64-unknown-linux-gnu21iets-nextest-0.1.0> Running phase: checkPhase22iets-nextest-0.1.0> +++ command cargo nextest run --cargo-profile dev23iets-nextest-0.1.0>    Compiling iets v0.1.0 (/build/source)24iets-nextest-0.1.0>     Finished `dev` profile [unoptimized + debuginfo] target(s) in 5m 31s25iets-nextest-0.1.0> ------------26iets-nextest-0.1.0>  Nextest run ID 061f98cf-513a-4539-a770-aed2a76a6a46 with nextest profile: default27iets-nextest-0.1.0>     Starting 572 tests across 12 binaries (5 tests skipped)28iets-nextest-0.1.0>         PASS [   0.069s] (  1/572) iets api::drvshow::tests::floats_take_nlohmanns_form29iets-nextest-0.1.0>         PASS [   0.073s] (  2/572) iets api::drvshow::tests::a_multi_output_derivation30iets-nextest-0.1.0>         PASS [   0.073s] (  3/572) iets api::drvshow::tests::a_non_canonical_structured_attrs_text_is_renormalised31iets-nextest-0.1.0>         PASS [   0.082s] (  4/572) iets api::drvshow::tests::inputs_and_structured_attrs32iets-nextest-0.1.0>         PASS [   0.060s] (  5/572) iets build::fixhash::tests::two_matches_are_left_alone33iets-nextest-0.1.0>         PASS [   0.066s] (  6/572) iets build::fixhash::tests::a_longer_hash_is_not_a_match34iets-nextest-0.1.0>         PASS [   0.093s] (  7/572) iets api::fetch::tests::the_fake_hash_moves_the_output_and_the_drv35iets-nextest-0.1.0>         PASS [   0.070s] (  8/572) iets build::fanout::tests::dependencies_run_first36iets-nextest-0.1.0>         PASS [   0.089s] (  9/572) iets build::executor::tests::a_declared_system_filters37iets-nextest-0.1.0>         PASS [   0.090s] ( 10/572) iets build::backend::tests::base_names_drop_the_store_dir38iets-nextest-0.1.0>         PASS [   0.096s] ( 11/572) iets build::event::tests::durations39iets-nextest-0.1.0>         PASS [   0.097s] ( 12/572) iets build::executor::tests::no_place_at_all_is_a_usage_error40iets-nextest-0.1.0>         PASS [   0.022s] ( 13/572) iets build::render::tests::the_summary_follows_more_than_one_build41iets-nextest-0.1.0>         PASS [   0.099s] ( 14/572) iets build::render::tests::a_daemon_failure_message_decides_the_verdict42iets-nextest-0.1.0>         PASS [   0.113s] ( 15/572) iets build::executor::tests::the_first_place_that_takes_it_wins43iets-nextest-0.1.0>         PASS [   0.118s] ( 16/572) iets build::executor::tests::a_refusal_names_every_place_and_what_it_declared44iets-nextest-0.1.0>         PASS [   0.052s] ( 17/572) iets build::render::tests::ci_folds_a_success_and_never_a_failure45iets-nextest-0.1.0>         PASS [   0.133s] ( 18/572) iets api::fetch::tests::only_a_fixed_output_drv_can_be_prefetched46iets-nextest-0.1.0>         PASS [   0.129s] ( 19/572) iets build::backend::tests::output_specs47iets-nextest-0.1.0>         PASS [   0.112s] ( 20/572) iets build::fixhash::tests::one_match_is_rewritten_in_its_own_spelling48iets-nextest-0.1.0>         PASS [   0.118s] ( 21/572) iets build::render::tests::a_failure_after_the_activity_ended_never_claims_a_success49iets-nextest-0.1.0>         PASS [   0.148s] ( 22/572) iets api::drvshow::tests::pretty_matches_serde_json50iets-nextest-0.1.0>         PASS [   0.122s] ( 23/572) iets build::render::tests::a_long_attribute_keeps_its_ends51iets-nextest-0.1.0>         PASS [   0.123s] ( 24/572) iets build::render::tests::a_build_the_backend_saw_succeed_is_verdicted_at_once52iets-nextest-0.1.0>         PASS [   0.151s] ( 25/572) iets api::installable::tests::the_name_a_program_takes_from_a_derivation_name53iets-nextest-0.1.0>         PASS [   0.058s] ( 26/572) iets build::render::tests::the_live_region_spins_and_counts54iets-nextest-0.1.0>         PASS [   0.142s] ( 27/572) iets build::executor::tests::an_unsupported_url_says_what_is_expected55iets-nextest-0.1.0>         PASS [   0.147s] ( 28/572) iets build::executor::tests::a_feature_the_place_lacks_rules_it_out56iets-nextest-0.1.0>         PASS [   0.028s] ( 29/572) iets build::tests::targets_become_jobs57iets-nextest-0.1.0>         PASS [   0.061s] ( 30/572) iets build::render::tests::one_build_needs_no_summary58iets-nextest-0.1.0>         PASS [   0.051s] ( 31/572) iets build::tests::a_fan_out_backend_keeps_the_cap_and_the_log_blocks59iets-nextest-0.1.0>         PASS [   0.134s] ( 32/572) iets build::render::tests::a_failure_shows_a_short_extract60iets-nextest-0.1.0>         PASS [   0.104s] ( 33/572) iets build::render::tests::a_stalled_build_that_fails_still_shows_its_cause61iets-nextest-0.1.0>         PASS [   0.099s] ( 34/572) iets build::render::tests::an_owned_build_is_verdicted_once_by_its_op62iets-nextest-0.1.0>         PASS [   0.171s] ( 35/572) iets api::drvshow::tests::a_fixed_output_shows_its_content_address_and_no_path63iets-nextest-0.1.0>         PASS [   0.158s] ( 36/572) iets build::render::tests::a_build_log_never_reports_a_mismatch64iets-nextest-0.1.0>         PASS [   0.027s] ( 37/572) iets builtins::store_hooks::tests::a_relative_path_inside_an_entry_joins_once65iets-nextest-0.1.0>         PASS [   0.114s] ( 38/572) iets build::render::tests::an_unfolded_success_ends_with_its_verdict66iets-nextest-0.1.0>         PASS [   0.181s] ( 39/572) iets argv::tests::every_byte_round_trips67iets-nextest-0.1.0>         PASS [   0.187s] ( 40/572) iets build::backend::tests::the_timings_report_with_every_line68iets-nextest-0.1.0>         PASS [   0.023s] ( 41/572) iets builtins::text::regex::tests::names69iets-nextest-0.1.0>         PASS [   0.032s] ( 42/572) iets cachefs::tests::a_directory_that_is_not_ours_is_refused_untouched70iets-nextest-0.1.0>         PASS [   0.219s] ( 43/572) iets api::installable::tests::default_and_fragment_attr_paths71iets-nextest-0.1.0>         PASS [   0.088s] ( 44/572) iets builtins::derivation::tests::the_two_placeholders_are_not_the_same72iets-nextest-0.1.0>         PASS [   0.057s] ( 45/572) iets builtins::text::fromtoml::tests::inline_tables_stay_on_one_line73iets-nextest-0.1.0>         PASS [   0.105s] ( 46/572) iets build::tests::a_target_with_no_verdict_fails74iets-nextest-0.1.0>         PASS [   0.058s] ( 47/572) iets builtins::text::regex::tests::size_limit75iets-nextest-0.1.0>         PASS [   0.212s] ( 48/572) iets build::fanout::tests::a_failed_dependency_blocks_its_dependants76iets-nextest-0.1.0>         PASS [   0.144s] ( 49/572) iets build::render::tests::logs_of_two_builds_do_not_interleave77iets-nextest-0.1.0>         PASS [   0.020s] ( 50/572) iets cachefs::tests::sweep_ages_a_root_by_its_link_not_by_what_it_names78iets-nextest-0.1.0>         PASS [   0.026s] ( 51/572) iets cachefs::tests::an_input_store_of_the_spool_layout_is_wiped79iets-nextest-0.1.0>         PASS [   0.027s] ( 52/572) iets cachefs::tests::an_empty_directory_is_ours_to_take80iets-nextest-0.1.0>         PASS [   0.165s] ( 53/572) iets build::render::tests::drv_paths_of_a_failure_message81iets-nextest-0.1.0>         PASS [   0.233s] ( 54/572) iets build::fanout::tests::at_most_limit_builds_run_at_once82iets-nextest-0.1.0>         PASS [   0.034s] ( 55/572) iets cachefs::tests::a_touch_inside_the_interval_writes_nothing83iets-nextest-0.1.0>         PASS [   0.018s] ( 56/572) iets cachefs::tests::sweep_drops_old_entries_and_keeps_young_ones84iets-nextest-0.1.0>         PASS [   0.104s] ( 57/572) iets builtins::fetch_git::tests::only_a_plain_rev_or_ref_is_read_by_iets85iets-nextest-0.1.0>         PASS [   0.251s] ( 58/572) iets build::executor::tests::one_place_declaring_nothing_takes_everything86iets-nextest-0.1.0>         PASS [   0.026s] ( 59/572) iets cachefs::tests::sweep_walks_the_shards_of_the_ir_cache87iets-nextest-0.1.0>         PASS [   0.121s] ( 60/572) iets builtins::text::fromtoml::tests::new_escapes_are_refused88iets-nextest-0.1.0>         PASS [   0.031s] ( 61/572) iets cachefs::tests::version_mismatch_wipes_the_store89iets-nextest-0.1.0>         PASS [   0.022s] ( 62/572) iets cli::build::tests::no_build_result_is_named90iets-nextest-0.1.0>         PASS [   0.074s] ( 63/572) iets cachefs::tests::a_sweep_runs_once_per_interval91iets-nextest-0.1.0>         PASS [   0.021s] ( 64/572) iets cli::classic::shell::tests::sh_var_names92iets-nextest-0.1.0>         PASS [   0.023s] ( 65/572) iets cli::build::tests::out_links_are_named_as_nix_build_names_them93iets-nextest-0.1.0>         PASS [   0.056s] ( 66/572) iets cli::build::tests::a_success_with_no_output_path_is_named94iets-nextest-0.1.0>         PASS [   0.182s] ( 67/572) iets build::tests::hash_stripping95iets-nextest-0.1.0>         PASS [   0.027s] ( 68/572) iets cli::classic::shell::tests::declares_for_every_bash_shaped_value96iets-nextest-0.1.0>         PASS [   0.160s] ( 69/572) iets builtins::fetch_git::tests::a_working_tree_is_a_file_url_of_an_absolute_path97iets-nextest-0.1.0>         PASS [   0.097s] ( 70/572) iets cachefs::tests::a_wait_lock_waits_for_its_holder98iets-nextest-0.1.0>         PASS [   0.091s] ( 71/572) iets cachefs::tests::garbled_stamp_wipes_the_store99iets-nextest-0.1.0>         PASS [   0.019s] ( 72/572) iets cli::docs::tests::the_topic_list_fits_80_columns100iets-nextest-0.1.0>         PASS [   0.020s] ( 73/572) iets cli::docs::tests::topics_resolve_bare_and_qualified101iets-nextest-0.1.0>         PASS [   0.225s] ( 74/572) iets build::render::tests::tty_keeps_successful_logs_off_the_screen102iets-nextest-0.1.0>         PASS [   0.202s] ( 75/572) iets builtins::derivation::tests::a_dynamic_output_renders_the_placeholder_nix_renders103iets-nextest-0.1.0>         PASS [   0.047s] ( 76/572) iets cli::classic::shell::tests::outputs_become_placeholders104iets-nextest-0.1.0>         PASS [   0.077s] ( 77/572) iets cli::build::tests::an_out_flag_that_matches_nothing_is_named105iets-nextest-0.1.0>         PASS [   0.021s] ( 78/572) iets cli::help::tests::a_mistyped_command_is_suggested106iets-nextest-0.1.0>         PASS [   0.029s] ( 79/572) iets cli::help::tests::messages107iets-nextest-0.1.0>         PASS [   0.124s] ( 80/572) iets cachefs::tests::a_wipe_of_the_ir_cache_walks_its_shards108iets-nextest-0.1.0>         PASS [   0.017s] ( 81/572) iets cli::search::tests::drv_names109iets-nextest-0.1.0>         PASS [   0.022s] ( 82/572) iets cli::render::tests::sizes_render_as_nix_renders_them110iets-nextest-0.1.0>         PASS [   0.026s] ( 83/572) iets cli::render::text::tests::a_long_value_shows_the_lines_that_differ111iets-nextest-0.1.0>         PASS [   0.024s] ( 84/572) iets cli::search::tests::merged_highlights112iets-nextest-0.1.0>         PASS [   0.052s] ( 85/572) iets cli::diff::tests::a_name_ends_at_the_first_dash_before_a_digit113iets-nextest-0.1.0>         PASS [   0.275s] ( 86/572) iets build::render::tests::heartbeat_names_running_builds114iets-nextest-0.1.0>         PASS [   0.045s] ( 87/572) iets cli::help::tests::help_fits_80_columns115iets-nextest-0.1.0>         PASS [   0.138s] ( 88/572) iets cli::classic::tests::a_flag_with_no_effect_is_noted_and_one_that_holds_is_not116iets-nextest-0.1.0>         PASS [   0.340s] ( 89/572) iets cachefs::tests::a_store_without_a_version_file_is_wiped_once117iets-nextest-0.1.0>         PASS [   0.197s] ( 90/572) iets cli::plumbing::tests::a_file_url_needs_one_slash_not_three118iets-nextest-0.1.0>         PASS [   0.226s] ( 91/572) iets cli::docs::tests::every_embedded_page_has_a_heading119iets-nextest-0.1.0>         PASS [   0.204s] ( 92/572) iets cli::search::tests::index_round_trip120iets-nextest-0.1.0>         PASS [   0.238s] ( 93/572) iets cli::plumbing::tests::a_url_is_the_positional_fetch_takes_itself121iets-nextest-0.1.0>         PASS [   0.393s] ( 94/572) iets cachefs::tests::a_wipe_keeps_what_iets_did_not_create122iets-nextest-0.1.0>         PASS [   0.355s] ( 95/572) iets cli::build::tests::no_outcome_at_all_is_named123iets-nextest-0.1.0>         PASS [   0.373s] ( 96/572) iets cli::build::tests::a_path_on_stdout_is_silent124iets-nextest-0.1.0>         PASS [   0.373s] ( 97/572) iets cli::build::tests::a_failed_build_reports_itself125iets-nextest-0.1.0>         PASS [   0.307s] ( 98/572) iets cli::help::tests::suggestions_come_from_the_help126iets-nextest-0.1.0>         PASS [   0.376s] ( 99/572) iets cachefs::tests::the_writer_lock_excludes_one_holder_at_a_time127iets-nextest-0.1.0>         PASS [   0.678s] (100/572) iets cachefs::tests::a_stamp_in_the_future_is_due128iets-nextest-0.1.0>         PASS [   0.680s] (101/572) iets cachefs::tests::a_lock_that_cannot_be_opened_is_not_a_busy_lock129iets-nextest-0.1.0>         PASS [   0.401s] (102/572) iets config::tests::the_setting_tables_name_nix_settings130iets-nextest-0.1.0>         PASS [   0.505s] (103/572) iets config::tests::max_jobs_auto_is_the_cpu_count131iets-nextest-0.1.0>         PASS [   0.172s] (104/572) iets config::tests::user_conf_files_are_in_precedence_order132iets-nextest-0.1.0>         PASS [   0.425s] (105/572) iets config::tests::overrides_win_over_files133iets-nextest-0.1.0>         PASS [   0.616s] (106/572) iets config::tests::basic_syntax134iets-nextest-0.1.0>         PASS [   0.683s] (107/572) iets config::tests::a_setting_with_no_effect_is_noted135iets-nextest-0.1.0>         PASS [   0.685s] (108/572) iets config::tests::a_classic_name_leaves_an_unimplemented_setting_to_nix136iets-nextest-0.1.0>         PASS [   0.679s] (109/572) iets config::tests::bad_typed_values_error_where_they_are_set137iets-nextest-0.1.0>         PASS [   0.417s] (110/572) iets config::tests::the_daemon_gets_the_store_settings_set_outside_the_system_file138iets-nextest-0.1.0>         PASS [   0.415s] (111/572) iets config::tests::typed_getters_and_defaults139iets-nextest-0.1.0>         PASS [   0.620s] (112/572) iets config::tests::bool_spellings140iets-nextest-0.1.0>         PASS [   0.421s] (113/572) iets config::tests::unknown_settings_are_kept141iets-nextest-0.1.0>         PASS [   0.523s] (114/572) iets config::tests::extra_appends_to_list_settings_only142iets-nextest-0.1.0>         PASS [   0.692s] (115/572) iets config::tests::an_alias_is_its_setting143iets-nextest-0.1.0>         PASS [   0.024s] (116/572) iets devenv::tests::get_env_sh_store_path_matches_nix144iets-nextest-0.1.0>         PASS [   0.484s] (117/572) iets config::tests::option_nix_path_replaces_nix_path_and_extra_adds145iets-nextest-0.1.0>         PASS [   0.019s] (118/572) iets devenv::tests::rc_script_rewrites_outputs_and_writes_attrs146iets-nextest-0.1.0>         PASS [   0.024s] (119/572) iets devenv::tests::non_bash_builder_is_refused147iets-nextest-0.1.0>         PASS [   0.021s] (120/572) iets devenv::tests::shell_escaping148iets-nextest-0.1.0>         PASS [   0.535s] (121/572) iets config::tests::include_chain149iets-nextest-0.1.0>         PASS [   0.196s] (122/572) iets devenv::tests::cached_result_roundtrip150iets-nextest-0.1.0>         PASS [   0.441s] (123/572) iets config::tests::syntax_errors151iets-nextest-0.1.0>         PASS [   0.526s] (124/572) iets config::tests::missing_include_errors_and_bang_include_does_not152iets-nextest-0.1.0>         PASS [   0.026s] (125/572) iets devenv::tests::json_roundtrip_and_bash_forms153iets-nextest-0.1.0>         PASS [   0.025s] (126/572) iets devenv::tests::output_checks_are_erased_only_when_present154iets-nextest-0.1.0>         PASS [   0.026s] (127/572) iets devenv::tests::rewrites_apply_in_map_order_to_every_occurrence155iets-nextest-0.1.0>         PASS [   1.856s] (128/572) iets api::value::tests::force_deep_forces_the_whole_tree156iets-nextest-0.1.0>         PASS [   1.713s] (129/572) iets builtins::fetch::tests::an_entry_of_the_compiled_file_cache_keeps_the_site157iets-nextest-0.1.0>         PASS [   1.911s] (130/572) iets api::value::tests::wrong_type_is_an_error158iets-nextest-0.1.0>         PASS [   2.160s] (131/572) iets api::value::tests::apply_is_lazy159iets-nextest-0.1.0>         PASS [   2.252s] (132/572) iets api::value::tests::thunk_reads_as_thunk160iets-nextest-0.1.0>         PASS [   2.123s] (133/572) iets builtins::store_hooks::tests::virtual_tree_reads_go_to_the_local_files161iets-nextest-0.1.0>         PASS [   0.027s] (134/572) iets fetch::http::tests::credentials_in_the_url_are_sent_and_never_printed162iets-nextest-0.1.0>         PASS [   2.377s] (135/572) iets api::value::tests::lists163iets-nextest-0.1.0>         PASS [   2.383s] (136/572) iets api::value::tests::attrs_by_name_and_index164iets-nextest-0.1.0>         PASS [   2.246s] (137/572) iets builtins::fetch::tests::nix_sees_no_mark165iets-nextest-0.1.0>         PASS [   0.008s] (138/572) iets fetch::http::tests::magic_bytes166iets-nextest-0.1.0>         PASS [   0.021s] (139/572) iets fetch::http::tests::file_urls_name_a_local_path167iets-nextest-0.1.0>         PASS [   0.011s] (140/572) iets fetch::http::tests::redirects_keep_credentials_only_on_the_same_origin168iets-nextest-0.1.0>         PASS [   0.011s] (141/572) iets fetch::http::tests::redirects_resolve169iets-nextest-0.1.0>         PASS [   0.028s] (142/572) iets fetch::http::tests::urls_split170iets-nextest-0.1.0>         PASS [   2.450s] (143/572) iets api::value::tests::missing_attribute171iets-nextest-0.1.0>         PASS [   0.010s] (144/572) iets fetch::roots::tests::a_named_file_that_is_missing_or_empty_is_an_error172iets-nextest-0.1.0>         PASS [   0.017s] (145/572) iets fetch::roots::tests::nix_ssl_cert_file_wins_over_ssl_cert_file_and_the_platform173iets-nextest-0.1.0>         PASS [   0.010s] (146/572) iets fetch::roots::tests::no_bundle_anywhere_gives_the_compiled_in_set174iets-nextest-0.1.0>         PASS [   1.433s] (147/572) iets eval::tests::derivation_keeps_env_and_args_that_are_not_utf8175iets-nextest-0.1.0>         PASS [   0.100s] (148/572) iets fetch::http::tests::trailing_bytes_and_a_second_layer176iets-nextest-0.1.0>         PASS [   0.144s] (149/572) iets fetch::http::tests::downloads_stop_at_the_size_limit177iets-nextest-0.1.0>         PASS [   0.025s] (150/572) iets fetch::spool::tests::a_sparse_member_counts_against_the_size_limit178iets-nextest-0.1.0>         PASS [   0.074s] (151/572) iets fetch::spool::tests::a_hard_link_never_replaces_a_member179iets-nextest-0.1.0>         PASS [   0.084s] (152/572) iets fetch::spool::tests::an_empty_archive_is_an_empty_directory180iets-nextest-0.1.0>         PASS [   2.681s] (153/572) iets api::value::tests::calling_a_function181iets-nextest-0.1.0>         PASS [   0.376s] (154/572) iets fetch::http::tests::credentials_stay_on_the_first_origin182iets-nextest-0.1.0>         PASS [   0.204s] (155/572) iets fetch::roots::tests::the_platform_store_wins_over_the_compiled_in_set183iets-nextest-0.1.0>         PASS [   0.238s] (156/572) iets fetch::roots::tests::an_empty_nix_ssl_cert_file_hides_ssl_cert_file184iets-nextest-0.1.0>         PASS [   0.040s] (157/572) iets fetch::spool::tests::archives_the_git_sink_accepts185iets-nextest-0.1.0>         PASS [   0.031s] (158/572) iets fetch::spool::tests::nar_hash_of_the_fixture186iets-nextest-0.1.0>         PASS [   0.031s] (159/572) iets fetch::spool::tests::pax_sparse_members_are_expanded187iets-nextest-0.1.0>         PASS [   2.550s] (160/572) iets builtins::text::regex::tests::long_inputs_do_not_recurse188iets-nextest-0.1.0>         PASS [   0.035s] (161/572) iets fetch::spool::tests::spool_matches_the_tree_on_the_top_level189iets-nextest-0.1.0>         PASS [   0.021s] (162/572) iets fetch::spool::tests::the_scratch_file_never_follows_a_symlink190iets-nextest-0.1.0>         PASS [   2.738s] (163/572) iets api::value::tests::construction191iets-nextest-0.1.0>         PASS [   0.023s] (164/572) iets fetch::unpack::tests::a_repeated_member_keeps_the_last_copy192iets-nextest-0.1.0>         PASS [   0.034s] (165/572) iets fetch::spool::tests::the_errors_match193iets-nextest-0.1.0>         PASS [   0.017s] (166/572) iets fetch::unpack::tests::member_names_are_made_relative_and_cannot_escape194iets-nextest-0.1.0>         PASS [   0.035s] (167/572) iets fetch::unpack::tests::an_unsupported_member_type_is_an_error195iets-nextest-0.1.0>         PASS [   0.274s] (168/572) iets fetch::spool::tests::a_changed_index_byte_is_a_miss196iets-nextest-0.1.0>         PASS [   0.029s] (169/572) iets fetch::unpack::tests::nar_hash_of_the_fixture197iets-nextest-0.1.0>         PASS [   0.044s] (170/572) iets fetch::unpack::tests::keeps_the_root_when_it_is_not_a_single_directory198iets-nextest-0.1.0>         PASS [   0.021s] (171/572) iets fetch::unpack::tests::strips_one_leading_component199iets-nextest-0.1.0>         PASS [   0.021s] (172/572) iets flake::flakeref::tests::errors_and_unsupported200iets-nextest-0.1.0>         PASS [   0.018s] (173/572) iets flake::flakeref::tests::git_urls_are_fixed_like_nix201iets-nextest-0.1.0>         PASS [   0.021s] (174/572) iets flake::flakeref::tests::parses_the_kept_schemes202iets-nextest-0.1.0>         PASS [   0.230s] (175/572) iets fetch::spool::tests::a_stored_tree_dumps_the_spools_nar203iets-nextest-0.1.0>         PASS [   0.063s] (176/572) iets jobs::constituents::tests::fnmatch_basics204iets-nextest-0.1.0>         PASS [   0.068s] (177/572) iets flake::tests::a_pinned_checkout_is_its_revision205iets-nextest-0.1.0>         PASS [   0.065s] (178/572) iets flake::tests::refs_resolve_against_cwd_and_home206iets-nextest-0.1.0>         PASS [   0.071s] (179/572) iets flake::flakeref::tests::round_trips207iets-nextest-0.1.0>         PASS [   0.072s] (180/572) iets flake::flakeref::tests::refuses_a_github_ref_named_twice208iets-nextest-0.1.0>         PASS [   0.072s] (181/572) iets flake::flakeref::tests::to_string_from_attrs209iets-nextest-0.1.0>         PASS [   0.103s] (182/572) iets fetch::unpack::tests::modes_symlinks_and_empty_dirs210iets-nextest-0.1.0>         PASS [   0.216s] (183/572) iets fetch::spool::tests::spool_matches_the_tree211iets-nextest-0.1.0>         PASS [   0.028s] (184/572) iets jobs::line::tests::error_line_round_trip212iets-nextest-0.1.0>         PASS [   0.024s] (185/572) iets jobs::line::tests::stats_survive_the_collector213iets-nextest-0.1.0>         PASS [   0.042s] (186/572) iets lint::allow::tests::comment_names214iets-nextest-0.1.0>         PASS [   0.053s] (187/572) iets lint::allow::tests::lines215iets-nextest-0.1.0>         PASS [   2.585s] (188/572) iets compile::cache::tests::nesting_past_the_cap_misses216iets-nextest-0.1.0>         PASS [   0.015s] (189/572) iets lint::tests::scope_and_inputs217iets-nextest-0.1.0>         PASS [   0.057s] (190/572) iets lint::site::tests::the_span_is_the_innermost_node_of_the_kind_of_the_lint218iets-nextest-0.1.0>         PASS [   0.012s] (191/572) iets lint::tests::specificity_inside_a_source_and_order_between_sources219iets-nextest-0.1.0>         PASS [   0.058s] (192/572) iets lint::tests::keys220iets-nextest-0.1.0>         PASS [   0.082s] (193/572) iets lint::tests::an_unknown_name_is_a_warning_in_a_file_and_an_error_in_a_flag221iets-nextest-0.1.0>         PASS [   0.021s] (194/572) iets log::tests::a_coloured_error_is_an_error_record222iets-nextest-0.1.0>         PASS [   0.167s] (195/572) iets jobs::line::tests::split_and_round_trip223iets-nextest-0.1.0>         PASS [   0.036s] (196/572) iets lint::tests::the_project_file_walk_stops_at_the_project_root224iets-nextest-0.1.0>         PASS [   0.034s] (197/572) iets lint::tests::toml_table225iets-nextest-0.1.0>         PASS [   0.125s] (198/572) iets lint::site::tests::a_literal_lint_of_nix_has_an_edit226iets-nextest-0.1.0>         PASS [   0.025s] (199/572) iets log::tests::a_fixed_hash_has_the_shape_of_a_finding_with_an_edit227iets-nextest-0.1.0>         PASS [   0.017s] (200/572) iets log::tests::a_forged_mismatch_is_dropped228iets-nextest-0.1.0>         PASS [   0.105s] (201/572) iets lint::tests::names_are_unique_kebab_case229iets-nextest-0.1.0>         PASS [   0.200s] (202/572) iets jobs::constituents::tests::topo_sort_orders_and_detects_cycles230iets-nextest-0.1.0>         PASS [   0.022s] (203/572) iets log::tests::a_hash_mismatch_names_the_hash_it_got231iets-nextest-0.1.0>         PASS [   0.197s] (204/572) iets jobs::tests::a_numeric_name_selects_an_attribute_under_a_set232iets-nextest-0.1.0>         PASS [   0.290s] (205/572) iets flake::tests::attr_paths233iets-nextest-0.1.0>         PASS [   0.014s] (206/572) iets log::tests::a_resolved_copy_reports_its_mismatch_as_a_line234iets-nextest-0.1.0>         PASS [   0.030s] (207/572) iets log::tests::a_line_is_cut_to_the_width_without_cutting_its_colour235iets-nextest-0.1.0>         PASS [   0.026s] (208/572) iets log::tests::a_mismatch_reason_keeps_both_hashes236iets-nextest-0.1.0>         PASS [   0.022s] (209/572) iets log::tests::ansi_stripping237iets-nextest-0.1.0>         PASS [   0.023s] (210/572) iets log::tests::activity_records_are_nix_json_logger_records238iets-nextest-0.1.0>         PASS [   0.024s] (211/572) iets log::tests::a_session_id_is_a_uuid_v7239iets-nextest-0.1.0>         PASS [   0.118s] (212/572) iets lint::tests::selectors_and_order240iets-nextest-0.1.0>         PASS [   0.021s] (213/572) iets log::tests::exit_status_flags_combine_like_nix241iets-nextest-0.1.0>         PASS [   0.017s] (214/572) iets log::tests::record_is_nix_log_ei_plus_code_and_hint242iets-nextest-0.1.0>         PASS [   0.022s] (215/572) iets log::tests::lint_warning_is_a_level_1_record243iets-nextest-0.1.0>         PASS [   0.028s] (216/572) iets log::tests::escapes_are_filtered_the_way_nix_filters_them244iets-nextest-0.1.0>         PASS [   0.024s] (217/572) iets log::tests::record_without_position245iets-nextest-0.1.0>         PASS [   0.011s] (218/572) iets parallel::deque::tests::lifo_owner_fifo_thief246iets-nextest-0.1.0>         PASS [   0.011s] (219/572) iets parallel::fiber::tests::reservation_is_capped_and_mmap_failure_is_an_error247iets-nextest-0.1.0>         PASS [   0.026s] (220/572) iets nixbin::tests::every_iets_build_is_skipped248iets-nextest-0.1.0>         PASS [   0.060s] (221/572) iets log::tests::a_region_is_redrawn_in_place_and_output_scrolls_above_it249iets-nextest-0.1.0>         PASS [   0.027s] (222/572) iets log::tests::text_shows_the_hint_of_an_unsupported_error250iets-nextest-0.1.0>         PASS [   0.021s] (223/572) iets parallel::fiber::tests::migrates_between_threads251iets-nextest-0.1.0>         PASS [   0.016s] (224/572) iets parallel::fiber::tests::resume_yield_finish252iets-nextest-0.1.0>         PASS [   0.033s] (225/572) iets parallel::interner::tests::empty_name_misses_the_cache_sentinel253iets-nextest-0.1.0>         PASS [   0.053s] (226/572) iets parallel::fiber::tests::large_stack_use_and_release254iets-nextest-0.1.0>         PASS [   0.034s] (227/572) iets parallel::interner::tests::intern_is_stable_and_shared255iets-nextest-0.1.0>         PASS [   2.814s] (228/572) iets compile::cache::tests::a_changed_byte_of_a_stored_entry_is_a_miss256iets-nextest-0.1.0>         PASS [   0.018s] (229/572) iets print::tests::float_formatting_edge_cases257iets-nextest-0.1.0>         PASS [   0.073s] (230/572) iets parallel::sched::tests::a_task_survives_packing_past_the_old_24_bit_start258iets-nextest-0.1.0>         PASS [   0.009s] (231/572) iets profile::tests::a_frame_keeps_its_call_site_and_its_name259iets-nextest-0.1.0>         PASS [   0.104s] (232/572) iets parallel::fiber::tests::a_freed_stack_frees_its_guard_entry260iets-nextest-0.1.0>         PASS [   0.018s] (233/572) iets profile::tests::a_sample_is_taken_once_per_tick261iets-nextest-0.1.0>         PASS [   0.018s] (234/572) iets profile::tests::a_weight_is_bytes_when_the_profile_asks_for_them262iets-nextest-0.1.0>         PASS [   0.045s] (235/572) iets profile::tests::a_deep_stack_is_capped263iets-nextest-0.1.0>         PASS [   0.019s] (236/572) iets profile::tests::an_unwind_returns_to_a_depth264iets-nextest-0.1.0>         PASS [   0.008s] (237/572) iets progress::tests::a_log_hears_of_a_task_after_first_and_then_every_heartbeat265iets-nextest-0.1.0>         PASS [   0.018s] (238/572) iets progress::tests::a_download_inside_a_copy_is_part_of_the_copy266iets-nextest-0.1.0>         PASS [   0.007s] (239/572) iets progress::tests::several_of_a_kind_are_counted267iets-nextest-0.1.0>         PASS [   0.155s] (240/572) iets parallel::deque::tests::concurrent_sum268iets-nextest-0.1.0>         PASS [   0.028s] (241/572) iets progress::tests::store_hashes_are_left_out269iets-nextest-0.1.0>         PASS [   0.020s] (242/572) iets project::tests::a_config_file_never_shrinks_the_root270iets-nextest-0.1.0>         PASS [   0.175s] (243/572) iets nixbin::tests::farm_marker_is_found_through_two_hops271iets-nextest-0.1.0>         PASS [   0.156s] (244/572) iets parallel::sched::tests::main_parks_and_is_woken_by_helper272iets-nextest-0.1.0>         PASS [   2.220s] (245/572) iets eval::tests::fetch_mercurial_names_a_way_out273iets-nextest-0.1.0>         PASS [   1.115s] (246/572) iets fetch::http::tests::a_stalled_download_fails274iets-nextest-0.1.0>         PASS [   0.045s] (247/572) iets project::tests::a_working_tree_wins_over_a_file_marker_below_it275iets-nextest-0.1.0>         PASS [   0.011s] (248/572) iets project::tests::each_marker_is_a_root276iets-nextest-0.1.0>         PASS [   0.008s] (249/572) iets provenance::tests::a_shared_position_is_left_off_the_started_line_only277iets-nextest-0.1.0>         PASS [   0.010s] (250/572) iets provenance::tests::a_path_followed_by_a_colour_escape_still_matches278iets-nextest-0.1.0>         PASS [   0.010s] (251/572) iets provenance::tests::an_input_file_is_labelled_by_its_lock_node279iets-nextest-0.1.0>         PASS [   0.067s] (252/572) iets progress::tests::a_transfer_that_does_not_move_says_so280iets-nextest-0.1.0>         PASS [   0.014s] (253/572) iets project::tests::the_nearest_flake_wins_without_a_working_tree281iets-nextest-0.1.0>         PASS [   0.012s] (254/572) iets provenance::tests::failed_line_names_the_attribute_and_the_position282iets-nextest-0.1.0>         PASS [   0.009s] (255/572) iets provenance::tests::rewrite_leaves_unknown_text_alone283iets-nextest-0.1.0>         PASS [   0.020s] (256/572) iets provenance::tests::a_tree_copied_from_a_store_tree_resolves_to_the_local_one284iets-nextest-0.1.0>         PASS [   0.027s] (257/572) iets provenance::tests::locate_without_a_match_is_none285iets-nextest-0.1.0>         PASS [   0.023s] (258/572) iets remote::grpc::backend::tests::a_built_input_stops_the_walk286iets-nextest-0.1.0>         PASS [   0.211s] (259/572) iets parallel::sched::tests::fan_out_from_main287iets-nextest-0.1.0>         PASS [   0.028s] (260/572) iets remote::grpc::backend::tests::a_cold_store_is_asked_the_rest_in_one_call288iets-nextest-0.1.0>         PASS [   0.031s] (261/572) iets remote::grpc::backend::tests::a_built_root_asks_nothing_below_it289iets-nextest-0.1.0>         PASS [   0.040s] (262/572) iets provenance::tests::rewrite_replaces_every_known_path_in_a_line290iets-nextest-0.1.0>         PASS [   0.196s] (263/572) iets parallel::sched::tests::park_and_wake_across_workers291iets-nextest-0.1.0>         PASS [   0.018s] (264/572) iets remote::grpc::build::tests::the_timings_report_with_every_line292iets-nextest-0.1.0>         PASS [   0.013s] (265/572) iets remote::grpc::drvwire::tests::a_failure_keeps_its_message293iets-nextest-0.1.0>         PASS [   0.026s] (266/572) iets remote::grpc::build::tests::reschedules_back_off_past_a_dead_worker294iets-nextest-0.1.0>         PASS [   0.029s] (267/572) iets remote::grpc::build::tests::required_features_come_from_the_env_or_structured_attrs295iets-nextest-0.1.0>         PASS [   0.012s] (268/572) iets remote::grpc::drvwire::tests::an_unresolvable_input_output_is_an_error296iets-nextest-0.1.0>         PASS [   0.062s] (269/572) iets provenance::tests::locate_takes_the_longest_prefix297iets-nextest-0.1.0>         PASS [   0.012s] (270/572) iets remote::grpc::drvwire::tests::path_info_round_trips298iets-nextest-0.1.0>         PASS [   0.043s] (271/572) iets remote::grpc::build::tests::a_self_reference_does_not_loop299iets-nextest-0.1.0>         PASS [   0.015s] (272/572) iets remote::grpc::drvwire::tests::build_result_round_trips_a_daemon_reply300iets-nextest-0.1.0>         PASS [   0.010s] (273/572) iets remote::grpc::health::tests::one_address_does_not_refuse_another301iets-nextest-0.1.0>         PASS [   0.040s] (274/572) iets remote::grpc::build::tests::topo_sort_puts_references_first302iets-nextest-0.1.0>         PASS [   0.022s] (275/572) iets remote::grpc::health::tests::a_passed_cooldown_lets_one_caller_through303iets-nextest-0.1.0>         PASS [   0.070s] (276/572) iets remote::grpc::build::tests::a_local_upload_failure_beats_the_stream_ended_status304iets-nextest-0.1.0>         PASS [   0.015s] (277/572) iets remote::grpc::health::tests::the_cooldown_grows_and_stops_at_30s305iets-nextest-0.1.0>         PASS [   0.020s] (278/572) iets remote::grpc::health::tests::one_bounce_does_not_refuse_an_address306iets-nextest-0.1.0>         PASS [   0.029s] (279/572) iets remote::grpc::health::tests::an_unknown_address_is_usable307iets-nextest-0.1.0>         PASS [   0.039s] (280/572) iets remote::grpc::drvwire::tests::basic_derivation_matches_the_cxx_field_order308iets-nextest-0.1.0>         PASS [   0.021s] (281/572) iets remote::grpc::tests::a_token_needs_tls_and_unknown_parameters_are_errors309iets-nextest-0.1.0>         PASS [   0.020s] (282/572) iets remote::grpc::tests::defaults_match_the_cxx_settings310iets-nextest-0.1.0>         PASS [   0.016s] (283/572) iets remote::grpc::tests::insecure_is_a_bare_flag_or_a_boolean311iets-nextest-0.1.0>         PASS [   0.043s] (284/572) iets remote::grpc::health::tests::a_completed_build_clears_the_history312iets-nextest-0.1.0>         PASS [   0.025s] (285/572) iets remote::grpc::health::tests::two_bounces_refuse_it313iets-nextest-0.1.0>         PASS [   0.022s] (286/572) iets remote::grpc::tests::every_parameter_parses314iets-nextest-0.1.0>         PASS [   0.014s] (287/572) iets remote::grpc::tests::percent_escapes_decode_in_values315iets-nextest-0.1.0>         PASS [   0.016s] (288/572) iets remote::grpc::tests::mtls_needs_both_halves316iets-nextest-0.1.0>         PASS [   0.259s] (289/572) iets parallel::thunk::tests::deadlocked_fibers_are_cancelled317iets-nextest-0.1.0>         PASS [   0.012s] (290/572) iets remote::plan::tests::memory_source_matches_dump_string318iets-nextest-0.1.0>         PASS [   0.011s] (291/572) iets remote::worker::counts_tests::a_repeated_update_claims_nothing319iets-nextest-0.1.0>         PASS [   0.011s] (292/572) iets remote::worker::counts_tests::each_change_is_a_verdict_in_order320iets-nextest-0.1.0>         PASS [   0.017s] (293/572) iets remote::plan::tests::a_held_input_answers_for_its_closure321iets-nextest-0.1.0>         PASS [   0.013s] (294/572) iets remote::plan::tests::a_held_root_answers_for_its_closure322iets-nextest-0.1.0>         PASS [   0.007s] (295/572) iets remote::worker::tests::an_ssh_host_is_never_an_option323iets-nextest-0.1.0>         PASS [   1.158s] (296/572) iets fetch::http::tests::a_transient_status_is_retried324iets-nextest-0.1.0>         PASS [   0.018s] (297/572) iets remote::plan::tests::an_answered_root_is_not_asked_again325iets-nextest-0.1.0>         PASS [   0.015s] (298/572) iets remote::worker::tests::a_status_over_a_byte_is_not_a_success326iets-nextest-0.1.0>         PASS [   0.009s] (299/572) iets remote::worker::wire::tests::replies_are_read_as_nix_reads_them327iets-nextest-0.1.0>         PASS [   0.023s] (300/572) iets remote::plan::tests::hash_source_matches_nar_hash328iets-nextest-0.1.0>         PASS [   0.036s] (301/572) iets remote::plan::tests::a_cold_store_is_asked_the_rest_in_one_call329iets-nextest-0.1.0>         PASS [   0.010s] (302/572) iets remote::worker::tests::nix_sshopts_split_like_a_shell330iets-nextest-0.1.0>         PASS [   0.012s] (303/572) iets remote::worker::wire::tests::build_results_are_read_as_nix_reads_them331iets-nextest-0.1.0>         PASS [   0.019s] (304/572) iets remote::worker::wire::tests::framed_sink_frames_and_terminates332iets-nextest-0.1.0>         PASS [   0.016s] (305/572) iets runtime::heap::tests::release_tombstones_every_chunk333iets-nextest-0.1.0>         PASS [   0.022s] (306/572) iets remote::worker::tests::ssh_argv_puts_the_host_first334iets-nextest-0.1.0>         PASS [   0.328s] (307/572) iets parallel::interner::tests::concurrent_intern_agrees335iets-nextest-0.1.0>         PASS [   0.027s] (308/572) iets remote::worker::wire::tests::strings_are_padded336iets-nextest-0.1.0>         PASS [   0.027s] (309/572) iets remote::worker::tests::transport_from_url337iets-nextest-0.1.0>         PASS [   0.023s] (310/572) iets runtime::value::layout::a_primop_pays_nothing_for_its_symbol338iets-nextest-0.1.0>         PASS [   0.141s] (311/572) iets remote::grpc::backend::tests::an_input_below_a_built_one_is_not_built339iets-nextest-0.1.0>         PASS [   0.024s] (312/572) iets runtime::value::alloc_tests::a_list_too_long_to_address_has_no_size340iets-nextest-0.1.0>         PASS [   0.015s] (313/572) iets settings::tests::a_flag_carries_several_places_separated_by_a_semicolon341iets-nextest-0.1.0>         PASS [   0.020s] (314/572) iets session::tests::two_sessions_share_no_state342iets-nextest-0.1.0>         PASS [   0.012s] (315/572) iets settings::tests::a_wrong_type_names_the_key_and_the_file343iets-nextest-0.1.0>         PASS [   0.020s] (316/572) iets settings::tests::a_settings_file_may_hold_lint_and_the_other_sources_may_not344iets-nextest-0.1.0>         PASS [   0.021s] (317/572) iets settings::tests::a_project_file_holds_lint_and_nothing_else345iets-nextest-0.1.0>         PASS [   0.024s] (318/572) iets settings::tests::a_missing_file_is_skipped_and_the_defaults_hold346iets-nextest-0.1.0>         PASS [   0.010s] (319/572) iets settings::tests::source_map_adds_up_and_every_other_key_replaces347iets-nextest-0.1.0>         PASS [   0.011s] (320/572) iets settings::tests::each_source_wins_over_the_one_before348iets-nextest-0.1.0>         PASS [   0.009s] (321/572) iets settings::tests::the_file_is_the_users349iets-nextest-0.1.0>         PASS [   0.021s] (322/572) iets settings::tests::builder_reads_all_three_forms350iets-nextest-0.1.0>         PASS [   0.010s] (323/572) iets settings::tests::the_flag_pairs_are_kept_for_a_second_iets351iets-nextest-0.1.0>         PASS [   0.023s] (324/572) iets settings::tests::the_environment_wins_over_the_file352iets-nextest-0.1.0>         PASS [   0.017s] (325/572) iets settings::tests::the_flag_leaves_the_argv353iets-nextest-0.1.0>         PASS [   0.023s] (326/572) iets settings::tests::the_flag_value_is_toml_when_it_reads_as_toml354iets-nextest-0.1.0>         PASS [   0.024s] (327/572) iets settings::tests::the_user_file_turns_purity_off355iets-nextest-0.1.0>         PASS [   0.017s] (328/572) iets settings::tests::unknown_key_names_the_file356iets-nextest-0.1.0>         PASS [   0.019s] (329/572) iets source::local::tests::accepted_set_adds_parent_directories357iets-nextest-0.1.0>         PASS [   0.016s] (330/572) iets source::local::tests::max_mtime_covers_root_and_children358iets-nextest-0.1.0>         PASS [   0.019s] (331/572) iets source::local::tests::only_a_content_addressed_store_path_names_its_content359iets-nextest-0.1.0>         PASS [   0.024s] (332/572) iets source::lock::tests::complete_lock_passes360iets-nextest-0.1.0>         PASS [   0.024s] (333/572) iets source::lock::tests::declared_inputs_must_match_the_lock361iets-nextest-0.1.0>         PASS [   0.022s] (334/572) iets source::lock::tests::empty_lock_has_no_inputs362iets-nextest-0.1.0>         PASS [   0.025s] (335/572) iets source::lock::tests::incomplete_locks_fail363iets-nextest-0.1.0>         PASS [   0.013s] (336/572) iets source::remote::tests::access_tokens_match_the_longest_prefix364iets-nextest-0.1.0>         PASS [   0.011s] (337/572) iets source::remote::tests::nix_literal_escapes365iets-nextest-0.1.0>         PASS [   0.016s] (338/572) iets source::remote::tests::download_urls_match_the_fetchers366iets-nextest-0.1.0>         PASS [   0.028s] (339/572) iets source::remote::tests::a_leftover_is_not_a_valid_path367iets-nextest-0.1.0>         PASS [   0.009s] (340/572) iets source::scm::git::tests::a_directory_in_a_repository_is_found368iets-nextest-0.1.0>         PASS [   0.019s] (341/572) iets source::remote::tests::only_the_archive_types_are_fetched_by_iets369iets-nextest-0.1.0>         PASS [   0.013s] (342/572) iets source::scm::ledger::tests::a_directory_in_a_working_tree_is_found370iets-nextest-0.1.0>         PASS [   0.133s] (343/572) iets runtime::value::tests::union_lookup_agrees_with_iteration371iets-nextest-0.1.0>         PASS [   0.126s] (344/572) iets source::scm::ledger::tests::a_name_resolves_to_a_revision_and_a_revision_has_a_tree372iets-nextest-0.1.0>         PASS [   0.126s] (345/572) iets source::scm::ledger::tests::the_metadata_has_the_mark_of_its_tree373iets-nextest-0.1.0>         PASS [   0.015s] (346/572) iets source::tests::dates374iets-nextest-0.1.0>         PASS [   0.013s] (347/572) iets store::drv::tests::a_dynamic_input_writes_the_versioned_aterm_and_parses_back375iets-nextest-0.1.0>         PASS [   0.024s] (348/572) iets store::drv::tests::an_env_key_named_json_is_refused376iets-nextest-0.1.0>         PASS [   0.160s] (349/572) iets source::scm::ledger::tests::the_count_is_lazy_and_kept_by_revision377iets-nextest-0.1.0>         PASS [   0.024s] (350/572) iets store::drv::tests::fixed_output_from_scratch378iets-nextest-0.1.0>         PASS [   0.332s] (351/572) iets runtime::value::alloc_tests::a_speculated_thunk_is_forced_but_not_demanded379iets-nextest-0.1.0>         PASS [   0.204s] (352/572) iets source::scm::ledger::tests::an_untracked_file_is_the_error_of_nix380iets-nextest-0.1.0>         PASS [   0.047s] (353/572) iets store::drv::tests::fixtures_output_paths_recompute381iets-nextest-0.1.0>         PASS [   0.017s] (354/572) iets store::drv::tests::input_addressed_multi_output_from_scratch382iets-nextest-0.1.0>         PASS [   0.048s] (355/572) iets store::drv::tests::fixtures_roundtrip_byte_exact383iets-nextest-0.1.0>         PASS [   0.012s] (356/572) iets store::drv::tests::masked_unparse_blanks_output_paths_and_env384iets-nextest-0.1.0>         PASS [   0.361s] (357/572) iets runtime::value::alloc_tests::a_static_slice_is_interned_without_a_copy385iets-nextest-0.1.0>         PASS [   0.014s] (358/572) iets store::drv::tests::string_escapes_roundtrip386iets-nextest-0.1.0>         PASS [   0.069s] (359/572) iets store::drv::tests::fixtures_drv_path_matches_store_path387iets-nextest-0.1.0>         PASS [   0.033s] (360/572) iets store::drv::tests::input_drvs_hash_modulo_from_scratch388iets-nextest-0.1.0>         PASS [   0.017s] (361/572) iets store::drvdiff::tests::a_changed_input_drv_is_paired_by_name_and_recursed_into389iets-nextest-0.1.0>         PASS [   0.012s] (362/572) iets store::drvdiff::tests::an_input_source_an_added_input_drv_and_a_fixed_output_show_up390iets-nextest-0.1.0>         PASS [   0.016s] (363/572) iets store::drvdiff::tests::json_names_what_differs391iets-nextest-0.1.0>         PASS [   0.016s] (364/572) iets store::drvdiff::tests::the_local_fields_the_env_and_an_absent_value392iets-nextest-0.1.0>         PASS [   0.019s] (365/572) iets store::hash::tests::base64_roundtrip393iets-nextest-0.1.0>         PASS [   0.024s] (366/572) iets store::drvdiff::tests::the_depth_limit_names_the_input_without_walking_it394iets-nextest-0.1.0>         PASS [   0.018s] (367/572) iets store::drvdiff::tests::the_same_derivation_is_empty395iets-nextest-0.1.0>         PASS [   0.012s] (368/572) iets store::hash::tests::empty_sha256396iets-nextest-0.1.0>         PASS [   0.035s] (369/572) iets store::drvdiff::tests::env_name_shows_only_when_it_is_not_the_derivation_name397iets-nextest-0.1.0>         PASS [   0.017s] (370/572) iets store::hash::tests::compress_hash_xors398iets-nextest-0.1.0>         PASS [   0.016s] (371/572) iets store::hash::tests::nix32_roundtrip_and_reject399iets-nextest-0.1.0>         PASS [   0.017s] (372/572) iets store::hash::tests::parse_any_all_formats400iets-nextest-0.1.0>         PASS [   0.012s] (373/572) iets store::hash::tests::sha1_nix32401iets-nextest-0.1.0>         PASS [   0.012s] (374/572) iets store::hash::tests::sha256_nix32402iets-nextest-0.1.0>         PASS [   0.017s] (375/572) iets store::hash::tests::sha256_sri403iets-nextest-0.1.0>         PASS [   0.027s] (376/572) iets store::hash::tests::md5_nix32404iets-nextest-0.1.0>         PASS [   0.012s] (377/572) iets store::nar::tests::directory_nar_hash_formats405iets-nextest-0.1.0>         PASS [   0.009s] (378/572) iets store::nar::tests::directory_nar_with_an_executable406iets-nextest-0.1.0>         PASS [   3.789s] (379/572) iets builtins::fetch::tests::the_mark_follows_the_string_like_store_context407iets-nextest-0.1.0>         PASS [   0.112s] (380/572) iets store::hash::tests::streaming_matches_oneshot408iets-nextest-0.1.0>         PASS [   0.109s] (381/572) iets store::nar::tests::directory_nar409iets-nextest-0.1.0>         PASS [   0.113s] (382/572) iets store::hash::tests::sha512_nix32_base64410iets-nextest-0.1.0>         PASS [   0.096s] (383/572) iets store::nar::tests::filter_sees_types_and_paths411iets-nextest-0.1.0>         PASS [   2.081s] (384/572) iets eval::tests::update_forces_the_right_operand_first412iets-nextest-0.1.0>         PASS [   0.094s] (385/572) iets store::nar::tests::readers_refuse_what_nix_refuses413iets-nextest-0.1.0>         PASS [   0.102s] (386/572) iets store::nar::tests::executable_file_nar414iets-nextest-0.1.0>         PASS [   2.905s] (387/572) iets eval::tests::from_json_and_toml_reject_null_bytes415iets-nextest-0.1.0>         PASS [   0.021s] (388/572) iets store::nar::tests::regular_file_nar416iets-nextest-0.1.0>         PASS [   0.028s] (389/572) iets store::path::tests::filter_source417iets-nextest-0.1.0>         PASS [   2.967s] (390/572) iets eval::tests::a_function_select_is_a_fresh_slot_when_its_subject_is_forced418iets-nextest-0.1.0>         PASS [   0.072s] (391/572) iets store::path::tests::an_override_is_absolute_and_has_no_trailing_separator419iets-nextest-0.1.0>         PASS [   0.082s] (392/572) iets store::nar::tests::script_nar420iets-nextest-0.1.0>         PASS [   0.083s] (393/572) iets store::nar::tests::restore_rejects_garbage421iets-nextest-0.1.0>         PASS [   0.094s] (394/572) iets store::nar::tests::symlink_nar422iets-nextest-0.1.0>         PASS [   0.059s] (395/572) iets store::path::tests::fixed_recursive_sha256423iets-nextest-0.1.0>         PASS [   0.069s] (396/572) iets store::path::tests::fixed_flat_sha256424iets-nextest-0.1.0>         PASS [   0.017s] (397/572) iets store::path::tests::path_copy_directory425iets-nextest-0.1.0>         PASS [   0.020s] (398/572) iets store::path::tests::parse_and_accessors426iets-nextest-0.1.0>         PASS [   0.104s] (399/572) iets store::path::tests::output_names427iets-nextest-0.1.0>         PASS [   0.176s] (400/572) iets store::path::tests::a_multibyte_char_across_the_hash_part_is_an_error428iets-nextest-0.1.0>         PASS [   3.080s] (401/572) iets eval::tests::fetchurl_needs_a_sha256_in_every_mode429iets-nextest-0.1.0>         PASS [   3.794s] (402/572) iets compile::cache::tests::a_malformed_entry_is_a_miss_and_never_a_crash430iets-nextest-0.1.0>         PASS [   0.076s] (403/572) iets store::path::tests::the_directory_is_found_as_a_string_and_as_a_path431iets-nextest-0.1.0>         PASS [   0.076s] (404/572) iets store::path::tests::path_with_name432iets-nextest-0.1.0>         PASS [   0.192s] (405/572) iets store::path::tests::check_name_rules433iets-nextest-0.1.0>         PASS [   0.020s] (406/572) iets store::path::tests::to_file434iets-nextest-0.1.0>         PASS [   0.021s] (407/572) iets store::path::tests::to_file_with_reference435iets-nextest-0.1.0>         PASS [   0.021s] (408/572) iets syntax::tests::a_line_ends_at_cr_lf_and_lone_cr436iets-nextest-0.1.0>         PASS [   0.027s] (409/572) iets syntax::tests::allow_comments437iets-nextest-0.1.0>         PASS [   0.028s] (410/572) iets syntax::tests::attrs_and_bindings438iets-nextest-0.1.0>         PASS [   0.024s] (411/572) iets syntax::tests::comments_and_misc439iets-nextest-0.1.0>         PASS [   0.045s] (412/572) iets syntax::tests::end_of_file_inside_a_path_is_at_its_last_token440iets-nextest-0.1.0>         PASS [   0.067s] (413/572) iets syntax::tests::an_interpolated_name_is_static_when_nix_has_one_string_node441iets-nextest-0.1.0>         PASS [   0.246s] (414/572) iets store::path::tests::fixed_flat_sha1442iets-nextest-0.1.0>         PASS [   0.256s] (415/572) iets store::nar::tests::restore_roundtrip443iets-nextest-0.1.0>         PASS [   3.513s] (416/572) iets eval::tests::a_second_pseudo_file_keeps_its_own_positions444iets-nextest-0.1.0>         PASS [   0.378s] (417/572) iets syntax::tests::lambdas445iets-nextest-0.1.0>         PASS [   0.017s] (418/572) iets syntax::tests::paths446iets-nextest-0.1.0>         PASS [   0.431s] (419/572) iets syntax::tests::json_gives_every_node_its_kind_and_span447iets-nextest-0.1.0>         PASS [   0.393s] (420/572) iets syntax::tests::nul_in_string_literals448iets-nextest-0.1.0>         PASS [   0.020s] (421/572) iets syntax::tests::string_escapes_and_interpolation449iets-nextest-0.1.0>         PASS [   0.544s] (422/572) iets store::path::tests::placeholder450iets-nextest-0.1.0>         PASS [   0.040s] (423/572) iets syntax::tests::spans_cover_tokens451iets-nextest-0.1.0>         PASS [   0.565s] (424/572) iets store::path::tests::path_copy_file452iets-nextest-0.1.0>         PASS [   0.451s] (425/572) iets syntax::tests::indented_string_stripping453iets-nextest-0.1.0>         PASS [   0.016s] (426/572) iets sys::winpath::tests::a_bare_drive_is_not_its_root454iets-nextest-0.1.0>         PASS [   0.021s] (427/572) iets syntax::tests::the_error_reported_is_the_one_nix_meets_first455iets-nextest-0.1.0>         PASS [   1.228s] (428/572) iets session::tests::a_parallel_run_releases_its_session456iets-nextest-0.1.0>         PASS [   0.048s] (429/572) iets sys::winpath::tests::a_leading_double_slash_is_not_a_share457iets-nextest-0.1.0>         PASS [   1.114s] (430/572) iets source::scm::ledger::tests::a_change_of_the_ledger_is_a_change_of_the_working_tree458iets-nextest-0.1.0>         PASS [   0.038s] (431/572) iets sys::winpath::tests::a_round_trip_is_stable459iets-nextest-0.1.0>         PASS [   0.037s] (432/572) iets sys::winpath::tests::device_paths_are_not_shares_and_survive_a_round_trip460iets-nextest-0.1.0>         PASS [   0.430s] (433/572) iets syntax::tests::operator_precedence461iets-nextest-0.1.0>         PASS [   0.029s] (434/572) iets sys::winpath::tests::dot_dot_stops_at_the_anchor462iets-nextest-0.1.0>         PASS [   0.048s] (435/572) iets sys::winpath::tests::a_drive_is_the_first_component463iets-nextest-0.1.0>         PASS [   1.229s] (436/572) iets session::tests::a_value_used_after_release_is_loud464iets-nextest-0.1.0>         PASS [   0.450s] (437/572) iets syntax::tests::numbers465iets-nextest-0.1.0>         PASS [   3.642s] (438/572) iets eval::tests::an_invalid_regex_fails_before_the_string_is_forced466iets-nextest-0.1.0>         PASS [   0.616s] (439/572) iets store::path::tests::the_host_picks_the_store_directory467iets-nextest-0.1.0>         PASS [   0.025s] (440/572) iets sys::winpath::tests::relative_and_rooted_paths_only_change_separator468iets-nextest-0.1.0>         PASS [   0.479s] (441/572) iets syntax::tests::line_col_counts_bytes469iets-nextest-0.1.0>         PASS [   0.015s] (442/572) iets trace::key::tests::relative_path_detection470iets-nextest-0.1.0>         PASS [   0.012s] (443/572) iets trace::tests::dedupe_keeps_conflicting_values471iets-nextest-0.1.0>         PASS [   0.026s] (444/572) iets sys::winpath::tests::the_evaluators_form_is_left_alone472iets-nextest-0.1.0>         PASS [   0.024s] (445/572) iets sys::winpath::tests::native_names_come_back473iets-nextest-0.1.0>         PASS [   0.016s] (446/572) iets trace::store::tests::a_reader_of_one_generation_never_sees_the_next474iets-nextest-0.1.0>         PASS [   0.016s] (447/572) iets trace::store::tests::bytes_that_are_not_an_entry_are_bad_not_a_panic475iets-nextest-0.1.0>         PASS [   0.039s] (448/572) iets sys::winpath::tests::mixed_separators_agree476iets-nextest-0.1.0>         PASS [   0.041s] (449/572) iets sys::winpath::tests::network_shares_sit_under_unc477iets-nextest-0.1.0>         PASS [   0.017s] (450/572) iets trace::tests::fingerprint_changes_with_content_size_and_seen_entries478iets-nextest-0.1.0>         PASS [   0.047s] (451/572) iets trace::store::tests::one_rename_publishes_every_part479iets-nextest-0.1.0>         PASS [   0.045s] (452/572) iets trace::key::tests::key_is_order_and_value_sensitive480iets-nextest-0.1.0>         PASS [   0.021s] (453/572) iets trace::validate::dir_hash_tests::dir_hash_agrees_with_dir_listing_hash481iets-nextest-0.1.0>         PASS [   0.017s] (454/572) iets trace::wire::tests::drvs_sources_roots_roundtrip482iets-nextest-0.1.0>         PASS [   0.022s] (455/572) iets trace::watch::tests::only_the_paths_an_mtime_can_speak_for483iets-nextest-0.1.0>         PASS [   0.022s] (456/572) iets trace::wire::tests::readset_roundtrip484iets-nextest-0.1.0>         PASS [   0.025s] (457/572) iets treestore::pack::tests::a_pack_reads_back_what_was_written485iets-nextest-0.1.0>         PASS [   0.021s] (458/572) iets treestore::pack::tests::a_reader_sees_a_pack_written_after_it_listed486iets-nextest-0.1.0>         PASS [   0.045s] (459/572) iets trace::tests::only_a_named_query_is_an_observation487iets-nextest-0.1.0>         PASS [   0.025s] (460/572) iets treestore::pack::tests::a_set_finds_objects_across_packs_and_drops_a_broken_one488iets-nextest-0.1.0>         PASS [   0.024s] (461/572) iets treestore::pack::tests::an_empty_writer_leaves_no_file489iets-nextest-0.1.0>         PASS [   0.149s] (462/572) iets sys::winpath::tests::a_relative_name_that_starts_with_unc_is_not_a_share490iets-nextest-0.1.0>         PASS [   0.048s] (463/572) iets trace::validate::tests::file_touch_refreshes_edit_misses491iets-nextest-0.1.0>         PASS [   0.061s] (464/572) iets treestore::pack::tests::a_changed_index_byte_is_not_a_pack492iets-nextest-0.1.0>         PASS [   0.037s] (465/572) iets treestore::pack::tests::collect_removes_dead_packs_and_compacts_mostly_dead_ones493iets-nextest-0.1.0>         PASS [   0.031s] (466/572) iets treestore::tests::a_flat_file_is_named_by_the_hash_of_its_bytes494iets-nextest-0.1.0>         PASS [   4.789s] (467/572) iets api::run::tests::a_fiber_template_carries_the_configuration495iets-nextest-0.1.0>         PASS [   0.022s] (468/572) iets treestore::tests::a_tree_is_named_by_its_nar_hash496iets-nextest-0.1.0>         PASS [   0.036s] (469/572) iets treestore::tests::two_inputs_share_their_common_files497iets-nextest-0.1.0>         PASS [   0.024s] (470/572) iets::aterm_crosscheck bytes_that_are_not_utf8_roundtrip498iets-nextest-0.1.0>         PASS [   0.049s] (471/572) iets treestore::tests::a_put_after_a_collection_brings_its_own_objects499iets-nextest-0.1.0>         PASS [   0.058s] (472/572) iets::aterm_crosscheck fixed_output_inputs_hide_their_provenance500iets-nextest-0.1.0>         PASS [   0.062s] (473/572) iets::aterm_crosscheck fixed_output_path_is_recomputed_not_trusted501iets-nextest-0.1.0>         PASS [   0.056s] (474/572) iets::aterm_crosscheck floating_ca_defers_itself_and_downstream502iets-nextest-0.1.0>         PASS [   0.142s] (475/572) iets trace::tests::dump_fingerprint_matches_the_separate_walk503iets-nextest-0.1.0>         PASS [   0.051s] (476/572) iets::aterm_crosscheck harmonia_cases_roundtrip504iets-nextest-0.1.0>         PASS [   0.070s] (477/572) iets treestore::tests::collect_keeps_what_an_entry_names505iets-nextest-0.1.0>         PASS [   0.042s] (478/572) iets::aterm_crosscheck malformed_aterm_is_an_error506iets-nextest-0.1.0>         PASS [   0.145s] (479/572) iets trace::validate::tests::dir_stat_env_checks507iets-nextest-0.1.0>         PASS [   0.083s] (480/572) iets treestore::tests::a_stored_input_reads_back_and_a_wrong_hash_is_refused508iets-nextest-0.1.0>         PASS [   0.107s] (481/572) iets::aterm_crosscheck masked_and_unmasked_hashes_differ_once_filled509iets-nextest-0.1.0>         PASS [   0.094s] (482/572) iets::aterm_crosscheck upstream_input_addressed_paths_recompute510iets-nextest-0.1.0>         PASS [   0.097s] (483/572) iets::aterm_crosscheck upstream_invariants_fill_in_deferred511iets-nextest-0.1.0>         PASS [   0.078s] (484/572) iets::aterm_crosscheck upstream_drvs_roundtrip_byte_exact512iets-nextest-0.1.0>         PASS [   0.129s] (485/572) iets::aterm_crosscheck upstream_bad_drvs_are_rejected513iets-nextest-0.1.0>         PASS [   0.068s] (486/572) iets::aterm_crosscheck upstream_invariants_input_addressed_kept_or_rejected514iets-nextest-0.1.0>         PASS [   0.255s] (487/572) iets trace::tests::dedupe_of_many_repeats_is_linear515iets-nextest-0.1.0>         PASS [   0.074s] (488/572) iets::aterm_crosscheck upstream_invariants_ca_floating_dependency516iets-nextest-0.1.0>         PASS [   0.063s] (489/572) iets::cache_hygiene a_corrupt_entry_is_dropped_and_a_corrupt_store_is_wiped517iets-nextest-0.1.0>         PASS [   0.106s] (490/572) iets::cache_hygiene a_changed_byte_or_a_copied_entry_is_a_miss518iets-nextest-0.1.0>         PASS [   0.351s] (491/572) iets sys::winpath::tests::forward_slashes_make_a_share_too519iets-nextest-0.1.0>         PASS [   0.034s] (492/572) iets::cache_hygiene crash_writer_child520iets-nextest-0.1.0>         PASS [   0.019s] (493/572) iets::cache_hygiene unix_only::a_link_or_a_fifo_is_not_an_entry521iets-nextest-0.1.0>         PASS [   0.151s] (494/572) iets::aterm_crosscheck upstream_bench_drvs_parse_and_reprint_stably522iets-nextest-0.1.0>         PASS [   0.030s] (495/572) iets::cache_hygiene an_input_observation_marks_its_entry_as_used523iets-nextest-0.1.0>         PASS [   0.240s] (496/572) iets treestore::tests::a_staged_directory_goes_when_it_is_dropped524iets-nextest-0.1.0>         PASS [   0.827s] (497/572) iets syntax::tests::lang_corpus525iets-nextest-0.1.0>         PASS [   0.034s] (498/572) iets::events a_group_that_does_not_exist_is_a_settings_error526iets-nextest-0.1.0>         PASS [   0.106s] (499/572) iets::cache_hygiene unix_only::a_cache_is_private_to_its_owner527iets-nextest-0.1.0>         PASS [   0.133s] (500/572) iets::cache_hygiene input_touch_child528iets-nextest-0.1.0>         PASS [   0.147s] (501/572) iets::cache_hygiene cache_gc_removes_entries_past_the_ttl529iets-nextest-0.1.0>         PASS [   0.172s] (502/572) iets::cache_hygiene an_entry_that_is_not_a_plain_file_is_refused530iets-nextest-0.1.0>         PASS [   0.157s] (503/572) iets::cli io_errors_read_like_strerror531iets-nextest-0.1.0>         PASS [   0.046s] (504/572) iets::help_topics a_page_the_binary_does_not_carry_names_its_path532iets-nextest-0.1.0>         PASS [   0.541s] (505/572) iets trace::validate::tests::the_lowest_failing_observation_is_the_one_reported533iets-nextest-0.1.0>         PASS [   0.620s] (506/572) iets trace::validate::tests::a_copy_in_place_that_keeps_the_stat_still_misses534iets-nextest-0.1.0>         PASS [   0.031s] (507/572) iets::help_topics help_lists_the_topics535iets-nextest-0.1.0>         PASS [   0.561s] (508/572) iets::cache_hygiene a_killed_writer_leaves_the_store_usable536iets-nextest-0.1.0>         PASS [   3.544s] (509/572) iets fetch::http::tests::a_decompression_bomb_is_refused537iets-nextest-0.1.0>         PASS [   2.313s] (510/572) iets parallel::thunk::tests::many_fibers_force_one_shared_graph538iets-nextest-0.1.0>         PASS [   0.021s] (511/572) iets::layering porcelain_signatures_name_no_evaluator_value539iets-nextest-0.1.0>         PASS [   0.071s] (512/572) iets::nar_parity every_node_hashes_like_nix540iets-nextest-0.1.0>         PASS [   0.073s] (513/572) iets::nar_parity dump_is_byte_identical_to_nix_store_dump541iets-nextest-0.1.0>         PASS [   0.065s] (514/572) iets::nar_parity parse_length_matches_nix542iets-nextest-0.1.0>         PASS [   0.019s] (515/572) iets::nar_parity restore_round_trips_the_awkward_tree543iets-nextest-0.1.0>         PASS [   0.020s] (516/572) iets::nar_parity reader_caps_names_and_targets544iets-nextest-0.1.0>         PASS [   4.508s] (517/572) iets eval::tests::nix_eq_forces_what_the_shortcut_skips545iets-nextest-0.1.0>         PASS [   0.214s] (518/572) iets::layering porcelain_names_no_layer_below_the_api546iets-nextest-0.1.0>         PASS [   0.055s] (519/572) iets::profile a_run_shorter_than_a_tick_says_it_sampled_nothing547iets-nextest-0.1.0>         PASS [   0.461s] (520/572) iets::help_topics an_unknown_topic_is_a_usage_error_with_a_suggestion548iets-nextest-0.1.0>         PASS [   0.578s] (521/572) iets::help_topics a_topic_prints_its_page549iets-nextest-0.1.0>         PASS [   3.955s] (522/572) iets eval::tests::try_eval_and_errors550iets-nextest-0.1.0>         PASS [   0.258s] (523/572) iets::profile a_profile_that_is_not_eval_is_a_settings_error551iets-nextest-0.1.0>         PASS [   0.713s] (524/572) iets::help_topics a_command_wins_over_a_topic_of_the_same_name552iets-nextest-0.1.0>         PASS [   0.846s] (525/572) iets::events a_text_add_names_its_size_and_its_position553iets-nextest-0.1.0>         PASS [   5.747s] (526/572) iets builtins::fetch::tests::a_read_of_the_count_is_one_finding_for_each_tree554iets-nextest-0.1.0>         PASS [   5.893s] (527/572) iets api::value::tests::scalars555iets-nextest-0.1.0>         PASS [   0.893s] (528/572) iets::events the_sink_is_its_own_knob556iets-nextest-0.1.0>         PASS [   0.420s] (529/572) iets::profile a_profile_refuses_more_than_one_worker557iets-nextest-0.1.0>         PASS [   1.014s] (530/572) iets::cli a_bad_command_line_names_the_problem558iets-nextest-0.1.0>         PASS [   0.216s] (531/572) iets::pure the_pure_setting_is_the_users_alone559iets-nextest-0.1.0>         PASS [   4.986s] (532/572) iets eval::tests::sets_compare_in_the_symbol_order_of_nix560iets-nextest-0.1.0>         PASS [   5.987s] (533/572) iets builtins::fetch::tests::the_tree_decides_the_level561iets-nextest-0.1.0>         PASS [   2.685s] (534/572) iets source::scm::ledger::tests::the_tracked_files_and_the_metadata_are_the_tree562iets-nextest-0.1.0>         PASS [   1.317s] (535/572) iets::cache_hygiene concurrent_readers_and_writers_never_see_a_torn_entry563iets-nextest-0.1.0>         PASS [   5.319s] (536/572) iets eval::tests::arithmetic_and_strings564iets-nextest-0.1.0>         PASS [   1.344s] (537/572) iets::fetchurl a_wrong_hash_is_refused_with_the_hash_the_file_has565iets-nextest-0.1.0>         PASS [   1.835s] (538/572) iets::cli help_and_version_go_to_stdout566iets-nextest-0.1.0>         PASS [   5.871s] (539/572) iets eval::tests::printing567iets-nextest-0.1.0>         PASS [   5.927s] (540/572) iets eval::tests::derivation_wrapper_exists568iets-nextest-0.1.0>         PASS [   1.530s] (541/572) iets::profile an_unprofiled_run_says_nothing_about_a_profile569iets-nextest-0.1.0>         PASS [   2.933s] (542/572) iets::pure a_directory_with_no_marker_is_its_own_project570iets-nextest-0.1.0>         PASS [   3.360s] (543/572) iets::pure a_read_in_the_project_is_pure_and_one_above_it_is_not571iets-nextest-0.1.0>         PASS [  10.186s] (544/572) iets api::value::tests::strings_and_context572iets-nextest-0.1.0>         PASS [  10.079s] (545/572) iets builtins::fetch::tests::the_name_on_a_value_that_is_not_a_tree_is_silent573iets-nextest-0.1.0>         PASS [   7.380s] (546/572) iets runtime::value::alloc_tests::a_full_string_table_records_no_more_but_still_shares574iets-nextest-0.1.0>         PASS [  10.877s] (547/572) iets eval::tests::equality575iets-nextest-0.1.0>         PASS [  11.020s] (548/572) iets eval::tests::reading_a_derivation_output_is_unsupported576iets-nextest-0.1.0>         PASS [  12.069s] (549/572) iets compile::cache::tests::a_changed_byte_never_makes_the_evaluator_read_past_its_env577iets-nextest-0.1.0>         PASS [  12.135s] (550/572) iets eval::tests::laziness_and_recursion578iets-nextest-0.1.0>         PASS [  12.683s] (551/572) iets eval::tests::fetchurl_checks_its_argument_like_nix579iets-nextest-0.1.0>         PASS [   9.077s] (552/572) iets::events a_group_nobody_named_says_nothing580iets-nextest-0.1.0>         PASS [   9.253s] (553/572) iets::events a_tree_add_names_the_local_path_it_copied581iets-nextest-0.1.0>         PASS [   9.749s] (554/572) iets::profile a_builtin_names_itself_in_a_frame582iets-nextest-0.1.0>         PASS [  15.205s] (555/572) iets builtins::fetch::tests::the_first_read_of_a_tree_gives_its_finding583iets-nextest-0.1.0>         PASS [  15.515s] (556/572) iets api::run::tests::the_counters_cover_the_helper_fibers584iets-nextest-0.1.0>         PASS [  12.288s] (557/572) iets session::tests::a_released_session_leaves_the_other_alone585iets-nextest-0.1.0>         PASS [  17.622s] (558/572) iets builtins::fetch::tests::a_read_that_is_not_a_selection_has_no_site586iets-nextest-0.1.0>         PASS [  14.833s] (559/572) iets::profile a_folded_line_is_a_stack_and_a_count587iets-nextest-0.1.0>         PASS [  20.073s] (560/572) iets eval::tests::attrs_and_lists588iets-nextest-0.1.0>         PASS [  18.624s] (561/572) iets::profile an_allocation_profile_accounts_for_the_arena589iets-nextest-0.1.0>         PASS [  22.213s] (562/572) iets::cli dash_f_names_the_file_in_the_native_namespace590iets-nextest-0.1.0>         PASS [  28.510s] (563/572) iets::fetchurl a_hashed_fetch_has_the_store_path_nix_gives591iets-nextest-0.1.0>         FAIL [  29.479s] (564/572) iets::fetchurl without_a_hash_no_evaluation_fetches_and_prefetch_gives_the_hash592iets-nextest-0.1.0>   stdout ---593iets-nextest-0.1.0> 594iets-nextest-0.1.0>     running 1 test595iets-nextest-0.1.0>     test without_a_hash_no_evaluation_fetches_and_prefetch_gives_the_hash ... FAILED596iets-nextest-0.1.0> 597iets-nextest-0.1.0>     failures:598iets-nextest-0.1.0> 599iets-nextest-0.1.0>     failures:600iets-nextest-0.1.0>         without_a_hash_no_evaluation_fetches_and_prefetch_gives_the_hash601iets-nextest-0.1.0> 602iets-nextest-0.1.0>     test result: FAILED. 0 passed; 1 failed; 0 ignored; 0 measured; 2 filtered out; finished in 29.45s603iets-nextest-0.1.0>     604iets-nextest-0.1.0>   stderr ---605iets-nextest-0.1.0> 606iets-nextest-0.1.0>     thread 'without_a_hash_no_evaluation_fetches_and_prefetch_gives_the_hash' (2403) panicked at tests/fetchurl.rs:118:9:607iets-nextest-0.1.0>     ⏵ evaluating the expression (8s)608iets-nextest-0.1.0>     error: 'fetchurl' requires a 'sha256' argument: run 'iets prefetch file:///build/iets-fetchurl-unhashed-2395/hello.txt' and pass the hash as 'sha256'609iets-nextest-0.1.0>            at «string»:1:1610iets-nextest-0.1.0>            … while calling the '__fetchurl' builtin at «string»:1:1611iets-nextest-0.1.0>     run 'iets prefetch file:///build/iets-fetchurl-unhashed-2395/hello.txt' and pass the hash as 'sha256'612iets-nextest-0.1.0> 613iets-nextest-0.1.0>     note: run with `RUST_BACKTRACE=1` environment variable to display a backtrace614iets-nextest-0.1.0> 615iets-nextest-0.1.0>   Cancelling due to test failure: 8 tests still running616iets-nextest-0.1.0>         PASS [  33.704s] (565/572) iets::events all_takes_the_cold_groups617iets-nextest-0.1.0>         PASS [  47.569s] (566/572) iets eval::tests::scoping618iets-nextest-0.1.0>         PASS [  45.108s] (567/572) iets::pure the_other_purity_rules_hold_without_a_flag619iets-nextest-0.1.0>         SLOW [> 60.000s] (-------) iets api::run::tests::helper_fibers_read_the_ir_cache620iets-nextest-0.1.0>         SLOW [> 60.000s] (-------) iets builtins::fetch::tests::a_selection_of_the_count_is_the_site621iets-nextest-0.1.0>         PASS [  60.378s] (568/572) iets builtins::fetch::tests::a_selection_of_the_count_is_the_site622iets-nextest-0.1.0>         SLOW [> 60.000s] (-------) iets eval::tests::pure_eval_answers_like_nix623iets-nextest-0.1.0>         PASS [  61.987s] (569/572) iets api::run::tests::helper_fibers_read_the_ir_cache624iets-nextest-0.1.0>         SLOW [> 60.000s] (-------) iets runtime::value::tests::union_iteration_merges_like_a_fold625iets-nextest-0.1.0>         SLOW [> 60.000s] (-------) iets syntax::tests::deep_nesting_ends_with_an_error626iets-nextest-0.1.0>         PASS [  66.768s] (570/572) iets eval::tests::pure_eval_answers_like_nix627iets-nextest-0.1.0>         PASS [  78.103s] (571/572) iets syntax::tests::deep_nesting_ends_with_an_error628iets-nextest-0.1.0>         SLOW [>120.000s] (-------) iets runtime::value::tests::union_iteration_merges_like_a_fold629iets-nextest-0.1.0>         SLOW [>180.000s] (-------) iets runtime::value::tests::union_iteration_merges_like_a_fold630iets-nextest-0.1.0>         SLOW [>240.000s] (-------) iets runtime::value::tests::union_iteration_merges_like_a_fold631iets-nextest-0.1.0>         SLOW [>300.000s] (-------) iets runtime::value::tests::union_iteration_merges_like_a_fold