iets-test-0.1.0
checks.x86_64-linux.test
· build #10
· raw
unpackPhase
1unpacking source archive /nix/store/02prk7snlawbqvj4rcc33z3k76yya6cx-source2source root is source3Executing cargoSetupPostUnpackHook4Finished cargoSetupPostUnpackHookpatchPhase
5Executing cargoSetupPostPatchHook6Validating consistency between /build/source/Cargo.lock and /build/cargo-vendor-dir/Cargo.lock7Finished cargoSetupPostPatchHookbuildPhase
8 Compiling libc v0.2.1899 Compiling proc-macro2 v1.0.10710 Compiling unicode-ident v1.0.2411 Compiling quote v1.0.4712 Compiling cfg-if v1.0.413 Compiling shlex v2.0.114 Compiling find-msvc-tools v0.1.1215 Compiling bytes v1.12.116 Compiling fnv v1.0.717 Compiling version_check v0.9.518 Compiling regex-syntax v0.8.1119 Compiling hashbrown v0.17.120 Compiling pin-project-lite v0.2.1721 Compiling equivalent v1.0.222 Compiling memchr v2.8.323 Compiling typenum v1.20.124 Compiling anyhow v1.0.10425 Compiling futures-core v0.3.3426 Compiling either v1.18.027 Compiling once_cell v1.21.428 Compiling semver v1.0.2829 Compiling itoa v1.0.1830 Compiling zeroize v1.9.031 Compiling log v0.4.3432 Compiling slab v0.4.1233 Compiling bitflags v2.13.234 Compiling futures-sink v0.3.3435 Compiling prettyplease v0.2.3736 Compiling getrandom v0.4.337 Compiling httparse v1.10.138 Compiling lazy_static v1.5.039 Compiling rustix v1.1.540 Compiling pulldown-cmark v0.13.441 Compiling beef v0.5.242 Compiling unicase v2.9.043 Compiling atomic-waker v1.1.244 Compiling untrusted v0.9.045 Compiling thiserror v2.0.2046 Compiling futures-task v0.3.3447 Compiling linux-raw-sys v0.12.148 Compiling try-lock v0.2.549 Compiling pkg-config v0.3.3450 Compiling foldhash v0.1.551 Compiling unicode-width v0.1.1452 Compiling serde_core v1.0.22953 Compiling fixedbitset v0.5.754 Compiling tower-service v0.3.355 Compiling futures-channel v0.3.3456 Compiling rustls v0.23.4557 Compiling smallvec v1.16.158 Compiling cpufeatures v0.2.1759 Compiling fastrand v2.5.060 Compiling httpdate v1.0.361 Compiling rustls-pki-types v1.15.162 Compiling heck v0.5.063 Compiling multimap v0.10.164 Compiling subtle v2.6.165 Compiling zstd-safe v7.3.066 Compiling zmij v1.0.2367 Compiling const-oid v0.10.268 Compiling cpufeatures v0.3.169 Compiling crc32fast v1.5.270 Compiling sync_wrapper v1.0.271 Compiling want v0.3.172 Compiling tower-layer v0.3.373 Compiling adler2 v2.0.174 Compiling base64 v0.22.175 Compiling winnow v1.0.476 Compiling serde_json v1.0.15177 Compiling cty v0.2.278 Compiling hashbrown v0.15.579 Compiling percent-encoding v2.3.280 Compiling simd-adler32 v0.3.1081 Compiling toml_writer v1.1.2+spec-1.1.082 Compiling arrayvec v0.7.883 Compiling openssl-probe v0.2.184 Compiling futures-util v0.3.3485 Compiling constant_time_eq v0.4.286 Compiling libbz2-rs-sys v0.2.587 Compiling lz4_flex v0.11.688 Compiling miniz_oxide v0.9.189 Compiling tracing-core v0.1.3690 Compiling flate2 v1.1.1091 Compiling itertools v0.14.092 Compiling generic-array v0.14.793 Compiling rustc_version v0.4.194 Compiling toml_parser v1.1.3+spec-1.1.095 Compiling aho-corasick v1.1.596 Compiling indexmap v2.14.297 Compiling http v1.5.098 Compiling logos-codegen v0.15.199 Compiling bzip2 v0.6.1100 Compiling webpki-roots v1.0.9101 Compiling rustls-native-certs v0.8.4102 Compiling petgraph v0.8.3103 Compiling syn v2.0.119104 Compiling syn v3.0.5105 Compiling hybrid-array v0.4.15106 Compiling http-body v1.1.0107 Compiling http-body-util v0.1.5108 Compiling jobserver v0.1.35109 Compiling socket2 v0.6.5110 Compiling mio v1.2.3111 Compiling getrandom v0.2.17112 Compiling filetime v0.2.29113 Compiling tar v0.4.46114 Compiling block-buffer v0.10.4115 Compiling crypto-common v0.1.7116 Compiling digest v0.10.7117 Compiling pulldown-cmark-to-cmark v22.0.1118 Compiling cc v1.4.5119 Compiling sha2 v0.10.9120 Compiling crypto-common v0.2.2121 Compiling block-buffer v0.12.1122 Compiling sha1 v0.10.7123 Compiling md-5 v0.10.6124 Compiling regex-automata v0.4.18125 Compiling tempfile v3.27.0126 Compiling digest v0.11.3127 Compiling serde_spanned v1.1.1128 Compiling toml_datetime v1.1.1+spec-1.1.0129 Compiling toml v1.1.6+spec-1.1.0130 Compiling sha2 v0.11.0131 Compiling lzma-rust2 v0.16.5132 Compiling ring v0.17.14133 Compiling zstd-sys v2.1.0+zstd.1.5.7134 Compiling libmimalloc-sys v0.1.49135 Compiling blake3 v1.8.7136 Compiling tokio-macros v2.7.2137 Compiling thiserror-impl v2.0.20138 Compiling async-trait v0.1.92139 Compiling mimalloc v0.1.52140 Compiling tonic-build v0.14.6141 Compiling tokio v1.53.1142 Compiling prost-derive v0.14.4143 Compiling tracing-attributes v0.1.31144 Compiling miette-derive v7.6.0145 Compiling pin-project-internal v1.1.13146 Compiling logos-codegen v0.16.1147 Compiling regex v1.13.1148 Compiling logos-derive v0.15.1149 Compiling logos v0.15.1150 Compiling miette v7.6.0151 Compiling zstd v0.13.3152 Compiling pin-project v1.1.13153 Compiling prost v0.14.4154 Compiling logos-derive v0.16.1155 Compiling tracing v0.1.44156 Compiling prost-types v0.14.4157 Compiling rustls-webpki v0.103.15158 Compiling logos v0.16.1159 Compiling protox-parse v0.9.0160 Compiling prost-reflect v0.16.5161 Compiling prost-build v0.14.4162 Compiling tonic-prost-build v0.14.6163 Compiling tokio-util v0.7.19164 Compiling tokio-stream v0.1.19165 Compiling h2 v0.4.19166 Compiling tower v0.5.3167 Compiling protox v0.9.1168 Compiling iets v0.1.0 (/build/source)169 Compiling tokio-rustls v0.26.5170 Compiling hyper v1.11.1171 Compiling hyper-util v0.1.20172 Compiling hyper-timeout v0.5.2173 Compiling tonic v0.14.6174 Compiling tonic-prost v0.14.6175 Finished `test` profile [unoptimized + debuginfo] target(s) in 2m 07s176 Running unittests src/lib.rs (target/debug/deps/iets-08e813ea55a8333b)177178running 454 tests179test api::installable::tests::the_name_a_program_takes_from_a_derivation_name ... ok180test api::installable::tests::default_and_fragment_attr_paths ... ok181test build::backend::tests::base_names_drop_the_store_dir ... ok182test build::event::tests::durations ... ok183test api::drvshow::tests::pretty_matches_serde_json ... ok184test api::drvshow::tests::floats_take_nlohmanns_form ... ok185test build::executor::tests::no_place_at_all_is_a_usage_error ... ok186test build::executor::tests::one_place_declaring_nothing_takes_everything ... ok187test build::backend::tests::the_timings_report_with_every_line ... ok188test argv::tests::every_byte_round_trips ... ok189test build::executor::tests::the_first_place_that_takes_it_wins ... ok190test build::executor::tests::a_declared_system_filters ... ok191test build::executor::tests::an_unsupported_url_says_what_is_expected ... ok192test build::executor::tests::a_feature_the_place_lacks_rules_it_out ... ok193test build::fixhash::tests::a_longer_hash_is_not_a_match ... ok194test api::drvshow::tests::a_multi_output_derivation ... ok195test api::drvshow::tests::a_fixed_output_shows_its_content_address_and_no_path ... ok196test api::drvshow::tests::a_non_canonical_structured_attrs_text_is_renormalised ... ok197test build::executor::tests::a_refusal_names_every_place_and_what_it_declared ... ok198test build::backend::tests::output_specs ... ok199test api::drvshow::tests::inputs_and_structured_attrs ... ok200test build::fixhash::tests::two_matches_are_left_alone ... ok201test builtins::text::regex::tests::regex_bench ... ignored202test builtins::store_hooks::tests::a_relative_path_inside_an_entry_joins_once ... ok203test builtins::derivation::tests::a_dynamic_output_renders_the_placeholder_nix_renders ... ok204test build::render::tests::drv_paths_of_a_failure_message ... ok205test builtins::derivation::tests::the_two_placeholders_are_not_the_same ... ok206test builtins::text::regex::tests::names ... ok207test build::tests::targets_become_jobs ... ok208test cachefs::tests::a_directory_that_is_not_ours_is_refused_untouched ... ok209test builtins::text::fromtoml::tests::new_escapes_are_refused ... ok210test builtins::text::fromtoml::tests::inline_tables_stay_on_one_line ... ok211test build::fanout::tests::dependencies_run_first ... ok212test cachefs::tests::an_empty_directory_is_ours_to_take ... ok213test build::tests::hash_stripping ... ok214test api::fetch::tests::the_fake_hash_moves_the_output_and_the_drv ... ok215test api::fetch::tests::only_a_fixed_output_drv_can_be_prefetched ... ok216test cachefs::tests::a_wipe_keeps_what_iets_did_not_create ... ok217test cachefs::tests::a_touch_inside_the_interval_writes_nothing ... ok218test cachefs::tests::a_wipe_of_the_ir_cache_walks_its_shards ... ok219test cachefs::tests::a_store_without_a_version_file_is_wiped_once ... ok220test build::fanout::tests::a_failed_dependency_blocks_its_dependants ... ok221test cachefs::tests::a_sweep_runs_once_per_interval ... ok222test cachefs::tests::an_input_store_of_the_spool_layout_is_wiped ... ok223test cachefs::tests::a_stamp_in_the_future_is_due ... ok224test build::fixhash::tests::one_match_is_rewritten_in_its_own_spelling ... ok225test cachefs::tests::version_mismatch_wipes_the_store ... ok226test cachefs::tests::a_lock_that_cannot_be_opened_is_not_a_busy_lock ... ok227test cachefs::tests::the_writer_lock_excludes_one_holder_at_a_time ... ok228test cli::build::tests::a_failed_build_reports_itself ... ok229test build::render::tests::an_unfolded_success_ends_with_its_verdict ... ok230test build::render::tests::an_owned_build_is_verdicted_once_by_its_op ... ok231test build::render::tests::a_daemon_failure_message_decides_the_verdict ... ok232test build::render::tests::a_failure_after_the_activity_ended_never_claims_a_success ... ok233test build::render::tests::ci_folds_a_success_and_never_a_failure ... ok234test build::render::tests::tty_keeps_successful_logs_off_the_screen ... ok235test build::fanout::tests::at_most_limit_builds_run_at_once ... ok236test build::render::tests::a_stalled_build_that_fails_still_shows_its_cause ... ok237test build::render::tests::logs_of_two_builds_do_not_interleave ... ok238test api::value::tests::lists ... ok239test cli::build::tests::a_success_with_no_output_path_is_named ... ok240test cli::build::tests::no_build_result_is_named ... ok241test cli::build::tests::an_out_flag_that_matches_nothing_is_named ... ok242test cli::classic::shell::tests::sh_var_names ... ok243test cachefs::tests::sweep_walks_the_shards_of_the_ir_cache ... ok244test api::value::tests::apply_is_lazy ... ok245test cli::plumbing::tests::a_url_is_the_positional_fetch_takes_itself ... ok246test api::value::tests::thunk_reads_as_thunk ... ok247test cachefs::tests::sweep_ages_a_root_by_its_link_not_by_what_it_names ... ok248test cli::build::tests::no_outcome_at_all_is_named ... ok249test cli::classic::shell::tests::declares_for_every_bash_shaped_value ... ok250test cachefs::tests::a_wait_lock_waits_for_its_holder ... ok251test cachefs::tests::garbled_stamp_wipes_the_store ... ok252test build::render::tests::heartbeat_names_running_builds ... ok253test cli::plumbing::tests::a_file_url_needs_one_slash_not_three ... ok254test cli::diff::tests::a_name_ends_at_the_first_dash_before_a_digit ... ok255test cli::docs::tests::every_embedded_page_has_a_heading ... ok256test api::value::tests::attrs_by_name_and_index ... ok257test cachefs::tests::sweep_drops_old_entries_and_keeps_young_ones ... ok258test cli::docs::tests::the_topic_list_fits_80_columns ... ok259test cli::help::tests::messages ... ok260test cli::docs::tests::topics_resolve_bare_and_qualified ... ok261test cli::search::tests::index_round_trip ... ok262test cli::search::tests::merged_highlights ... ok263test cli::search::tests::drv_names ... ok264test cli::classic::shell::tests::outputs_become_placeholders ... ok265test api::value::tests::wrong_type_is_an_error ... ok266test api::value::tests::force_deep_forces_the_whole_tree ... ok267test devenv::tests::env_derivation_matches_nix ... ignored, needs the devShell input .drv closure in /nix/store268test cli::render::tests::sizes_render_as_nix_renders_them ... ok269test cli::render::text::tests::a_long_value_shows_the_lines_that_differ ... ok270test devenv::tests::get_env_sh_store_path_matches_nix ... ok271test api::value::tests::construction ... ok272test config::tests::syntax_errors ... ok273test api::value::tests::calling_a_function ... ok274test config::tests::the_daemon_gets_the_store_settings_set_outside_the_system_file ... ok275test config::tests::typed_getters_and_defaults ... ok276test api::run::tests::a_fiber_template_carries_the_configuration ... ok277test config::tests::user_conf_files_are_in_precedence_order ... ok278test cli::build::tests::a_path_on_stdout_is_silent ... ok279test config::tests::an_alias_is_its_setting ... ok280test config::tests::bool_spellings ... ok281test config::tests::the_setting_tables_name_nix_settings ... ok282test config::tests::missing_include_errors_and_bang_include_does_not ... ok283test config::tests::basic_syntax ... ok284test config::tests::bad_typed_values_error_where_they_are_set ... ok285test builtins::text::regex::tests::size_limit ... ok286test config::tests::include_chain ... ok287test config::tests::overrides_win_over_files ... ok288test devenv::tests::cached_result_roundtrip ... ok289test devenv::tests::non_bash_builder_is_refused ... ok290test build::render::tests::a_build_log_never_reports_a_mismatch ... ok291test cli::classic::tests::a_flag_with_no_effect_is_noted_and_one_that_holds_is_not ... ok292test config::tests::unknown_settings_are_kept ... ok293test cli::help::tests::help_fits_80_columns ... ok294test config::tests::max_jobs_auto_is_the_cpu_count ... ok295test config::tests::a_classic_name_leaves_an_unimplemented_setting_to_nix ... ok296test config::tests::option_nix_path_replaces_nix_path_and_extra_adds ... ok297test config::tests::a_setting_with_no_effect_is_noted ... ok298test config::tests::extra_appends_to_list_settings_only ... ok299test builtins::store_hooks::tests::virtual_tree_reads_go_to_the_local_files ... ok300test devenv::tests::shell_escaping ... ok301test cli::help::tests::suggestions_come_from_the_help ... ok302test devenv::tests::output_checks_are_erased_only_when_present ... ok303test cli::help::tests::a_mistyped_command_is_suggested ... ok304test devenv::tests::rewrites_apply_in_map_order_to_every_occurrence ... ok305test build::tests::a_fan_out_backend_keeps_the_cap_and_the_log_blocks ... ok306test fetch::http::tests::magic_bytes ... ok307test build::tests::a_target_with_no_verdict_fails ... ok308test api::value::tests::missing_attribute ... ok309test fetch::http::tests::file_urls_name_a_local_path ... ok310test eval::tests::a_second_pseudo_file_keeps_its_own_positions ... ok311test fetch::http::tests::redirects_resolve ... ok312test devenv::tests::rc_script_rewrites_outputs_and_writes_attrs ... ok313test fetch::http::tests::redirects_keep_credentials_only_on_the_same_origin ... ok314test fetch::http::tests::urls_split ... ok315test devenv::tests::json_roundtrip_and_bash_forms ... ok316test fetch::roots::tests::no_bundle_anywhere_gives_the_compiled_in_set ... ok317test api::value::tests::strings_and_context ... ok318test fetch::roots::tests::a_named_file_that_is_missing_or_empty_is_an_error ... ok319test fetch::spool::tests::the_scratch_file_never_follows_a_symlink ... ok320test compile::cache::tests::nesting_past_the_cap_misses ... ok321test fetch::spool::tests::a_sparse_member_counts_against_the_size_limit ... ok322test fetch::http::tests::trailing_bytes_and_a_second_layer ... ok323test fetch::spool::tests::an_empty_archive_is_an_empty_directory ... ok324test fetch::http::tests::downloads_stop_at_the_size_limit ... ok325test fetch::unpack::tests::a_repeated_member_keeps_the_last_copy ... ok326test fetch::spool::tests::the_errors_match ... ok327test fetch::unpack::tests::member_names_are_made_relative_and_cannot_escape ... ok328test fetch::spool::tests::nar_hash_of_the_fixture ... ok329test fetch::unpack::tests::an_unsupported_member_type_is_an_error ... ok330test fetch::unpack::tests::strips_one_leading_component ... ok331test fetch::spool::tests::spool_matches_the_tree_on_the_top_level ... ok332test fetch::spool::tests::archives_the_git_sink_accepts ... ok333test compile::cache::tests::a_changed_byte_of_a_stored_entry_is_a_miss ... ok334test eval::tests::an_invalid_regex_fails_before_the_string_is_forced ... ok335test fetch::unpack::tests::keeps_the_root_when_it_is_not_a_single_directory ... ok336test fetch::unpack::tests::nar_hash_of_the_fixture ... ok337test eval::tests::derivation_wrapper_exists ... ok338test fetch::spool::tests::a_changed_index_byte_is_a_miss ... ok339test compile::cache::tests::a_malformed_entry_is_a_miss_and_never_a_crash ... ok340test fetch::spool::tests::spool_matches_the_tree ... ok341test fetch::unpack::tests::modes_symlinks_and_empty_dirs ... ok342test flake::tests::attr_paths ... ok343test jobs::constituents::tests::fnmatch_basics ... ok344test builtins::text::regex::tests::long_inputs_do_not_recurse ... ok345test flake::flakeref::tests::errors_and_unsupported ... ok346test flake::flakeref::tests::to_string_from_attrs ... ok347test fetch::roots::tests::the_platform_store_wins_over_the_compiled_in_set ... ok348test fetch::roots::tests::nix_ssl_cert_file_wins_over_ssl_cert_file_and_the_platform ... ok349test lint::allow::tests::comment_names ... ok350test flake::flakeref::tests::round_trips ... ok351test fetch::spool::tests::a_hard_link_never_replaces_a_member ... ok352test fetch::roots::tests::an_empty_nix_ssl_cert_file_hides_ssl_cert_file ... ok353test api::value::tests::scalars ... ok354test lint::allow::tests::lines ... ok355test flake::tests::refs_resolve_against_cwd_and_home ... ok356test jobs::line::tests::error_line_round_trip ... ok357test eval::tests::try_eval_and_errors ... ok358test lint::tests::keys ... ok359test eval::tests::update_forces_the_right_operand_first ... ok360test lint::tests::names_are_unique_kebab_case ... ok361test eval::tests::sets_compare_in_the_symbol_order_of_nix ... ok362test log::tests::a_fixed_hash_has_the_shape_of_a_finding_with_an_edit ... ok363test flake::fetch::tests::an_entry_of_the_compiled_file_cache_keeps_the_site ... ok364test flake::fetch::tests::the_mark_follows_the_string_like_store_context ... ok365test fetch::spool::tests::a_stored_tree_dumps_the_spools_nar ... ok366test lint::tests::selectors_and_order ... ok367test lint::tests::an_unknown_name_is_a_warning_in_a_file_and_an_error_in_a_flag ... ok368test jobs::tests::a_numeric_name_selects_an_attribute_under_a_set ... ok369test log::tests::a_forged_mismatch_is_dropped ... ok370test lint::tests::toml_table ... ok371test lint::tests::specificity_inside_a_source_and_order_between_sources ... ok372test lint::tests::the_project_file_walk_stops_at_the_project_root ... ok373test log::tests::a_hash_mismatch_names_the_hash_it_got ... ok374test log::tests::a_coloured_error_is_an_error_record ... ok375test jobs::constituents::tests::topo_sort_orders_and_detects_cycles ... ok376test jobs::line::tests::split_and_round_trip ... ok377test lint::tests::scope_and_inputs ... ok378test fetch::spool::tests::pax_sparse_members_are_expanded ... ok379test log::tests::a_mismatch_reason_keeps_both_hashes ... ok380test log::tests::activity_records_are_nix_json_logger_records ... ok381test lint::site::tests::a_literal_lint_of_nix_has_an_edit ... ok382test log::tests::lint_warning_is_a_level_1_record ... ok383test log::tests::escapes_are_filtered_the_way_nix_filters_them ... ok384test log::tests::ansi_stripping ... ok385test log::tests::exit_status_flags_combine_like_nix ... ok386test eval::tests::equality ... ok387test eval::tests::laziness_and_recursion ... ok388test parallel::deque::tests::lifo_owner_fifo_thief ... ok389test log::tests::a_resolved_copy_reports_its_mismatch_as_a_line ... ok390test parallel::interner::tests::empty_name_misses_the_cache_sentinel ... ok391test parallel::interner::tests::intern_is_stable_and_shared ... ok392test parallel::fiber::tests::resume_yield_finish ... ok393test flake::fetch::tests::nix_sees_no_mark ... ok394test parallel::sched::tests::a_task_survives_packing_past_the_old_24_bit_start ... ok395test log::tests::record_without_position ... ok396test parallel::fiber::tests::reservation_is_capped_and_mmap_failure_is_an_error ... ok397test parallel::deque::tests::concurrent_sum ... ok398test profile::tests::a_frame_keeps_its_call_site_and_its_name ... ok399test profile::tests::a_weight_is_bytes_when_the_profile_asks_for_them ... ok400test profile::tests::an_unwind_returns_to_a_depth ... ok401test nixbin::tests::every_iets_build_is_skipped ... ok402test eval::tests::nix_eq_forces_what_the_shortcut_skips ... ok403test nixbin::tests::farm_marker_is_found_through_two_hops ... ok404test parallel::fiber::tests::migrates_between_threads ... ok405test eval::tests::arithmetic_and_strings ... ok406test log::tests::a_session_id_is_a_uuid_v7 ... ok407test project::tests::the_nearest_flake_wins_without_a_working_tree ... ok408test eval::tests::printing ... ok409test profile::tests::a_sample_is_taken_once_per_tick ... ok410test print::tests::float_formatting_edge_cases ... ok411test parallel::sched::tests::main_parks_and_is_woken_by_helper ... ok412test project::tests::each_marker_is_a_root ... ok413test parallel::sched::tests::park_and_wake_across_workers ... ok414test project::tests::a_config_file_never_shrinks_the_root ... ok415test provenance::tests::rewrite_leaves_unknown_text_alone ... ok416test parallel::sched::tests::fan_out_from_main ... ok417test parallel::thunk::tests::deadlocked_fibers_are_cancelled ... ok418test lint::site::tests::the_span_is_the_innermost_node_of_the_kind_of_the_lint ... ok419test provenance::tests::locate_without_a_match_is_none ... ok420test provenance::tests::a_tree_copied_from_a_store_tree_resolves_to_the_local_one ... ok421test provenance::tests::a_path_followed_by_a_colour_escape_still_matches ... ok422test log::tests::record_is_nix_log_ei_plus_code_and_hint ... ok423test provenance::tests::rewrite_replaces_every_known_path_in_a_line ... ok424test remote::grpc::build::tests::reschedules_back_off_past_a_dead_worker ... ok425test progress::tests::store_hashes_are_left_out ... ok426test provenance::tests::locate_takes_the_longest_prefix ... ok427test remote::grpc::health::tests::an_unknown_address_is_usable ... ok428test remote::grpc::build::tests::a_local_upload_failure_beats_the_stream_ended_status ... ok429test progress::tests::several_of_a_kind_are_counted ... ok430test parallel::fiber::tests::large_stack_use_and_release ... ok431test eval::tests::derivation_keeps_env_and_args_that_are_not_utf8 ... ok432test remote::grpc::health::tests::one_bounce_does_not_refuse_an_address ... ok433test remote::grpc::health::tests::the_cooldown_grows_and_stops_at_30s ... ok434test project::tests::a_working_tree_wins_over_a_file_marker_below_it ... ok435test remote::grpc::health::tests::a_passed_cooldown_lets_one_caller_through ... ok436test progress::tests::a_transfer_that_does_not_move_says_so ... ok437test progress::tests::a_download_inside_a_copy_is_part_of_the_copy ... ok438test remote::grpc::health::tests::a_completed_build_clears_the_history ... ok439test remote::grpc::health::tests::one_address_does_not_refuse_another ... ok440test remote::grpc::build::tests::required_features_come_from_the_env_or_structured_attrs ... ok441test provenance::tests::failed_line_names_the_attribute_and_the_position ... ok442test remote::grpc::drvwire::tests::a_failure_keeps_its_message ... ok443test remote::grpc::drvwire::tests::build_result_round_trips_a_daemon_reply ... ok444test remote::grpc::build::tests::the_timings_report_with_every_line ... ok445test remote::grpc::build::tests::topo_sort_puts_references_first ... ok446test remote::grpc::build::tests::a_self_reference_does_not_loop ... ok447test progress::tests::a_log_hears_of_a_task_after_first_and_then_every_heartbeat ... ok448test compile::cache::tests::a_changed_byte_never_makes_the_evaluator_read_past_its_env ... ok449test fetch::http::tests::a_decompression_bomb_is_refused ... ok450test eval::tests::from_json_and_toml_reject_null_bytes ... ok451test profile::tests::a_deep_stack_is_capped ... ok452test parallel::interner::tests::concurrent_intern_agrees ... ok453test remote::grpc::health::tests::two_bounces_refuse_it ... ok454test remote::grpc::tests::every_parameter_parses ... ok455test remote::grpc::tests::insecure_is_a_bare_flag_or_a_boolean ... ok456test remote::grpc::tests::mtls_needs_both_halves ... ok457test remote::grpc::tests::defaults_match_the_cxx_settings ... ok458test remote::grpc::tests::percent_escapes_decode_in_values ... ok459test remote::worker::wire::tests::strings_are_padded ... ok460test remote::plan::tests::memory_source_matches_dump_string ... ok461test remote::worker::tests::an_ssh_host_is_never_an_option ... ok462test remote::worker::wire::tests::framed_sink_frames_and_terminates ... ok463test runtime::value::alloc_tests::a_list_too_long_to_address_has_no_size ... ok464test remote::worker::tests::a_status_over_a_byte_is_not_a_success ... ok465test runtime::value::layout::a_primop_pays_nothing_for_its_symbol ... ok466test remote::worker::tests::nix_sshopts_split_like_a_shell ... ok467test remote::worker::tests::ssh_argv_puts_the_host_first ... ok468test remote::worker::tests::transport_from_url ... ok469test remote::grpc::drvwire::tests::path_info_round_trips ... ok470test remote::grpc::tests::a_token_needs_tls_and_unknown_parameters_are_errors ... ok471test remote::grpc::drvwire::tests::an_unresolvable_input_output_is_an_error ... ok472test settings::tests::a_flag_carries_several_places_separated_by_a_semicolon ... ok473test session::tests::two_sessions_share_no_state ... ok474test runtime::value::alloc_tests::a_speculated_thunk_is_forced_but_not_demanded ... ok475test fetch::http::tests::a_stalled_download_fails ... ok476test flake::flakeref::tests::parses_the_kept_schemes ... ok477test settings::tests::the_file_is_the_users ... ok478test remote::plan::tests::hash_source_matches_nar_hash ... ok479test source::remote::tests::only_the_archive_types_are_fetched_by_iets ... ok480test source::remote::tests::substitution_costs_less_than_the_subprocess ... ignored481test settings::tests::a_settings_file_may_hold_lint_and_the_other_sources_may_not ... ok482test settings::tests::the_environment_wins_over_the_file ... ok483test source::remote::tests::nix_literal_escapes ... ok484test settings::tests::a_missing_file_is_skipped_and_the_defaults_hold ... ok485test source::local::tests::max_mtime_covers_root_and_children ... ok486test settings::tests::the_flag_leaves_the_argv ... ok487test remote::worker::wire::tests::replies_are_read_as_nix_reads_them ... ok488test runtime::value::tests::union_lookup_agrees_with_iteration ... ok489test remote::worker::wire::tests::build_results_are_read_as_nix_reads_them ... ok490test settings::tests::unknown_key_names_the_file ... ok491test settings::tests::a_project_file_holds_lint_and_nothing_else ... ok492test source::local::tests::only_a_content_addressed_store_path_names_its_content ... ok493test settings::tests::the_flag_value_is_toml_when_it_reads_as_toml ... ok494test settings::tests::each_source_wins_over_the_one_before ... ok495test source::tests::dates ... ok496test store::drv::tests::fixtures_output_paths_recompute_from_store ... ignored, needs the input .drv closures in /nix/store497test settings::tests::the_user_file_turns_purity_off ... ok498test eval::tests::attrs_and_lists ... ok499test source::scm::git::tests::a_directory_in_a_repository_is_found ... ok500test settings::tests::source_map_adds_up_and_every_other_key_replaces ... ok501test source::scm::ledger::tests::a_directory_in_a_working_tree_is_found ... ok502test store::drv::tests::fixed_output_from_scratch ... ok503test flake::fetch::tests::the_first_read_of_a_tree_gives_its_finding ... ok504test store::drv::tests::an_env_key_named_json_is_refused ... ok505test source::local::tests::accepted_set_adds_parent_directories ... ok506test source::remote::tests::access_tokens_match_the_longest_prefix ... ok507test settings::tests::the_flag_pairs_are_kept_for_a_second_iets ... ok508test settings::tests::a_wrong_type_names_the_key_and_the_file ... ok509test settings::tests::builder_reads_all_three_forms ... ok510test eval::tests::scoping ... ok511test store::drv::tests::masked_unparse_blanks_output_paths_and_env ... ok512test store::drv::tests::string_escapes_roundtrip ... ok513test store::hash::tests::compress_hash_xors ... ok514test store::hash::tests::empty_sha256 ... ok515test store::drv::tests::input_addressed_multi_output_from_scratch ... ok516test store::drv::tests::input_drvs_hash_modulo_from_scratch ... ok517test store::hash::tests::base64_roundtrip ... ok518test store::drvdiff::tests::the_same_derivation_is_empty ... ok519test remote::grpc::drvwire::tests::basic_derivation_matches_the_cxx_field_order ... ok520test source::lock::tests::complete_lock_passes ... ok521test source::remote::tests::download_urls_match_the_fetchers ... ok522test store::hash::tests::md5_nix32 ... ok523test store::hash::tests::sha256_nix32 ... ok524test store::hash::tests::parse_any_all_formats ... ok525test store::hash::tests::streaming_matches_oneshot ... ok526test store::hash::tests::sha256_sri ... ok527test store::drvdiff::tests::an_input_source_an_added_input_drv_and_a_fixed_output_show_up ... ok528test store::nar::tests::executable_file_nar ... ok529test store::drvdiff::tests::env_name_shows_only_when_it_is_not_the_derivation_name ... ok530test store::nar::tests::directory_nar_hash_formats ... ok531test source::lock::tests::incomplete_locks_fail ... ok532test store::drvdiff::tests::the_depth_limit_names_the_input_without_walking_it ... ok533test store::drvdiff::tests::json_names_what_differs ... ok534test store::drvdiff::tests::a_changed_input_drv_is_paired_by_name_and_recursed_into ... ok535test store::hash::tests::nix32_roundtrip_and_reject ... ok536test store::drv::tests::a_dynamic_input_writes_the_versioned_aterm_and_parses_back ... ok537test store::nar::tests::filter_sees_types_and_paths ... ok538test store::nar::tests::directory_nar ... ok539test store::nar::tests::readers_refuse_what_nix_refuses ... ok540test store::drvdiff::tests::the_local_fields_the_env_and_an_absent_value ... ok541test store::nar::tests::restore_rejects_garbage ... ok542test store::nar::tests::regular_file_nar ... ok543test store::nar::tests::restore_roundtrip ... ok544test store::path::tests::placeholder ... ok545test store::path::tests::fixed_recursive_sha256 ... ok546test store::nar::tests::symlink_nar ... ok547test store::path::tests::to_file ... ok548test store::path::tests::output_names ... ok549test store::path::tests::parse_and_accessors ... ok550test store::path::tests::filter_source ... ok551test store::path::tests::path_copy_file ... ok552test store::path::tests::path_copy_directory ... ok553test store::path::tests::a_multibyte_char_across_the_hash_part_is_an_error ... ok554test store::path::tests::to_file_with_reference ... ok555test syntax::tests::differential_strings_against_nix ... ignored, needs nix on PATH and takes a few seconds556test store::path::tests::fixed_flat_sha256 ... ok557test store::path::tests::check_name_rules ... ok558test flake::fetch::tests::a_read_of_the_count_is_one_finding_for_each_tree ... ok559test store::path::tests::path_with_name ... ok560test store::path::tests::fixed_flat_sha1 ... ok561test store::hash::tests::sha512_nix32_base64 ... ok562test syntax::tests::line_col_counts_bytes ... ok563test store::hash::tests::sha1_nix32 ... ok564test syntax::tests::spans_cover_tokens ... ok565test trace::store::tests::bytes_that_are_not_an_entry_are_bad_not_a_panic ... ok566test trace::store::tests::a_reader_of_one_generation_never_sees_the_next ... ok567test trace::key::tests::key_is_order_and_value_sensitive ... ok568test trace::store::tests::one_rename_publishes_every_part ... ok569test syntax::tests::a_line_ends_at_cr_lf_and_lone_cr ... ok570test trace::tests::dump_fingerprint_matches_the_separate_walk ... ok571test trace::tests::fingerprint_changes_with_content_size_and_seen_entries ... ok572test syntax::tests::an_interpolated_name_is_static_when_nix_has_one_string_node ... ok573test trace::validate::dir_hash_tests::dir_hash_agrees_with_dir_listing_hash ... ok574test trace::tests::dedupe_keeps_conflicting_values ... ok575test trace::validate::tests::a_copy_in_place_that_keeps_the_stat_still_misses ... ok576test flake::fetch::tests::a_read_that_is_not_a_selection_has_no_site ... ok577test store::drv::tests::fixtures_output_paths_recompute ... ok578test store::drv::tests::fixtures_roundtrip_byte_exact ... ok579test store::drv::tests::fixtures_drv_path_matches_store_path ... ok580test trace::key::tests::relative_path_detection ... ok581test trace::watch::tests::only_the_paths_an_mtime_can_speak_for ... ok582test source::scm::ledger::tests::the_metadata_has_the_mark_of_its_tree ... ok583test source::scm::ledger::tests::the_count_is_lazy_and_kept_by_revision ... ok584test trace::validate::tests::dir_stat_env_checks ... ok585test syntax::tests::end_of_file_inside_a_path_is_at_its_last_token ... ok586test source::scm::ledger::tests::a_change_of_the_ledger_is_a_change_of_the_working_tree ... ok587test syntax::tests::comments_and_misc ... ok588test trace::wire::tests::readset_roundtrip ... ok589test trace::wire::tests::drvs_sources_roots_roundtrip ... ok590test treestore::pack::tests::an_empty_writer_leaves_no_file ... ok591test treestore::pack::tests::a_reader_sees_a_pack_written_after_it_listed ... ok592test treestore::pack::tests::a_set_finds_objects_across_packs_and_drops_a_broken_one ... ok593test treestore::tests::a_tree_is_named_by_its_nar_hash ... ok594test syntax::tests::json_gives_every_node_its_kind_and_span ... ok595test syntax::tests::allow_comments ... ok596test treestore::pack::tests::collect_removes_dead_packs_and_compacts_mostly_dead_ones ... ok597test treestore::pack::tests::a_pack_reads_back_what_was_written ... ok598test treestore::pack::tests::a_changed_index_byte_is_not_a_pack ... ok599test trace::tests::dedupe_of_many_repeats_is_linear ... ok600test source::scm::ledger::tests::an_untracked_file_is_the_error_of_nix ... ok601test treestore::tests::a_staged_directory_goes_when_it_is_dropped ... ok602test trace::tests::only_a_named_query_is_an_observation ... ok603test trace::validate::tests::file_touch_refreshes_edit_misses ... ok604test syntax::tests::the_error_reported_is_the_one_nix_meets_first ... ok605test syntax::tests::nul_in_string_literals ... ok606test source::scm::ledger::tests::the_tracked_files_and_the_metadata_are_the_tree ... ok607test syntax::tests::lambdas ... ok608test syntax::tests::string_escapes_and_interpolation ... ok609test fetch::http::tests::a_transient_status_is_retried ... FAILED610test eval::tests::reading_a_derivation_output_is_unsupported ... ok611test syntax::tests::indented_string_stripping ... ok612test fetch::http::tests::credentials_stay_on_the_first_origin ... FAILED613test fetch::http::tests::credentials_in_the_url_are_sent_and_never_printed ... FAILED614test syntax::tests::paths ... ok615test syntax::tests::numbers ... ok616test treestore::tests::a_put_after_a_collection_brings_its_own_objects ... ok617test treestore::tests::two_inputs_share_their_common_files ... ok618test treestore::tests::collect_keeps_what_an_entry_names ... ok619test treestore::tests::a_stored_input_reads_back_and_a_wrong_hash_is_refused ... ok620test syntax::tests::attrs_and_bindings ... ok621test flake::fetch::tests::the_tree_decides_the_level ... ok622test syntax::tests::operator_precedence ... ok623test flake::fetch::tests::the_name_on_a_value_that_is_not_a_tree_is_silent ... ok624test parallel::thunk::tests::many_fibers_force_one_shared_graph ... ok625test flake::fetch::tests::a_selection_of_the_count_is_the_site ... ok626test trace::validate::tests::the_lowest_failing_observation_is_the_one_reported ... ok627test api::run::tests::helper_fibers_read_the_ir_cache ... ok628test eval::tests::pure_eval_answers_like_nix ... ok629test syntax::tests::deep_nesting_ends_with_an_error ... ok630test api::run::tests::the_counters_cover_the_helper_fibers ... ok631test runtime::value::tests::union_iteration_merges_like_a_fold has been running for over 60 seconds632test runtime::value::tests::union_iteration_merges_like_a_fold ... ok633test syntax::tests::lang_corpus ... ok634635failures:636637---- fetch::http::tests::a_transient_status_is_retried stdout ----638639thread 'fetch::http::tests::a_transient_status_is_retried' (5385) panicked at src/fetch/http.rs:1014:57:640called `Result::unwrap()` on an `Err` value: Usage("cannot fetch 'http://127.0.0.1:33343/': no response (stalled-download-timeout)")641642---- fetch::http::tests::credentials_stay_on_the_first_origin stdout ----643644thread 'fetch::http::tests::credentials_stay_on_the_first_origin' (5387) panicked at src/fetch/http.rs:889:59:645called `Result::unwrap()` on an `Err` value: Usage("cannot fetch 'http://127.0.0.1:46457/': no response (stalled-download-timeout)")646647---- fetch::http::tests::credentials_in_the_url_are_sent_and_never_printed stdout ----648649thread 'fetch::http::tests::credentials_in_the_url_are_sent_and_never_printed' (5386) panicked at src/fetch/http.rs:986:57:650called `Result::unwrap()` on an `Err` value: Usage("cannot fetch 'http://user:***@127.0.0.1:45635/x': no response (stalled-download-timeout)")651note: run with `RUST_BACKTRACE=1` environment variable to display a backtrace652653654failures:655 fetch::http::tests::a_transient_status_is_retried656 fetch::http::tests::credentials_in_the_url_are_sent_and_never_printed657 fetch::http::tests::credentials_stay_on_the_first_origin658659test result: FAILED. 446 passed; 3 failed; 5 ignored; 0 measured; 0 filtered out; finished in 89.40s660661error: test failed, to rerun pass `--lib`