setup
checks.x86_64-linux.test
· build #10
· raw
1this derivation will be built:2 /nix/store/s4pl6j06gj2cpypg2idm7mmmax402wan-iets-test-0.1.0.drv3error: Cannot build '/nix/store/s4pl6j06gj2cpypg2idm7mmmax402wan-iets-test-0.1.0.drv'.4 Reason: builder failed with exit code 101.5 Output paths:6 /nix/store/hds1f696cpp5lg61qrnqn8qkki71a3bq-iets-test-0.1.07 Last 25 log lines:8 > ---- fetch::http::tests::a_transient_status_is_retried stdout ----9 >10 > thread 'fetch::http::tests::a_transient_status_is_retried' (5385) panicked at src/fetch/http.rs:1014:57:11 > called `Result::unwrap()` on an `Err` value: Usage("cannot fetch 'http://127.0.0.1:33343/': no response (stalled-download-timeout)")12 >13 > ---- fetch::http::tests::credentials_stay_on_the_first_origin stdout ----14 >15 > thread 'fetch::http::tests::credentials_stay_on_the_first_origin' (5387) panicked at src/fetch/http.rs:889:59:16 > called `Result::unwrap()` on an `Err` value: Usage("cannot fetch 'http://127.0.0.1:46457/': no response (stalled-download-timeout)")17 >18 > ---- fetch::http::tests::credentials_in_the_url_are_sent_and_never_printed stdout ----19 >20 > thread 'fetch::http::tests::credentials_in_the_url_are_sent_and_never_printed' (5386) panicked at src/fetch/http.rs:986:57:21 > called `Result::unwrap()` on an `Err` value: Usage("cannot fetch 'http://user:***@127.0.0.1:45635/x': no response (stalled-download-timeout)")22 > note: run with `RUST_BACKTRACE=1` environment variable to display a backtrace23 >24 >25 > failures:26 > fetch::http::tests::a_transient_status_is_retried27 > fetch::http::tests::credentials_in_the_url_are_sent_and_never_printed28 > fetch::http::tests::credentials_stay_on_the_first_origin29 >30 > test result: FAILED. 446 passed; 3 failed; 5 ignored; 0 measured; 0 filtered out; finished in 89.40s31 >32 > error: test failed, to rerun pass `--lib`33 For full logs, run:34 nix log /nix/store/s4pl6j06gj2cpypg2idm7mmmax402wan-iets-test-0.1.0.drv