setup
checks.x86_64-linux.tests
· build #68
· raw
1this derivation will be built:2 /nix/store/was6wbql3fr2zpdjgwpism85wp5dzykz-horae-tests-0.1.0.drv3error: Cannot build '/nix/store/was6wbql3fr2zpdjgwpism85wp5dzykz-horae-tests-0.1.0.drv'.4 Reason: builder failed with exit code 101.5 Output paths:6 /nix/store/3acv4b4nxmaaczbcql5lnijv6kalhvs0-horae-tests-0.1.07 Last 25 log lines:8 >9 > thread 'importers::harvest::engine_tests::csv_streaming::durable_csv_preview_resumes_after_a_crash_without_recounting_rows' (19219) panicked at crates/horae/src/importers/harvest/engine_tests/csv_streaming.rs:338:5:10 > a durable batch must commit before source EOF11 >12 > ---- importers::harvest::engine_tests::csv_streaming::durable_csv_reclaimed_lease_cannot_commit_the_next_batch stdout ----13 >14 > thread 'importers::harvest::engine_tests::csv_streaming::durable_csv_reclaimed_lease_cannot_commit_the_next_batch' (19222) panicked at crates/horae/src/importers/harvest/engine_tests/csv_streaming.rs:338:5:15 > a durable batch must commit before source EOF16 >17 > ---- importers::harvest::engine_tests::csv_streaming::durable_csv_preview_matches_existing_and_new_rows_with_one_connection stdout ----18 >19 > thread 'importers::harvest::engine_tests::csv_streaming::durable_csv_preview_matches_existing_and_new_rows_with_one_connection' (19216) panicked at crates/horae/src/importers/harvest/engine_tests/csv_streaming.rs:210:6:20 > called `Result::unwrap()` on an `Err` value: Elapsed(())21 >22 >23 > failures:24 > importers::harvest::engine_tests::csv_streaming::durable_csv_preview_cancel_preserves_simulation_for_manual_retry25 > importers::harvest::engine_tests::csv_streaming::durable_csv_preview_matches_existing_and_new_rows_with_one_connection26 > importers::harvest::engine_tests::csv_streaming::durable_csv_preview_rejects_a_stale_next_batch27 > importers::harvest::engine_tests::csv_streaming::durable_csv_preview_resumes_after_a_crash_without_recounting_rows28 > importers::harvest::engine_tests::csv_streaming::durable_csv_reclaimed_lease_cannot_commit_the_next_batch29 >30 > test result: FAILED. 836 passed; 5 failed; 11 ignored; 0 measured; 0 filtered out; finished in 305.66s31 >32 > error: test failed, to rerun pass `-p horae --bin horae`33 For full logs, run:34 nix log /nix/store/was6wbql3fr2zpdjgwpism85wp5dzykz-horae-tests-0.1.0.drv