horae-tests-0.1.0
checks.x86_64-linux.tests
· build #586
· raw
unpackPhase
1unpacking source archive /nix/store/yvdj5ks46h1kblybbwrbjg3xwi6yrn2w-source2source root is sourcepatchPhase
3Executing configureCargoCommonVars4decompressing cargo artifacts from /nix/store/p0fga5r55aw5iwdy8h0dpr32lhcczl5i-horae-checks-deps-0.1.0/target.tar.zst to target5patchPhase completed in 1 minutes 33 secondsconfigurePhase
6will append /build/source/.cargo-home/config.toml with contents of /nix/store/i0bj632any4bjpvnl84zc2h7cq8zn0mz-vendor-cargo-deps/config.toml7default configurePhase, nothing to dobuildPhase
8+++ command cargo nextest run -p horae-core --test-threads 489 Resolving dependency graph...10 Compiling proc-macro2 v1.0.10611 Compiling serde_core v1.0.22812 Compiling serde v1.0.22813 Compiling num-traits v0.2.1914 Compiling quote v1.0.4615 Compiling syn v2.0.11816 Compiling uuid v1.23.417 Compiling serde_derive v1.0.22818 Compiling thiserror-impl v2.0.1819 Compiling thiserror v2.0.1820 Compiling chrono v0.4.4521 Compiling horae-core v0.1.0 (/build/source/crates/core)22 Finished `test` profile [unoptimized + debuginfo] target(s) in 42.68s23------------24 Nextest run ID 6bf83c28-ff17-4ace-8011-511cd2ed48a7 with nextest profile: default25 Starting 189 tests across 1 binary26 Running [ 00:00:00] > 1/189: 48 running, 1 passed, 0 skipped 27 [ 00:00:00] horae-core ert_accepts_zero_percent_but_not_zero_budget28 [ 00:00:00] horae-core ::a_single_jump_announces_every_crossed_band29 [ 00:00:00] horae-core jects_invalid_inputs_and_widens_large_values30 [ 00:00:00] horae-core percentage_rounds_clamps_and_never_overflows31 [ 00:00:00] horae-core ::tests::current_band_is_the_highest_reached32 [ 00:00:00] horae-core dget::tests::each_crossing_is_announced_once33 [ 00:00:00] horae-core elow_a_band_does_not_fire_but_current_resets34 [ 00:00:00] horae-core t::tests::no_band_for_zero_or_missing_budget35 PASS [ 0.016s] horae-core budget::tests::configured_alert_threshold_is_exact_without_rounding36 Running [ 00:00:00] > 1/189: 48 running, 1 passed, 0 skipped 37 [ 00:00:00] horae-core ert_accepts_zero_percent_but_not_zero_budget38 [ 00:00:00] horae-core ::a_single_jump_announces_every_crossed_band39 [ 00:00:00] horae-core jects_invalid_inputs_and_widens_large_values40 [ 00:00:00] horae-core percentage_rounds_clamps_and_never_overflows41 [ 00:00:00] horae-core ::tests::current_band_is_the_highest_reached42 [ 00:00:00] horae-core dget::tests::each_crossing_is_announced_once43 [ 00:00:00] horae-core elow_a_band_does_not_fire_but_current_resets44 [ 00:00:00] horae-core t::tests::no_band_for_zero_or_missing_budget45 Running [ 00:00:00] > 1/189: 48 running, 1 passed, 0 skipped 46 [ 00:00:00] horae-core ert_accepts_zero_percent_but_not_zero_budget47 [ 00:00:00] horae-core ::a_single_jump_announces_every_crossed_band48 [ 00:00:00] horae-core jects_invalid_inputs_and_widens_large_values49 [ 00:00:00] horae-core percentage_rounds_clamps_and_never_overflows50 [ 00:00:00] horae-core ::tests::current_band_is_the_highest_reached51 [ 00:00:00] horae-core dget::tests::each_crossing_is_announced_once52 [ 00:00:00] horae-core elow_a_band_does_not_fire_but_current_resets53 [ 00:00:00] horae-core t::tests::no_band_for_zero_or_missing_budget54 Running [ 00:00:00] > 1/189: 48 running, 1 passed, 0 skipped 55 [ 00:00:00] horae-core ert_accepts_zero_percent_but_not_zero_budget56 [ 00:00:00] horae-core ::a_single_jump_announces_every_crossed_band57 [ 00:00:00] horae-core jects_invalid_inputs_and_widens_large_values58 [ 00:00:00] horae-core percentage_rounds_clamps_and_never_overflows59 [ 00:00:00] horae-core ::tests::current_band_is_the_highest_reached60 [ 00:00:00] horae-core dget::tests::each_crossing_is_announced_once61 [ 00:00:00] horae-core elow_a_band_does_not_fire_but_current_resets62 [ 00:00:00] horae-core t::tests::no_band_for_zero_or_missing_budget63 Running [ 00:00:00] => 40/189: 48 running, 1 passed, 0 skipped 64 [ 00:00:00] horae-core ert_accepts_zero_percent_but_not_zero_budget65 [ 00:00:00] horae-core ::a_single_jump_announces_every_crossed_band66 [ 00:00:00] horae-core jects_invalid_inputs_and_widens_large_values67 [ 00:00:00] horae-core percentage_rounds_clamps_and_never_overflows68 [ 00:00:00] horae-core ::tests::current_band_is_the_highest_reached69 [ 00:00:00] horae-core dget::tests::each_crossing_is_announced_once70 [ 00:00:00] horae-core elow_a_band_does_not_fire_but_current_resets71 [ 00:00:00] horae-core t::tests::no_band_for_zero_or_missing_budget72 PASS [ 0.047s] horae-core budget::tests::configured_alert_accepts_zero_percent_but_not_zero_budget73 PASS [ 0.046s] horae-core budget::tests::a_single_jump_announces_every_crossed_band74 PASS [ 0.044s] horae-core budget::tests::configured_alert_rejects_invalid_inputs_and_widens_large_values75 PASS [ 0.054s] horae-core budget::tests::current_band_is_the_highest_reached76 PASS [ 0.050s] horae-core client::tests::default_rate_rejects_negative_fractional_cent_overflow_and_invalid_text77 PASS [ 0.057s] horae-core budget::tests::over_budget_fires_even_without_a_configured_100_band78 PASS [ 0.061s] horae-core duration::tests::format_clamps_negative_to_zero79 PASS [ 0.073s] horae-core client::tests::profile_rejects_blank_overlong_and_null_names80 PASS [ 0.067s] horae-core client::tests::optional_text_normalizes_only_blank_fields81 PASS [ 0.036s] horae-core importers::harvest::convert::tests::money_rounds_third_decimal_half_up82 PASS [ 0.039s] horae-core importers::harvest::convert::tests::high_precision_fraction_straddles_the_half_minute_exactly83 PASS [ 0.069s] horae-core budget::tests::drop_below_a_band_does_not_fire_but_current_resets84 PASS [ 0.070s] horae-core budget::tests::each_crossing_is_announced_once85 PASS [ 0.071s] horae-core client::tests::default_rate_preserves_absence_zero_and_exact_large_amounts86 PASS [ 0.079s] horae-core importers::harvest::keys::tests::normalize_matches_sql_harvest_norm_contract87 PASS [ 0.073s] horae-core budget::tests::display_percentage_rounds_clamps_and_never_overflows88 PASS [ 0.082s] horae-core client::tests::profile_accepts_supported_currencies_and_unicode_character_limit89 PASS [ 0.085s] horae-core duration::tests::parse_preserves_u32_boundary_without_saturating90 PASS [ 0.056s] horae-core duration::tests::parse_round_trips_each_minute_in_a_day91 PASS [ 0.055s] horae-core importers::harvest::convert::tests::garbage_is_rejected92 PASS [ 0.089s] horae-core budget::tests::large_values_do_not_overflow93 PASS [ 0.055s] horae-core importers::harvest::keys::tests::client_key_equal_across_case_and_whitespace94 PASS [ 0.055s] horae-core importers::harvest::convert::tests::leading_and_trailing_forms_parse95 PASS [ 0.067s] horae-core importers::harvest::keys::tests::composite_components_do_not_collide96 PASS [ 0.093s] horae-core client::tests::profile_rejects_unsupported_currency_and_null_billing_fields97 PASS [ 0.062s] horae-core importers::harvest::convert::tests::conversion_reports_precision_and_numerator_limits98 Running [ 00:00:00] => 41/189: 48 running, 41 passed, 0 skipped 99 [ 00:00:00] horae-core duration::tests::format_round_trip100 [ 00:00:00] horae-core ::tests::minutes_between_is_exact_no_minimum101 [ 00:00:00] horae-core s::parse_decimal_rounds_half_minutes_exactly102 [ 00:00:00] horae-core duration::tests::parse_decimal103 [ 00:00:00] horae-core ts_excessive_decimal_precision_and_numerator104 [ 00:00:00] horae-core s::conversion_matches_exact_scaled_rationals105 [ 00:00:00] horae-core onvert::tests::hours_common_values_are_exact106 [ 00:00:00] horae-core onvert::tests::round_half_up_at_the_boundary107 PASS [ 0.092s] horae-core duration::tests::format_hhmm_pads_minutes108 PASS [ 0.086s] horae-core importers::harvest::convert::tests::conversion_preserves_the_i64_boundary_and_rejects_rounding_past_it109 PASS [ 0.093s] horae-core duration::tests::parse_rejects_colon_overflow_without_panicking110 PASS [ 0.091s] horae-core importers::harvest::convert::tests::negative_is_rejected111 PASS [ 0.113s] horae-core importers::harvest::convert::tests::hours_round_trip_against_exporter_transform112 PASS [ 0.109s] horae-core duration::tests::parse_rejects_negative_non_finite_and_malformed_values113 PASS [ 0.090s] horae-core importers::harvest::keys::tests::normalize_trims_and_case_folds114 PASS [ 0.126s] horae-core budget::tests::no_band_for_zero_or_missing_budget115 PASS [ 0.095s] horae-core importers::harvest::convert::tests::conversion_rejects_unrepresentable_scaled_values_without_panicking116 PASS [ 0.114s] horae-core importers::harvest::keys::tests::occurrence_counter_keys_are_independent117 PASS [ 0.097s] horae-core importers::harvest::convert::tests::money_common_values_are_exact118 PASS [ 0.119s] horae-core duration::tests::parse_colon119 PASS [ 0.098s] horae-core importers::harvest::convert::tests::money_round_trip_against_exporter_transform120 PASS [ 0.101s] horae-core importers::harvest::convert::tests::conversion_handles_high_precision_without_intermediate_overflow121 Running [ 00:00:00] => 41/189: 48 running, 41 passed, 0 skipped 122 [ 00:00:00] horae-core duration::tests::format_round_trip123 [ 00:00:00] horae-core ::tests::minutes_between_is_exact_no_minimum124 [ 00:00:00] horae-core s::parse_decimal_rounds_half_minutes_exactly125 [ 00:00:00] horae-core duration::tests::parse_decimal126 [ 00:00:00] horae-core ts_excessive_decimal_precision_and_numerator127 [ 00:00:00] horae-core s::conversion_matches_exact_scaled_rationals128 [ 00:00:00] horae-core onvert::tests::hours_common_values_are_exact129 [ 00:00:00] horae-core onvert::tests::round_half_up_at_the_boundary130 Running [ 00:00:00] => 42/189: 48 running, 41 passed, 0 skipped 131 [ 00:00:00] horae-core duration::tests::format_round_trip132 [ 00:00:00] horae-core ::tests::minutes_between_is_exact_no_minimum133 [ 00:00:00] horae-core s::parse_decimal_rounds_half_minutes_exactly134 [ 00:00:00] horae-core duration::tests::parse_decimal135 [ 00:00:00] horae-core ts_excessive_decimal_precision_and_numerator136 [ 00:00:00] horae-core s::conversion_matches_exact_scaled_rationals137 [ 00:00:00] horae-core onvert::tests::hours_common_values_are_exact138 [ 00:00:00] horae-core onvert::tests::round_half_up_at_the_boundary139 PASS [ 0.131s] horae-core duration::tests::parse_decimal140 PASS [ 0.119s] horae-core importers::harvest::convert::tests::hours_common_values_are_exact141 Running [ 00:00:00] => 43/189: 47 running, 43 passed, 0 skipped 142 [ 00:00:00] horae-core duration::tests::format_round_trip143 [ 00:00:00] horae-core ::tests::minutes_between_is_exact_no_minimum144 [ 00:00:00] horae-core s::parse_decimal_rounds_half_minutes_exactly145 [ 00:00:00] horae-core ts_excessive_decimal_precision_and_numerator146 [ 00:00:00] horae-core s::conversion_matches_exact_scaled_rationals147 [ 00:00:00] horae-core onvert::tests::round_half_up_at_the_boundary148 [ 00:00:00] horae-core occurrence_counter_numbers_repeats_from_zero149 [ 00:00:00] horae-core tests::project_key_prefers_code_when_present150 Running [ 00:00:00] ==> 65/189: 47 running, 43 passed, 0 skipped 151 [ 00:00:00] horae-core duration::tests::format_round_trip152 [ 00:00:00] horae-core ::tests::minutes_between_is_exact_no_minimum153 [ 00:00:00] horae-core s::parse_decimal_rounds_half_minutes_exactly154 [ 00:00:00] horae-core ts_excessive_decimal_precision_and_numerator155 [ 00:00:00] horae-core s::conversion_matches_exact_scaled_rationals156 [ 00:00:00] horae-core onvert::tests::round_half_up_at_the_boundary157 [ 00:00:00] horae-core occurrence_counter_numbers_repeats_from_zero158 [ 00:00:00] horae-core tests::project_key_prefers_code_when_present159 PASS [ 0.052s] horae-core importers::harvest::types::account_switch_tests::account_switch_requires_binding_and_no_imports_or_active_work160 PASS [ 0.082s] horae-core importers::harvest::keys::tests::project_key_falls_back_to_client_and_name161 PASS [ 0.083s] horae-core invoice::tests::invoice_adjustments_reject_negative_subtotal_and_overflow162 PASS [ 0.083s] horae-core invoice::tests::line_amount_half_hour163 PASS [ 0.174s] horae-core duration::tests::minutes_between_is_exact_no_minimum164 PASS [ 0.176s] horae-core duration::tests::parse_decimal_rounds_half_minutes_exactly165 PASS [ 0.085s] horae-core invoice::tests::line_amount_exact_hour166 PASS [ 0.083s] horae-core importers::harvest::types::tests::import_modes_display_their_wire_names167 PASS [ 0.169s] horae-core duration::tests::parse_rejects_excessive_decimal_precision_and_numerator168 PASS [ 0.115s] horae-core importers::harvest::convert::tests::round_half_up_at_the_boundary169 PASS [ 0.049s] horae-core invoice::tests::line_amount_90_minutes170 PASS [ 0.026s] horae-core invoice::tests::invoice_adjustments_apply_discount_before_non_compounding_taxes171 PASS [ 0.083s] horae-core invoice::tests::discount_allocation_handles_empty_zero_and_full_discounts172 PASS [ 0.084s] horae-core importers::harvest::types::tests::reconciles_when_errored_counts_match_collected_errors173 PASS [ 0.087s] horae-core importers::harvest::types::tests::archived_errors_and_new_inline_errors_reconcile_across_batches174 PASS [ 0.090s] horae-core invoice::tests::discount_allocation_conserves_header_amount_and_bounds_each_line175 PASS [ 0.092s] horae-core importers::harvest::keys::tests::occurrence_counter_numbers_repeats_from_zero176 PASS [ 0.109s] horae-core invoice::tests::discounted_fee_contribution_leaves_discount_available177 PASS [ 0.110s] horae-core invoice::tests::resolve_rate_cascade178 PASS [ 0.112s] horae-core invoice::tests::line_amount_accepts_large_representable_amounts179 PASS [ 0.116s] horae-core invoice::tests::invoice_adjustments_round_components_half_up180 PASS [ 0.093s] horae-core money::tests::format_cents_plain_keeps_sign_below_one_unit181 PASS [ 0.123s] horae-core importers::harvest::keys::tests::project_key_prefers_code_when_present182 PASS [ 0.125s] horae-core invoice::tests::discount_allocation_supports_maximum_representable_subtotal183 PASS [ 0.098s] horae-core money::tests::addition_rejects_overflow_in_both_directions184 Running [ 00:00:00] ==> 68/189: 48 running, 68 passed, 0 skipped 185 [ 00:00:00] horae-core duration::tests::format_round_trip186 [ 00:00:00] horae-core s::conversion_matches_exact_scaled_rationals187 [ 00:00:00] horae-core keys::tests::task_key_shared_across_projects188 [ 00:00:00] horae-core ts::time_entry_key_distinguishes_and_matches189 [ 00:00:00] horae-core _when_an_errored_count_has_no_reported_error190 [ 00:00:00] horae-core rejects_negative_lines_and_subtotal_overflow191 [ 00:00:00] horae-core s_largest_remainder_then_stable_source_order192 [ 00:00:00] horae-core invoice::tests::line_amount_odd_minutes193 Running [ 00:00:00] ===> 83/189: 48 running, 68 passed, 0 skipped 194 [ 00:00:00] horae-core duration::tests::format_round_trip195 [ 00:00:00] horae-core s::conversion_matches_exact_scaled_rationals196 [ 00:00:00] horae-core keys::tests::task_key_shared_across_projects197 [ 00:00:00] horae-core ts::time_entry_key_distinguishes_and_matches198 [ 00:00:00] horae-core _when_an_errored_count_has_no_reported_error199 [ 00:00:00] horae-core rejects_negative_lines_and_subtotal_overflow200 [ 00:00:00] horae-core s_largest_remainder_then_stable_source_order201 [ 00:00:00] horae-core invoice::tests::line_amount_odd_minutes202 PASS [ 0.134s] horae-core invoice::tests::discount_allocation_uses_largest_remainder_then_stable_source_order203 PASS [ 0.028s] horae-core permissions::catalog::tests::adding_all_catalog_grants_produces_exactly_the_catalog204 PASS [ 0.235s] horae-core duration::tests::format_round_trip205 PASS [ 0.122s] horae-core invoice::tests::selected_rate_keeps_zero_and_explicit_missing_project_rate206 PASS [ 0.141s] horae-core invoice::tests::line_amount_odd_minutes207 PASS [ 0.145s] horae-core importers::harvest::keys::tests::time_entry_key_distinguishes_and_matches208 PASS [ 0.131s] horae-core money::tests::addition_retains_currency_checks_and_representable_boundaries209 PASS [ 0.127s] horae-core money::tests::parse_cents_is_exact_where_a_float_would_drift210 PASS [ 0.126s] horae-core permissions::approvals::tests::all_records_need_approval_scope_even_when_both_domains_are_readable211 PASS [ 0.130s] horae-core money::tests::format_cents_groups_thousands_and_keeps_sign212 PASS [ 0.148s] horae-core invoice::tests::line_amount_rounds_half_cents_up_not_to_even213 PASS [ 0.127s] horae-core money::tests::parse_cents_tolerates_grouping_spaces_and_signs214 PASS [ 0.150s] horae-core invoice::tests::discount_allocation_rejects_negative_lines_and_subtotal_overflow215 PASS [ 0.135s] horae-core money::tests::parse_cents_rejects_what_it_cannot_represent216 PASS [ 0.170s] horae-core importers::harvest::keys::tests::task_key_shared_across_projects217 PASS [ 0.068s] horae-core permissions::catalog::tests::administrator_selection_covers_known_catalog_without_unknown_ids218 Running [ 00:00:00] ===> 84/189: 48 running, 84 passed, 0 skipped 219 [ 00:00:00] horae-core s::conversion_matches_exact_scaled_rationals220 [ 00:00:00] horae-core _when_an_errored_count_has_no_reported_error221 [ 00:00:00] horae-core invoice::tests::line_amount_zero_rate222 [ 00:00:00] horae-core :line_amount_rejects_unrepresentable_results223 [ 00:00:00] horae-core invoice::tests::line_amount_zero_minutes224 [ 00:00:00] horae-core ed_rate_mode_ignores_unselected_rate_sources225 [ 00:00:00] horae-core rse_cents_reads_whole_and_fractional_amounts226 [ 00:00:00] horae-core atalog_grants_cannot_substitute_for_approval227 Running [ 00:00:00] ===> 86/189: 48 running, 84 passed, 0 skipped 228 [ 00:00:00] horae-core s::conversion_matches_exact_scaled_rationals229 [ 00:00:00] horae-core _when_an_errored_count_has_no_reported_error230 [ 00:00:00] horae-core invoice::tests::line_amount_zero_rate231 [ 00:00:00] horae-core :line_amount_rejects_unrepresentable_results232 [ 00:00:00] horae-core invoice::tests::line_amount_zero_minutes233 [ 00:00:00] horae-core ed_rate_mode_ignores_unselected_rate_sources234 [ 00:00:00] horae-core rse_cents_reads_whole_and_fractional_amounts235 [ 00:00:00] horae-core atalog_grants_cannot_substitute_for_approval236 PASS [ 0.188s] horae-core invoice::tests::line_amount_zero_minutes237 PASS [ 0.192s] horae-core invoice::tests::line_amount_rejects_unrepresentable_results238 PASS [ 0.120s] horae-core permissions::catalog::tests::approve_all_includes_read_scopes_but_not_write_or_expense_management239 PASS [ 0.221s] horae-core importers::harvest::types::tests::does_not_reconcile_when_an_errored_count_has_no_reported_error240 PASS [ 0.140s] horae-core permissions::catalog::stored_tests::rejects_duplicate_grants_instead_of_silently_deduplicating241 PASS [ 0.221s] horae-core invoice::tests::line_amount_zero_rate242 PASS [ 0.200s] horae-core invoice::tests::selected_rate_mode_ignores_unselected_rate_sources243 PASS [ 0.200s] horae-core money::tests::parse_cents_reads_whole_and_fractional_amounts244 PASS [ 0.141s] horae-core permissions::catalog::stored_tests::rejects_every_missing_prerequisite_without_repairing_input245 PASS [ 0.089s] horae-core permissions::catalog::tests::floor_cannot_be_removed_or_partially_modified246 Running [ 00:00:00] ===> 94/189: 48 running, 94 passed, 0 skipped 247 [ 00:00:00] horae-core s::conversion_matches_exact_scaled_rationals248 [ 00:00:00] horae-core atalog_grants_cannot_substitute_for_approval249 [ 00:00:00] horae-core not_remove_identity_or_explicit_grant_checks250 [ 00:00:00] horae-core cope_and_approval_scope_form_an_intersection251 [ 00:00:00] horae-core foreign_provenance_deny_even_with_all_grants252 [ 00:00:00] horae-core e_prerequisites_make_others_expenses_visible253 [ 00:00:00] horae-core ions_and_input_duplicates_do_not_infer_scope254 [ 00:00:00] horae-core se_read_is_needed_when_there_are_no_expenses255 Running [ 00:00:00] ====> 99/189: 48 running, 94 passed, 0 skipped 256 [ 00:00:00] horae-core s::conversion_matches_exact_scaled_rationals257 [ 00:00:00] horae-core atalog_grants_cannot_substitute_for_approval258 [ 00:00:00] horae-core not_remove_identity_or_explicit_grant_checks259 [ 00:00:00] horae-core cope_and_approval_scope_form_an_intersection260 [ 00:00:00] horae-core foreign_provenance_deny_even_with_all_grants261 [ 00:00:00] horae-core e_prerequisites_make_others_expenses_visible262 [ 00:00:00] horae-core ions_and_input_duplicates_do_not_infer_scope263 [ 00:00:00] horae-core se_read_is_needed_when_there_are_no_expenses264 PASS [ 0.115s] horae-core permissions::catalog::tests::direct_profile_defaults_match_the_known_reference_catalog265 PASS [ 0.136s] horae-core permissions::catalog::tests::catalog_has_fifty_distinct_known_grants266 PASS [ 0.164s] horae-core permissions::catalog::stored_tests::restores_each_valid_grant_pair_and_its_revoked_selection267 PASS [ 0.122s] horae-core permissions::catalog::tests::empty_selection_includes_member_floor268 PASS [ 0.117s] horae-core permissions::catalog::tests::finance_profiles_cannot_edit_rates_and_project_manager_has_no_financial_grants269 PASS [ 0.143s] horae-core permissions::catalog::tests::every_profile_includes_floor_and_is_closed_under_dependencies270 PASS [ 0.050s] horae-core permissions::person_management::tests::combined_unrelated_grants_do_not_create_person_management_eligibility271 PASS [ 0.025s] horae-core permissions::rates::tests::explicit_rate_edits_require_write_even_for_zero_or_an_equal_value272 Running [ 00:00:00] ===> 102/189: 48 running, 102 passed, 0 skipped 273 [ 00:00:00] horae-core s::conversion_matches_exact_scaled_rationals274 [ 00:00:00] horae-core atalog_grants_cannot_substitute_for_approval275 [ 00:00:00] horae-core not_remove_identity_or_explicit_grant_checks276 [ 00:00:00] horae-core cope_and_approval_scope_form_an_intersection277 [ 00:00:00] horae-core foreign_provenance_deny_even_with_all_grants278 [ 00:00:00] horae-core e_prerequisites_make_others_expenses_visible279 [ 00:00:00] horae-core ions_and_input_duplicates_do_not_infer_scope280 [ 00:00:00] horae-core se_read_is_needed_when_there_are_no_expenses281 Running [ 00:00:00] ====> 111/189: 48 running, 102 passed, 0 skipped 282 [ 00:00:00] horae-core s::conversion_matches_exact_scaled_rationals283 [ 00:00:00] horae-core atalog_grants_cannot_substitute_for_approval284 [ 00:00:00] horae-core not_remove_identity_or_explicit_grant_checks285 [ 00:00:00] horae-core cope_and_approval_scope_form_an_intersection286 [ 00:00:00] horae-core foreign_provenance_deny_even_with_all_grants287 [ 00:00:00] horae-core e_prerequisites_make_others_expenses_visible288 [ 00:00:00] horae-core ions_and_input_duplicates_do_not_infer_scope289 [ 00:00:00] horae-core se_read_is_needed_when_there_are_no_expenses290 Running [ 00:00:00] ====> 111/189: 48 running, 102 passed, 0 skipped 291 [ 00:00:00] horae-core s::conversion_matches_exact_scaled_rationals292 [ 00:00:00] horae-core atalog_grants_cannot_substitute_for_approval293 [ 00:00:00] horae-core not_remove_identity_or_explicit_grant_checks294 [ 00:00:00] horae-core cope_and_approval_scope_form_an_intersection295 [ 00:00:00] horae-core foreign_provenance_deny_even_with_all_grants296 [ 00:00:00] horae-core e_prerequisites_make_others_expenses_visible297 [ 00:00:00] horae-core ions_and_input_duplicates_do_not_infer_scope298 [ 00:00:00] horae-core se_read_is_needed_when_there_are_no_expenses299 PASS [ 0.057s] horae-core permissions::person_management::tests::each_catalog_grant_has_the_specified_compatibility_without_changing_grants300 PASS [ 0.210s] horae-core permissions::catalog::stored_tests::rejects_empty_saved_selection_instead_of_adding_member_floor301 PASS [ 0.170s] horae-core permissions::catalog::tests::every_declared_dependency_is_added_and_removing_it_removes_the_dependent302 PASS [ 0.210s] horae-core permissions::catalog::stored_tests::rejects_each_missing_floor_grant303 PASS [ 0.213s] horae-core permissions::approvals::tests::empty_record_sets_do_not_remove_identity_or_explicit_grant_checks304 PASS [ 0.211s] horae-core permissions::approvals::tests::one_unreadable_expense_denies_the_whole_supplied_set305 PASS [ 0.212s] horae-core permissions::approvals::tests::reevaluation_does_not_reuse_prior_read_or_approval_success306 PASS [ 0.263s] horae-core permissions::approvals::tests::catalog_grants_cannot_substitute_for_approval307 PASS [ 0.209s] horae-core permissions::catalog::stored_tests::stored_order_does_not_change_the_selected_set308 PASS [ 0.219s] horae-core permissions::catalog::stored_tests::restores_each_builtin_selection_without_changing_grants309 Running [ 00:00:00] ====> 112/189: 47 running, 112 passed, 0 skipped 310 [ 00:00:00] horae-core s::conversion_matches_exact_scaled_rationals311 [ 00:00:00] horae-core cope_and_approval_scope_form_an_intersection312 [ 00:00:00] horae-core foreign_provenance_deny_even_with_all_grants313 [ 00:00:00] horae-core e_prerequisites_make_others_expenses_visible314 [ 00:00:00] horae-core ions_and_input_duplicates_do_not_infer_scope315 [ 00:00:00] horae-core se_read_is_needed_when_there_are_no_expenses316 [ 00:00:00] horae-core t_matching_relationship_revokes_both_domains317 [ 00:00:00] horae-core s_unsupported_versions_even_for_valid_grants318 Running [ 00:00:00] =====> 151/189: 47 running, 112 passed, 0 skipped 319 [ 00:00:00] horae-core s::conversion_matches_exact_scaled_rationals320 [ 00:00:00] horae-core cope_and_approval_scope_form_an_intersection321 [ 00:00:00] horae-core foreign_provenance_deny_even_with_all_grants322 [ 00:00:00] horae-core e_prerequisites_make_others_expenses_visible323 [ 00:00:00] horae-core ions_and_input_duplicates_do_not_infer_scope324 [ 00:00:00] horae-core se_read_is_needed_when_there_are_no_expenses325 [ 00:00:00] horae-core t_matching_relationship_revokes_both_domains326 [ 00:00:00] horae-core s_unsupported_versions_even_for_valid_grants327 PASS [ 0.072s] horae-core permissions::rates::tests::identity_and_tenant_mismatches_deny_even_all_financial_grants328 PASS [ 0.090s] horae-core permissions::rates::tests::all_six_defaults_have_the_approved_financial_access329 PASS [ 0.167s] horae-core permissions::catalog::tests::profiles_reject_legacy_rank_names_and_unknown_values330 PASS [ 0.235s] horae-core permissions::approvals::tests::expense_read_scope_and_approval_scope_form_an_intersection331 PASS [ 0.093s] horae-core permissions::person_management::tests::other_people_and_empty_removal_need_neither_grants_nor_a_separate_actor332 PASS [ 0.236s] horae-core permissions::approvals::tests::inactive_and_foreign_provenance_deny_even_with_all_grants333 PASS [ 0.237s] horae-core permissions::approvals::tests::no_expense_read_is_needed_when_there_are_no_expenses334 PASS [ 0.102s] horae-core permissions::person_management::tests::self_link_rejects_the_proposal_in_every_position_without_filtering_it335 PASS [ 0.195s] horae-core permissions::catalog::tests::member_has_only_own_time_and_expense_access336 PASS [ 0.102s] horae-core permissions::rates::tests::cost_and_billable_grants_are_independent_and_read_does_not_allow_write337 PASS [ 0.257s] horae-core permissions::approvals::tests::only_expense_reads_or_their_write_prerequisites_make_others_expenses_visible338 PASS [ 0.264s] horae-core permissions::approvals::tests::removing_the_last_matching_relationship_revokes_both_domains339 PASS [ 0.264s] horae-core permissions::catalog::stored_tests::restores_custom_selection_without_reapplying_profile_defaults340 PASS [ 0.107s] horae-core permissions::rates::tests::removing_read_prerequisites_denies_both_actions341 PASS [ 0.097s] horae-core permissions::tests::assignment_matching_searches_all_members_and_is_insensitive_to_duplicates342 PASS [ 0.152s] horae-core permissions::person_management::tests::own_tracking_floor_does_not_qualify343 PASS [ 0.294s] horae-core permissions::catalog::stored_tests::rejects_unsupported_versions_even_for_valid_grants344 PASS [ 0.235s] horae-core permissions::catalog::tests::known_permission_name_decodes_without_legacy_role_conversion345 PASS [ 0.296s] horae-core permissions::approvals::tests::missing_dimensions_and_input_duplicates_do_not_infer_scope346 PASS [ 0.151s] horae-core permissions::person_management::tests::eligibility_tracks_last_compatible_grant_loss_and_restoration347 PASS [ 0.225s] horae-core permissions::catalog::tests::report_and_withdrawal_grants_do_not_add_unrelated_authority348 PASS [ 0.105s] horae-core permissions::rates::tests::unchanged_rate_edit_requires_no_financial_write_grant349 PASS [ 0.223s] horae-core permissions::catalog::tests::template_names_reject_empty_and_overlong_unicode_names350 Running [ 00:00:00] =====> 152/189: 37 running, 152 passed, 0 skipped 351 [ 00:00:00] horae-core s::conversion_matches_exact_scaled_rationals352 [ 00:00:00] horae-core mpotent_order_independent_and_duplicate_free353 [ 00:00:00] horae-core r_grant_keeps_the_remaining_selection_closed354 [ 00:00:00] horae-core keeps_read_but_removes_managed_and_all_write355 [ 00:00:00] horae-core t_scope_and_missing_assignments_do_not_match356 [ 00:00:00] horae-core cept_supported_currencies_and_optional_dates357 [ 00:00:00] horae-core ests::basics_reject_blank_and_overlong_names358 [ 00:00:00] horae-core eject_overlong_code_and_unsupported_currency359 PASS [ 0.206s] horae-core permissions::catalog::tests::unknown_permission_names_are_rejected360 PASS [ 0.225s] horae-core permissions::catalog::tests::removing_absent_permission_is_an_idempotent_no_op361 PASS [ 0.265s] horae-core permissions::catalog::tests::dependency_graph_matches_the_reference_edges_without_extra_cross_resource_grants362 PASS [ 0.227s] horae-core permissions::catalog::tests::removing_managed_time_read_also_removes_all_reads_writes_and_approvals363 PASS [ 0.151s] horae-core permissions::rates::tests::billable_owner_never_uses_the_other_management_dimension364 PASS [ 0.166s] horae-core permissions::rates::tests::billable_actions_use_only_their_own_grant_and_owner_scope365 PASS [ 0.240s] horae-core permissions::catalog::tests::removing_one_financial_permission_preserves_unrelated_families366 PASS [ 0.109s] horae-core permissions::tests::inactive_or_foreign_context_is_denied_for_every_scope_combination367 PASS [ 0.105s] horae-core project::tests::basics_accept_same_day_but_reject_reversed_dates368 PASS [ 0.201s] horae-core permissions::person_management::tests::any_compatible_grant_suffices_in_every_pair369 PASS [ 0.112s] horae-core permissions::tests::scope_union_obeys_set_laws370 PASS [ 0.162s] horae-core permissions::rates::tests::read_only_cost_grant_cannot_authorize_an_explicit_rate_edit371 PASS [ 0.118s] horae-core permissions::tests::every_scope_combination_matches_only_explicitly_granted_dimensions372 PASS [ 0.145s] horae-core permissions::rates::tests::unrelated_catalog_grants_never_authorize_ordinary_financial_fields373 PASS [ 0.171s] horae-core permissions::rates::tests::grant_removal_denies_without_mutating_the_remaining_selection374 PASS [ 0.123s] horae-core permissions::tests::removing_an_assignment_removes_only_that_matching_dimension375 PASS [ 0.253s] horae-core permissions::catalog::tests::template_names_trim_without_changing_display_or_internal_spaces376 Running [ 00:00:00] =====> 152/189: 37 running, 152 passed, 0 skipped 377 [ 00:00:00] horae-core s::conversion_matches_exact_scaled_rationals378 [ 00:00:00] horae-core mpotent_order_independent_and_duplicate_free379 [ 00:00:00] horae-core r_grant_keeps_the_remaining_selection_closed380 [ 00:00:00] horae-core keeps_read_but_removes_managed_and_all_write381 [ 00:00:00] horae-core t_scope_and_missing_assignments_do_not_match382 [ 00:00:00] horae-core cept_supported_currencies_and_optional_dates383 [ 00:00:00] horae-core ests::basics_reject_blank_and_overlong_names384 [ 00:00:00] horae-core eject_overlong_code_and_unsupported_currency385 Running [ 00:00:00] =======> 185/189: 4 running, 185 passed, 0 skipped 386 [ 00:00:00] horae-core s::conversion_matches_exact_scaled_rationals387 [ 00:00:00] horae-core r_grant_keeps_the_remaining_selection_closed388 [ 00:00:00] horae-core keeps_read_but_removes_managed_and_all_write389 [ 00:00:00] horae-core sts::managers_invoice_open_and_approved_time390391392393394 PASS [ 0.044s] horae-core state::tests::only_manager_can_approve395 PASS [ 0.045s] horae-core time_of_day::tests::parse_reads_12h_including_edges396 PASS [ 0.046s] horae-core rounding::tests::up_and_down397 PASS [ 0.046s] horae-core week::tests::configured_week_reports_an_unrepresentable_start398 PASS [ 0.046s] horae-core time_of_day::tests::parse_rejects_out_of_range_and_garbage399 PASS [ 0.044s] horae-core time_of_day::tests::clamp_to_day_prevents_crossing_midnight400 PASS [ 0.133s] horae-core project::tests::basics_reject_blank_and_overlong_names401 PASS [ 0.046s] horae-core state::tests::invoiced_is_final402 PASS [ 0.039s] horae-core project::tests::percentage_preserves_exact_hundredths403 PASS [ 0.046s] horae-core project::tests::monetary_budgets_are_only_available_for_time_and_materials404 PASS [ 0.045s] horae-core time_of_day::tests::parse_reads_24h405 PASS [ 0.045s] horae-core week::tests::configured_week_can_start_in_the_previous_year406 PASS [ 0.047s] horae-core time_of_day::tests::format_round_trips407 PASS [ 0.050s] horae-core project::tests::monthly_fee_dates_follow_calendar_months408 PASS [ 0.053s] horae-core rounding::tests::result_is_multiple_of_inc409 PASS [ 0.056s] horae-core project::tests::payment_terms_support_receipt_and_checked_days410 PASS [ 0.057s] horae-core week::tests::configured_week_contains_each_day_for_all_seven_start_days411 PASS [ 0.055s] horae-core project::tests::monthly_fee_dates_reject_invalid_calendar_inputs412 PASS [ 0.145s] horae-core project::tests::basics_accept_supported_currencies_and_optional_dates413 PASS [ 0.060s] horae-core state::tests::member_submit_and_reopen414 PASS [ 0.061s] horae-core time_of_day::tests::format_12h_matches_harvest_style415 PASS [ 0.150s] horae-core permissions::tests::assignments_do_not_grant_scope_and_missing_assignments_do_not_match416 PASS [ 0.057s] horae-core rounding::tests::nearest_ties_round_up417 PASS [ 0.061s] horae-core types::tests::budget_kind_wire_strings_match_db_enum418 PASS [ 0.061s] horae-core project::tests::basics_reject_overlong_code_and_unsupported_currency419 PASS [ 0.051s] horae-core week::tests::maps_any_weekday_to_its_monday420 PASS [ 0.065s] horae-core project::tests::fee_schedules_reject_missing_overlong_and_excessive_milestones421 PASS [ 0.303s] horae-core permissions::catalog::tests::normalization_is_idempotent_order_independent_and_duplicate_free422 Running [ 00:00:00] =======> 185/189: 4 running, 185 passed, 0 skipped 423 [ 00:00:00] horae-core s::conversion_matches_exact_scaled_rationals424 [ 00:00:00] horae-core r_grant_keeps_the_remaining_selection_closed425 [ 00:00:00] horae-core keeps_read_but_removes_managed_and_all_write426 [ 00:00:00] horae-core sts::managers_invoice_open_and_approved_time427428429430431 PASS [ 0.077s] horae-core rounding::tests::identity_when_inc_zero432 PASS [ 0.075s] horae-core project::tests::fee_schedules_validate_amounts_and_milestone_total433 PASS [ 0.083s] horae-core rounding::tests::effective_minutes_respect_frozen_history_including_zero434 PASS [ 0.086s] horae-core time_of_day::tests::snap_rounds_to_nearest_step435 PASS [ 0.078s] horae-core project::tests::percentage_rejects_invalid_precision_range_and_syntax436 Running [ 00:00:00] =======> 185/189: 4 running, 185 passed, 0 skipped 437 [ 00:00:00] horae-core s::conversion_matches_exact_scaled_rationals438 [ 00:00:00] horae-core r_grant_keeps_the_remaining_selection_closed439 [ 00:00:00] horae-core keeps_read_but_removes_managed_and_all_write440 [ 00:00:00] horae-core sts::managers_invoice_open_and_approved_time441442443444445 Running [ 00:00:00] =======> 187/189: 2 running, 187 passed, 0 skipped 446 [ 00:00:00] horae-core s::conversion_matches_exact_scaled_rationals447 [ 00:00:00] horae-core keeps_read_but_removes_managed_and_all_write448449450451452453454 PASS [ 0.333s] horae-core permissions::catalog::tests::removing_any_non_floor_grant_keeps_the_remaining_selection_closed455 PASS [ 0.111s] horae-core state::tests::managers_invoice_open_and_approved_time456 Running [ 00:00:00] =======> 187/189: 2 running, 187 passed, 0 skipped 457 [ 00:00:00] horae-core s::conversion_matches_exact_scaled_rationals458 [ 00:00:00] horae-core keeps_read_but_removes_managed_and_all_write459460461462463464465 Running [ 00:00:00] =======> 188/189: 1 running, 188 passed, 0 skipped 466 [ 00:00:00] horae-core s::conversion_matches_exact_scaled_rationals467468469470471472473474 PASS [ 0.397s] horae-core permissions::catalog::tests::removing_invoice_draft_write_keeps_read_but_removes_managed_and_all_write475 Running [ 00:00:00] =======> 188/189: 1 running, 188 passed, 0 skipped 476 [ 00:00:00] horae-core s::conversion_matches_exact_scaled_rationals477478479480481482483484 Running [ 00:00:00] =======> 188/189: 1 running, 188 passed, 0 skipped 485 [ 00:00:00] horae-core s::conversion_matches_exact_scaled_rationals486487488489490491492493 Running [ 00:00:00] =======> 188/189: 1 running, 188 passed, 0 skipped 494 [ 00:00:00] horae-core s::conversion_matches_exact_scaled_rationals495496497498499500501502 Running [ 00:00:00] =======> 188/189: 1 running, 188 passed, 0 skipped 503 [ 00:00:00] horae-core s::conversion_matches_exact_scaled_rationals504505506507508509510511 Running [ 00:00:00] =======> 188/189: 1 running, 188 passed, 0 skipped 512 [ 00:00:00] horae-core s::conversion_matches_exact_scaled_rationals513514515516517518519520 Running [ 00:00:00] =======> 188/189: 1 running, 188 passed, 0 skipped 521 [ 00:00:00] horae-core s::conversion_matches_exact_scaled_rationals522523524525526527528529 Running [ 00:00:00] =======> 188/189: 1 running, 188 passed, 0 skipped 530 [ 00:00:00] horae-core s::conversion_matches_exact_scaled_rationals531532533534535536537538 Running [ 00:00:00] =======> 188/189: 1 running, 188 passed, 0 skipped 539 [ 00:00:00] horae-core s::conversion_matches_exact_scaled_rationals540541542543544545546547 Running [ 00:00:00] =======> 188/189: 1 running, 188 passed, 0 skipped 548 [ 00:00:00] horae-core s::conversion_matches_exact_scaled_rationals549550551552553554555556 PASS [ 0.933s] horae-core importers::harvest::convert::tests::conversion_matches_exact_scaled_rationals557------------558 Summary [ 0.989s] 189 tests run: 189 passed, 0 skipped559 Running [ 00:00:00] ======== 189/189: 1 running, 188 passed, 0 skipped 560 [ 00:00:00] horae-core s::conversion_matches_exact_scaled_rationals561562563564565566567568The files belonging to this database system will be owned by user "nixbld".569This user must also own the server process.570571The database cluster will be initialized with locale "C".572The default text search configuration will be set to "english".573574Data page checksums are disabled.575576fixing permissions on existing directory /build/tmp.G8oUZYm7Wl ... ok577creating subdirectories ... ok578selecting dynamic shared memory implementation ... posix579selecting default "max_connections" ... 100580selecting default "shared_buffers" ... 128MB581selecting default time zone ... UTC582creating configuration files ... ok583running bootstrap script ... ok584performing post-bootstrap initialization ... ok585syncing data to disk ... ok586587initdb: warning: enabling "trust" authentication for local connections588initdb: hint: You can change this by editing pg_hba.conf or using the option -A, or --auth-local and --auth-host, the next time you run initdb.589590Success. You can now start the database server using:591592 pg_ctl -D /build/tmp.G8oUZYm7Wl -l logfile start593594waiting for server to start.... done595server started596+++ command cargo test -p horae --features server -- --test-threads 48597 Compiling horae v0.1.0 (/build/source/crates/horae)598 Compiling horae-core v0.1.0 (/build/source/crates/core)599 Finished `test` profile [unoptimized + debuginfo] target(s) in 13m 47s600 Running unittests src/main.rs (target/debug/deps/horae-0767924faa118e50)601602running 1166 tests603test config::tests::dev_login_is_refused_off_loopback ... ok604test cli::imports::tests::missing_session_is_a_structured_configuration_failure ... ok605test components::permission_description::tests::permission_descriptions_cover_each_grant_distinctly ... ok606test config::tests::dev_login_is_allowed_on_loopback ... ok607test config::tests::environment::environment_probe ... ok608test cli::tests::environment_probe ... ok609test config::tests::environment::example_environment_can_configure_all_required_oidc_and_harvest_fields ... ok610test auth::oidc::tests::deactivated_subject_match_is_denied ... ok611test auth::oidc::tests::extra_audiences_are_trusted_only_when_listed ... ok612test auth::oidc::tests::first_login_links_subject_via_verified_email ... ok613test auth::oidc::tests::no_account_is_denied_not_provisioned ... ok614test auth::oidc::tests::subject_match_logs_in_without_relinking ... ok615test auth::oidc::tests::subject_match_takes_precedence_over_email ... ok616test auth::oidc::tests::unverified_email_is_not_matched ... ok617test auth::page::tests::configured_label_is_html_escaped ... ok618test auth::page::tests::dev_variant_offers_the_admin_bypass_and_no_fake_controls ... ok619test cli::imports::tests::ordinary_json_is_bounded_and_invalid_replies_are_not_echoed ... ok620test config::tests::environment::empty_environment_has_no_authentication_or_plugin_credentials ... ok621test cli::imports::tests::status_and_wait_distinguish_failed_jobs_from_failed_reads ... ok622test auth::page::tests::oidc_variant_uses_the_configured_label_and_hands_off_to_start ... ok623test cli::tests::remote_import_and_job_commands_accept_the_documented_arguments ... ok624test cli::tests::remote_commands_reject_conflicting_or_unbounded_options ... ok625test config::tests::environment::partial_oidc_configuration_remains_disabled_without_a_callback ... ok626test cli::imports::tests::cancellation_racing_completion_does_not_claim_cancellation_was_requested ... ok627test cli::imports::tests::csv_connection_closed_without_response_remains_indeterminate ... ok628test cli::imports::tests::api_submission_captures_generation_without_retrying_uncertain_acceptance ... ok629test cli::imports::tests::private_session_accepts_https_and_loopback_only ... ok630test cli::imports::tests::malformed_submission_acknowledgement_retains_its_request_identity ... ok631test config::tests::environment::obsolete_authentication_variables_do_not_configure_the_server ... ok632test cli::imports::tests::retry_snapshot_is_compatible_with_missing_and_future_values ... ok633test cli::imports::tests::redirects_are_not_followed_or_exposed_as_server_error_text ... ok634test cli::imports::tests::session_rejects_cookie_header_injection_without_echoing_the_value ... ok635test cli::imports::tests::report_marks_confirmed_failed_outcomes_as_incomplete ... ok636test cli::imports::tests::session_rejects_plaintext_remote_and_credential_bearing_urls ... ok637test cli::imports::tests::csv_named_pipe_is_rejected_without_waiting_for_a_writer ... ok638test cli::imports::tests::session_rejects_public_permissions_and_symlinks ... ok639test cli::tests::default_command_uses_the_same_defaults_and_environment_as_serve ... ok640test auth::oidc::tests::deactivated_email_match_is_denied ... ok641test harvest::pagination_tests::harvest_pagination_total_pages_does_not_overflow ... ok642test harvest::tests::page_window_defaults_and_checked_offsets ... ok643test cli::imports::tests::missing_and_mismatched_jobs_fail_without_substitution ... ok644test config::tests::without_dev_login_any_bind_is_fine ... ok645test cli::imports::tests::archived_errors_publish_without_clobbering_and_preserve_the_prior_file_on_failure ... ok646test cli::imports::tests::invalid_csv_files_fail_before_contacting_the_server ... ok647test db::tests::pool_connections_force_custom_plans ... ok648test importers::harvest::api_source::http::tests::cancelled_backoff_does_not_wait_or_retry ... ok649test importers::harvest::api_source::http::tests::cursor_links_are_authoritative_even_with_null_or_stale_page_numbers ... ok650test cli::tests::default_command_rejects_invalid_environment_ports ... ok651test config::tests::environment::mail_environment_requires_a_complete_valid_configuration ... ok652test config::tests::environment::job_attempt_limit_uses_the_documented_environment_variable ... ok653test importers::harvest::api_source::http::tests::http_pages_follow_cursor_and_preserve_headers_and_encoded_filter ... ok654test importers::harvest::api_source::http::tests::missing_next_cursor_is_not_silently_treated_as_completed ... ok655test importers::harvest::api_source::http::tests::persisted_cursor_resumes_with_a_new_client_and_stays_complete_at_eof ... ok656test config::tests::environment::secure_cookies_use_the_documented_prefixed_variable ... ok657test importers::harvest::api_source::http::tests::rejects_pagination_outside_the_authenticated_endpoint ... ok658test importers::harvest::api_source::http::tests::resumed_cursor_rejects_untrusted_destinations_and_invalid_state_before_http ... ok659test config::tests::environment::invalid_job_attempt_limits_reject_startup ... ok660test importers::harvest::api_source::tests::assembled_rows_convert_to_exact_minutes ... ok661test importers::harvest::api_source::tests::assembles_rows_joining_parents_by_id ... ok662test importers::harvest::api_source::tests::hours_render_as_exact_decimals ... ok663test importers::harvest::api_source::tests::http_page_preserves_decimal_values_before_integer_conversion ... ok664test importers::harvest::api_source::tests::json_exponents_expand_exactly_with_bounded_output ... ok665test importers::harvest::api_source::http::tests::pagination_cycle_detection_survives_restarting_after_every_page ... ok666test importers::harvest::api_source::http::tests::rejected_page_does_not_advance_the_cursor ... ok667test cli::imports::tests::wait_deadline_caps_a_pending_request_without_cancelling_the_job ... ok668test importers::harvest::api_source::http::tests::http_retries_429_but_never_follows_redirects_or_shortens_long_backoff ... ok669test importers::harvest::api_source::http::tests::slow_consumer_backpressures_http_and_cancellation_stops_further_pages ... ok670test cli::imports::tests::csv_upload_preserves_bytes_across_stream_chunk_boundaries ... ok671test importers::harvest::api_source::http::tests::http_rejects_oversized_malformed_and_cyclic_pages ... ok672test cli::imports::tests::small_csv_upload_preserves_immediate_authorization_rejections_across_threads ... ok673test importers::harvest::credentials::tests::bad_key_length_is_rejected ... ok674test harvest::tests::a_member_cannot_fetch_a_colleagues_entry ... ok675test importers::harvest::account_switch::tests::queued_work_and_provenance_block_without_changing_binding ... ok676test harvest::tests::a_member_cannot_list_users ... ok677test auth::oidc::tests::linking::unverified_email_cannot_link_an_account ... ok678test importers::harvest::credentials::tests::decode_hex_rejects_bad_input ... ok679test auth::oidc::tests::linking::existing_subject_wins_over_another_accounts_email ... ok680test importers::harvest::credentials::tests::encrypt_then_decrypt_round_trips ... ok681test harvest::pagination_tests::harvest_pagination_router_preserves_session_and_tenant_guards ... ok682test importers::harvest::account_switch::tests::successful_change_preserves_business_rows_and_failure_rolls_back_secrets ... ok683test harvest::tests::a_manager_lists_users_with_their_rates ... ok684test importers::harvest::credentials::tests::nonce_makes_ciphertext_nondeterministic ... ok685test harvest::tests::harvest_marks_unbilled_non_billable_contexts_consistently ... ok686test harvest::tests::a_member_sees_only_their_own_time_entries ... ok687test importers::harvest::credentials::tests::wrong_key_fails_to_decrypt ... ok688test importers::harvest::csv_source::tests::conflicting_email_aliases_error_only_the_affected_row ... ok689test importers::harvest::csv_source::tests::csv_records_preserve_multiline_unicode_across_single_byte_reads ... ok690test importers::harvest::csv_source::tests::bad_date_becomes_a_row_error_not_a_rejection ... ok691test importers::harvest::csv_source::tests::cursor_beyond_upload_is_rejected_without_parsing_rows ... ok692test importers::harvest::csv_source::tests::delivers_a_row_before_reading_the_rest_of_the_file ... ok693test auth::oidc::tests::linking::deactivation_during_first_link_denies_login ... ok694test importers::harvest::csv_source::tests::cursor_resumes_after_multiline_unicode_and_preserves_error_locations ... ok695test importers::harvest::csv_source::tests::invalid_utf8_errors_one_record_and_continues ... ok696test importers::harvest::csv_source::tests::identity_columns_are_required_and_cannot_repeat ... ok697test importers::harvest::csv_source::tests::empty_file_is_rejected ... ok698test importers::harvest::csv_source::tests::missing_required_columns_is_rejected ... ok699test importers::harvest::csv_source::tests::parse_bool_accepts_yes_variants ... ok700test importers::harvest::csv_source::tests::names_stay_separate_from_optional_email ... ok701test importers::harvest::csv_source::tests::parses_rows_case_insensitively ... ok702test harvest::tests::a_member_cannot_filter_to_a_colleague ... ok703test importers::harvest::account_switch::tests::change_preserves_terminal_history_and_rejects_stale_confirmation ... ok704test importers::harvest::account_switch::tests::queue_acceptance_does_not_wait_for_the_import_session_lock ... ok705test harvest::tests::members_cannot_read_own_project_rates_or_cost_overrides ... ok706test auth::oidc::tests::linking::different_subjects_cannot_both_claim_an_unlinked_account ... ok707test harvest::tests::harvest_effective_minutes_match_sql_for_open_and_frozen_time ... ok708test harvest::tests::harvest_entry_rates_follow_the_cascade_and_frozen_invoice_line ... ok709test auth::oidc::tests::linking::simultaneous_logins_with_the_same_subject_are_allowed ... ok710test importers::harvest::account_switch::tests::a_b_a_keeps_old_callbacks_requests_and_retries_fenced ... ok711test harvest::tests::a_manager_sees_the_whole_org ... ok712test harvest::tests::harvest_entry_rates_respect_selected_project_mode ... ok713test importers::harvest::account_switch::tests::running_jobs_block_change_and_old_execution_never_reaches_http ... ok714test cli::imports::tests::small_csv_upload_preserves_immediate_authorization_rejections ... ok715test importers::harvest::account_switch::tests::disconnect_and_reconnect_fence_callbacks_but_not_same_account_work ... ok716test importers::harvest::credentials::tests::another_account_cannot_replace_credentials_or_watermarks ... ok717test importers::harvest::account_switch::tests::competing_change_and_submission_cannot_both_succeed ... ok718test db::tests::reset_empties_the_database_and_reapplies_migrations ... ok719test importers::harvest::account_switch::tests::retry_and_change_are_serialized ... ok720test importers::harvest::account_switch::tests::competing_callbacks_and_confirmations_have_one_winner ... ok721test importers::harvest::engine_tests::api_and_csv_share_the_lock_but_other_organizations_can_import ... ok722test importers::harvest::credentials::tests::concurrent_first_connections_cannot_bind_different_accounts ... ok723test importers::harvest::credentials::tests::disconnect_preserves_identity_and_provenance_for_the_original_account ... ok724test importers::harvest::engine_tests::api_sync_adopts_entries_from_a_prior_csv_import ... ok725test importers::harvest::engine_tests::cancelled_http_waiter_keeps_the_lock_until_its_worker_exits ... ok726test importers::harvest::engine_tests::bad_records_are_reported_and_run_continues ... ok727test importers::harvest::credentials::tests::migration_binds_existing_connections_without_changing_secrets_or_markers ... ok728test importers::harvest::credentials::tests::connection_changes_work_with_a_single_connection_pool ... ok729test importers::harvest::credentials::tests::failed_credential_write_does_not_leave_an_account_binding ... ok730test importers::harvest::engine_tests::csv_name_fallback_requires_a_full_unique_name_and_never_overrides_email ... ok731test importers::harvest::engine_tests::csv_name_only_matches_one_org_user_and_reimports_without_duplicates ... ok732test importers::harvest::engine_tests::csv_streaming::measure_csv_durable_100k ... ignored, 100,000-row durable CSV measurement; run explicitly with --release --nocapture733test importers::harvest::engine_tests::csv_streaming::measure_csv_durable_large_catalog_100k ... ignored, 100,000-row durable CSV with 5,000 parent sets; run explicitly with --release --nocapture734test importers::harvest::engine_tests::csv_streaming::measure_csv_streaming_100k ... ignored, 100,000-row CSV measurement; run explicitly with --release --nocapture735test importers::harvest::engine_tests::csv_streaming::measure_csv_streaming_large_catalog_100k ... ignored, 100,000-row CSV with 5,000 parent sets; run explicitly with --release --nocapture736test importers::harvest::engine_tests::api_connection_checks_work_with_a_single_connection_pool ... ok737test importers::harvest::engine_tests::csv_import_populates_and_is_idempotent ... ok738test importers::harvest::engine_tests::csv_streaming::csv_applies_before_eof_but_transport_failure_rolls_back_everything ... ok739test importers::harvest::credentials::tests::connect_and_disconnect_share_import_exclusion_without_blocking_other_orgs ... ok740test importers::harvest::credentials::tests::same_account_reconnect_rotates_encryption_without_resetting_watermarks ... ok741test importers::harvest::engine_tests::csv_malformed_file_is_rejected_with_no_writes ... ok742test importers::harvest::credentials::tests::unidentified_legacy_provenance_requires_operator_review ... ok743test importers::harvest::engine_tests::csv_streaming::cancelling_a_csv_waiting_for_more_bytes_releases_its_session ... ok744test importers::harvest::engine_tests::concurrent_imports_reject_overlap_without_collapsing_repeated_entries ... ok745test importers::harvest::engine_tests::cancellation_rolls_back_rows_and_releases_the_import_session ... ok746test importers::harvest::credentials::authority_tests::connection_changes_hold_authority_until_commit ... ok747test importers::harvest::engine_tests::csv_ambiguous_names_include_inactive_users_but_unique_email_disambiguates ... ok748test importers::harvest::engine_tests::lookup_cache::cold_query_callsite_on_untraced_thread_is_still_captured ... ok749test importers::harvest::engine_tests::csv_name_only_dry_run_and_duplicate_occurrences_preserve_history ... ok750test importers::harvest::engine_tests::csv_streaming::csv_preview_errors_and_repeated_rows_match_commit_and_reimport ... ok751test importers::harvest::engine_tests::csv_streaming::csv_sql_backpressure_stops_reading_later_input_rows ... ok752test importers::harvest::engine_tests::full_import_creates_all_levels_with_exact_minutes ... ok753test importers::harvest::engine_tests::csv_streaming::durable_csv_cancel_preserves_its_completed_batches_for_manual_retry ... FAILED754test importers::harvest::engine_tests::lookup_cache::project_task_cache_distinguishes_both_sides_of_the_link ... ok755test importers::harvest::engine_tests::csv_streaming::durable_csv_stale_commit_is_fenced_without_a_heartbeat ... ok756test importers::harvest::engine_tests::lookup_cache::new_run_rechecks_previously_cached_user_for_ambiguity ... ok757test importers::harvest::engine_tests::lookup_cache::lookup_index_migration_preserves_existing_ambiguous_identities ... ok758test importers::harvest::engine_tests::import_cleanup_does_not_hide_a_backend_failure ... ok759test importers::harvest::engine_tests::import_rejects_ambiguous_normalized_email_without_partial_writes ... ok760test importers::harvest::engine_tests::dry_run_writes_nothing_and_matches_commit ... ok761test importers::harvest::oauth::tests::authorize_url_carries_state_and_encoded_redirect ... ok762test importers::harvest::oauth::tests::authorize_url_preserves_query_values_without_injecting_parameters ... ok763test importers::harvest::oauth_callback_tests::account_policy_failures_return_safe_actionable_conflicts ... ok764test importers::harvest::engine_tests::lookup_cache::cached_project_task_still_validates_each_rows_rate ... ok765test importers::harvest::oauth_callback_tests::mismatched_state_is_rejected_without_a_code ... ok766test importers::harvest::oauth_callback_tests::missing_returned_state_is_rejected ... ok767test importers::harvest::oauth_callback_tests::provider_error_is_rejected_before_exchange ... ok768test importers::harvest::oauth_callback_tests::missing_stored_state_is_rejected ... ok769test importers::harvest::oauth_callback_tests::revoked_callback_authority_returns_only_a_safe_forbidden_message ... ok770test importers::harvest::oauth_callback_tests::valid_matching_state_yields_the_code ... ok771test importers::harvest::oauth_callback_tests::valid_state_but_missing_code_is_rejected ... ok772test importers::harvest::report::tests::archive_metadata_cannot_masquerade_as_a_legacy_or_inconsistent_report ... ok773test importers::harvest::report::tests::archived_report_round_trips_without_losing_error_accounting ... ok774test importers::harvest::report::tests::legacy_report_preserves_its_counts_and_error_details ... ok775test importers::harvest::report::tests::serialized_report_has_a_supported_schema_version ... ok776test importers::harvest::report::tests::report_rejects_unsupported_and_invalid_versions ... ok777test importers::harvest::resolve::checkpoint_tests::run_cache_round_trip_preserves_identity_namespaces_and_occurrences ... ok778test importers::harvest::engine_tests::import_cleanup_rolls_back_an_untracked_server_transaction ... ok779test importers::harvest::engine_tests::import_cleanup_recovers_unacknowledged_savepoint_release ... ok780test importers::harvest::engine_tests::distinct_harvest_ids_with_identical_fields_import_as_two ... ok781test importers::harvest::engine_tests::edited_entry_still_matched_by_provenance ... ok782test importers::harvest::engine_tests::lookup_cache::cached_email_and_full_name_do_not_share_a_namespace ... ok783test importers::harvest::engine_tests::failed_source_releases_the_session_and_rolls_back_partial_rows ... ok784test harvest::pagination_tests::harvest_pagination_time_entries_keep_the_filtered_set_and_date_ties ... ok785test importers::harvest::engine_tests::completed_imports_allow_immediate_retries ... ok786test importers::harvest::engine_tests::csv_streaming::durable_csv_preview_cancel_preserves_simulation_for_manual_retry ... FAILED787test importers::harvest::engine_tests::csv_streaming::durable_csv_preview_rejects_a_stale_next_batch ... FAILED788test importers::harvest::engine_tests::csv_streaming::durable_csv_resumes_committed_batches_without_recounting_duplicate_rows ... FAILED789test importers::harvest::engine_tests::csv_streaming::durable_csv_cancel_joins_parser_and_preserves_committed_rows ... ok790test importers::harvest::engine_tests::natural_key_reimport_normalizes_whitespace_and_ascii_case ... ok791test importers::harvest::sync_tests::api_requires_email_even_when_full_name_matches ... ok792test importers::harvest::resolve::preview::tests::checkpoint_restores_known_task_currency_and_keeps_old_currency_unknown ... ok793test importers::harvest::engine_tests::csv_streaming::durable_csv_report_metadata_is_bounded_after_recovery ... ok794test importers::harvest::engine_tests::two_identical_csv_rows_import_as_two_entries ... ok795test importers::harvest::engine_tests::csv_streaming::durable_csv_preview_crosses_batch_boundaries_without_committing_domain_data ... ok796test importers::harvest::engine_tests::csv_streaming::durable_csv_waits_for_input_without_an_open_transaction ... FAILED797test importers::harvest::engine_tests::watermark_advances_only_on_commit ... ok798test importers::harvest::engine_tests::overflowing_decimals_fail_only_their_rows ... ok799test importers::harvest::engine_tests::second_identical_run_creates_nothing ... ok800test importers::harvest::sync_tests::checkpoints::durable_api_cancellation_preserves_confirmed_pages_for_manual_retry ... ok801test importers::harvest::resolve::preview::tests::rejects_foreign_parent_snapshots_before_restoring_any_rows ... ok802test importers::harvest::engine_tests::submission_barrier_blocks_imported_time_entries ... ok803test importers::harvest::sync_tests::api_rejects_ambiguous_email_without_advancing_watermark ... ok804test importers::harvest::engine_tests::lookup_cache::rolled_back_row_does_not_cache_user_or_project_task ... ok805test importers::harvest::streaming::tests::api_planning_policy_ends_with_the_transaction ... ok806test importers::harvest::streaming::durable::preview::tests::restoration_omits_unneeded_virtual_entries ... ok807test importers::harvest::engine_tests::reimporting_identical_csv_rows_is_idempotent ... ok808test importers::harvest::sync_tests::checkpoints::durable_api_finalization_retry_does_not_repeat_completed_downloads ... ok809test importers::harvest::sync_tests::checkpoints::durable_api_preview_cancellation_preserves_confirmed_pages_for_manual_retry ... ok810test importers::harvest::credentials::authority_tests::failed_connection_changes_roll_back_and_release_authority_and_reservation ... ok811test importers::harvest::sync_tests::checkpoints::durable_api_preview_finalization_retry_does_not_repeat_completed_downloads ... ok812test importers::harvest::engine_tests::csv_streaming::durable_csv_preview_resumes_after_a_crash_without_recounting_rows ... ok813test importers::harvest::sync_tests::checkpoints::durable_api_preview_preserves_adoptions_and_repeated_ids_across_recovery ... ok814test importers::harvest::sync_tests::empty_sync_does_not_invent_a_watermark ... ok815test importers::harvest::engine_tests::lookup_cache::repeated_rows_resolve_each_user_and_project_task_once ... ok816test importers::harvest::sync_tests::disconnect_and_reconnect_preserves_imported_records_and_exact_identity ... ok817test importers::harvest::sync_tests::checkpoints::durable_api_preview_resume_preserves_row_errors ... ok818test importers::harvest::sync_tests::checkpoints::durable_api_preview_reclaimed_worker_cannot_checkpoint_its_next_page ... ok819test importers::harvest::sync_tests::checkpoints::failed_api_commit_publishes_its_last_confirmed_page_report ... ok820test importers::harvest::sync_tests::scale::api_100k_commit_and_reimport ... ignored, 100,000-entry scale measurement; run explicitly with --release --nocapture821test importers::harvest::sync_tests::scale::api_100k_dry_run ... ignored, 100,000-entry scale measurement; run explicitly with --release --nocapture822test importers::harvest::sync_tests::scale::api_durable_100k_commit_and_reimport ... ignored, 100,000-entry durable API measurement; run explicitly with --release --nocapture823test importers::harvest::sync_tests::scale::api_durable_100k_dry_run ... ignored, 100,000-entry durable API measurement; run explicitly with --release --nocapture824test importers::harvest::sync_tests::failed_client_propagates_to_project_and_entry_without_placeholder_records ... ok825test importers::harvest::sync_tests::checkpoints::durable_api_resumes_committed_pages_and_preserves_the_high_watermark ... ok826test importers::harvest::sync_tests::checkpoints::failed_api_preview_publishes_its_last_confirmed_page_report ... ok827test importers::harvest::sync_tests::checkpoints::durable_api_preview_resumes_catalog_download ... ok828test importers::harvest::sync_tests::dry_run_leaves_data_provenance_and_watermark_unchanged ... ok829test importers::harvest::engine_tests::csv_streaming::durable_csv_discards_incomplete_preparation_and_resumes_its_checkpoint ... ok830test importers::harvest::sync_tests::checkpoints::durable_api_preview_resumes_pages_without_publishing_domain_data ... ok831test importers::harvest::credentials::tests::completed_credential_changes_allow_immediate_retries ... ok832test importers::harvest::sync_tests::invalid_parent_blocks_dependent_time_but_other_catalog_records_survive ... ok833test importers::harvest::sync_tests::checkpoints::durable_api_resumes_a_partially_downloaded_catalog ... ok834test harvest::pagination_tests::harvest_own_time_omits_private_project_budget_metadata has been running for over 60 seconds835test harvest::pagination_tests::harvest_pagination_catalog_links_preserve_filters_and_break_name_ties has been running for over 60 seconds836test harvest::pagination_tests::harvest_pagination_empty_and_out_of_range_pages_keep_the_contract has been running for over 60 seconds837test harvest::pagination_tests::harvest_pagination_malformed_filters_are_client_errors has been running for over 60 seconds838test harvest::pagination_tests::harvest_pagination_rejects_invalid_windows_on_every_collection has been running for over 60 seconds839test importers::harvest::sync_tests::checkpoints::durable_api_reclaimed_worker_cannot_commit_its_next_page ... ok840test importers::harvest::sync_tests::exact_api_decimals_survive_preview_commit_and_reimport ... ok841test harvest::pagination_tests::harvest_project_cost_overrides_require_admin_without_fabricated_fallback has been running for over 60 seconds842test harvest::pagination_tests::harvest_project_progress_permissions_cover_counts_pages_and_details has been running for over 60 seconds843test harvest::pagination_tests::harvest_task_access_filters_counts_and_preserves_rate_free_history has been running for over 60 seconds844test harvest::tests::imported_legacy_rates_survive_retry_in_harvest_list_and_detail has been running for over 60 seconds845test importers::harvest::sync_tests::missing_source_timestamp_keeps_the_previous_watermark ... ok846test importers::harvest::credentials::authority_tests::connection_changes_recheck_authority_after_actor_only_wait has been running for over 60 seconds847test importers::harvest::credentials::authority_tests::connection_changes_recheck_authority_after_organization_wait has been running for over 60 seconds848test importers::harvest::sync_tests::checkpoints::durable_api_resume_keeps_earlier_errors_and_does_not_advance_watermark ... ok849test importers::harvest::sync_tests::checkpoints::durable_api_resume_remembers_an_earlier_missing_timestamp ... ok850test importers::harvest::credentials::authority_tests::connection_changes_require_current_tenant_bound_administrator has been running for over 60 seconds851test importers::harvest::credentials::authority_tests::denied_first_connection_creates_no_binding_credentials_or_generation has been running for over 60 seconds852test importers::harvest::credentials::authority_tests::disconnected_noop_still_requires_authority has been running for over 60 seconds853test importers::harvest::sync_tests::failed_rows_are_available_to_the_next_incremental_retry ... ok854test importers::harvest::sync_tests::parent_catalog_preserves_metadata_and_counts_each_entity_once ... ok855test importers::harvest::sync_tests::watermark_never_passes_the_start_of_capture ... ok856test importers::harvest::sync_tests::out_of_range_api_decimals_error_per_row_and_leave_retry_watermark ... ok857test importers::harvest::sync_tests::paging::cancelled_page_consumer_retains_lock_until_worker_exits_and_rolls_back ... ok858test importers::harvest::sync_tests::paging::later_download_failure_rolls_back_parents_rows_and_watermark ... ok859test importers::harvest::sync_tests::paging::durable_api_cancel_waits_for_the_producer_before_acknowledging ... ok860test importers::harvest::sync_tests::paging::durable_api_stale_commit_cannot_advance_data_or_watermark ... ok861test importers::harvest::sync_tests::missing_client_fallback_and_failed_project_savepoints_do_not_poison_cache ... ok862test importers::harvest::sync_tests::parent_only_dry_run_previews_without_persisting_catalog ... ok863test importers::harvest::engine_tests::csv_streaming::durable_csv_reclaimed_lease_cannot_commit_the_next_batch ... ok864test init::tests::init_refuses_when_an_organization_exists ... ok865test importers::harvest::sync_tests::parent_only_api_import_creates_catalog_and_reimport_skips_it ... ok866test importers::harvest::sync_tests::refreshed_tokens_survive_a_dry_run_rollback_in_the_same_import_session ... ok867test importers::harvest::sync_tests::watermark_write_failure_rolls_back_imported_data ... ok868test importers::harvest::sync_tests::successful_sync_only_marks_the_incrementally_fetched_entity ... ok869test importers::harvest::credentials::authority_tests::connection_changes_require_current_tenant_bound_administrator ... ok870test init::tests::init_creates_one_org_and_one_admin_and_nothing_else ... ok871test jobs::tests::cancellation_and_retry_are_scoped_and_idempotent ... ok872test importers::harvest::sync_tests::checkpoints::durable_api_preview_resumes_after_a_confirmed_parent_batch ... ok873test jobs::tests::claims_are_atomic_and_expired_leases_recover ... ok874test importers::harvest::credentials::authority_tests::connection_changes_recheck_authority_after_actor_only_wait ... ok875test importers::harvest::sync_tests::checkpoints::durable_api_resumes_after_a_confirmed_parent_batch ... ok876test importers::harvest::engine_tests::csv_streaming::csv_measurement_recovers_a_complete_batch_without_recounting has been running for over 60 seconds877test importers::harvest::sync_tests::scale::http_pages_preview_commit_and_reimport ... ok878test importers::harvest::engine_tests::csv_streaming::durable_csv_preview_matches_existing_and_new_rows_with_one_connection ... FAILED879test importers::harvest::sync_tests::paging::invalid_and_missing_timestamp_rows_cross_page_boundaries_without_advancing ... ok880test importers::harvest::engine_tests::large_run_reuses_parents_and_reconciles_totals ... ok881test jobs::report::tests::upgrading_legacy_reports_preserves_errors_and_fences_old_attempts ... ok882test jobs::report::tests::concurrent_legacy_converters_archive_each_error_once ... ok883test jobs::tests::history_paginates_tied_timestamps_and_rejects_foreign_cursors ... ok884test jobs::report::stream_tests::download_denies_revocation_before_first_page_and_inline_tail ... ok885test importers::harvest::engine_tests::csv_streaming::csv_measurement_recovers_a_complete_batch_without_recounting ... ok886test jobs::tests::cancellation_survives_a_crash_before_the_worker_acknowledges ... ok887test importers::harvest::sync_tests::scale::durable_measurement_finishes_from_its_eof_checkpoint ... ok888test jobs::outbox::tests::invalid_payload_is_not_delivered_and_does_not_leak_into_errors ... ok889test jobs::tests::outbox_delivery_is_idempotent ... ok890test jobs::tests::outbox_rollback_does_not_publish_an_event ... ok891test importers::harvest::credentials::authority_tests::denied_first_connection_creates_no_binding_credentials_or_generation ... ok892test jobs::tests::payload_kind_is_stable_and_round_trips ... ok893test jobs::tests::payload_versions_preserve_legacy_jobs_and_reject_unknown_versions ... ok894test jobs::tests::cancellation_waits_for_the_claimed_execution_before_allowing_retry ... ok895test jobs::tests::retry_snapshot_does_not_guess_unknown_payloads_or_sources ... ok896test importers::harvest::sync_tests::scale::durable_api_report_preserves_overflow_errors_after_recovery has been running for over 60 seconds897test jobs::outbox::tests::acknowledges_confirmed_delivery_without_reclaiming_it has been running for over 60 seconds898test jobs::outbox::tests::plugin_failure_retries_with_the_same_event_identity has been running for over 60 seconds899test jobs::outbox::tests::worker_delivers_available_events_and_stops_cleanly has been running for over 60 seconds900test jobs::tests::outbox_same_kind_consumers_cannot_claim_the_same_lease ... ok901test jobs::tests::shutdown_deadline_drops_and_joins_in_flight_work ... ok902test jobs::tests::shutdown_waits_for_in_flight_work ... ok903test jobs::report::stream_tests::download_boundaries_recheck_after_organization_and_actor_waits has been running for over 60 seconds904test jobs::report::stream_tests::download_keeps_its_snapshot_when_later_progress_archives_the_inline_tail has been running for over 60 seconds905test jobs::report::stream_tests::download_preparation_denies_revoked_authority has been running for over 60 seconds906test jobs::tests::retry_snapshot_matches_status_and_list_without_exposing_payload ... ok907test jobs::report::stream_tests::download_preparation_is_tenant_bound_and_releases_failed_transactions has been running for over 60 seconds908test jobs::report::stream_tests::download_readers_retain_authority_through_their_bounded_reads has been running for over 60 seconds909test jobs::report::stream_tests::download_reads_only_when_consumed_and_releases_its_connection has been running for over 60 seconds910test jobs::report::stream_tests::download_rechecks_after_buffered_pages_and_before_the_captured_tail has been running for over 60 seconds911test importers::harvest::sync_tests::scale::durable_api_report_preserves_overflow_errors_after_recovery ... ok912test jobs::report::stream_tests::download_reports_missing_fragments_after_its_buffered_page has been running for over 60 seconds913test jobs::report::tests::legacy_converter_gate_allows_a_job_locked_workers_chunk_foreign_keys has been running for over 60 seconds914test jobs::report::tests::legacy_converter_rediscovers_after_candidate_deletion has been running for over 60 seconds915test jobs::report::tests::legacy_converter_uses_replaced_payload_after_waiting has been running for over 60 seconds916test jobs::tests::final_failure_is_retained_and_manual_retry_gets_a_new_budget ... ok917test jobs::report::tests::legacy_upgrade_preserves_a_concurrently_archived_workers_lease has been running for over 60 seconds918test jobs::report::tests::legacy_upgrade_preserves_job_states_and_existing_archives has been running for over 60 seconds919test jobs::report::tests::report_fragments_survive_until_the_owning_job_expires has been running for over 60 seconds920test jobs::tests::api_job_keeps_its_policy_across_duplicate_enqueue_and_manual_retry has been running for over 60 seconds921test jobs::tests::cleanup_retains_retryable_uploads_and_deletes_expired_jobs has been running for over 60 seconds922test jobs::tests::concurrent_csv_resubmission_preserves_identity_after_upload_cleanup has been running for over 60 seconds923test jobs::tests::synthetic_job_executes_through_claim_and_completion ... ok924test jobs::tests::synthetic_job_uses_the_same_registered_envelope ... ok925test jobs::tests::csv_job_persists_its_policy_with_the_upload has been running for over 60 seconds926test jobs::tests::expired_final_attempt_fails_without_claiming_again has been running for over 60 seconds927test jobs::report::tests::legacy_converter_rediscovers_after_candidate_deletion ... ok928test models::project_creation::tests::draft_roundtrip_preserves_incomplete_input_without_demo_data ... ok929test models::project_creation::tests::unauthorized_catalog_cost_is_absent_from_serialized_options ... ok930test models::project_creation::tests::unknown_draft_fields_are_rejected ... ok931test models::project_managers::tests::command_preserves_durable_intent_and_strictly_decodes_its_discriminator ... ok932test models::time_entry::tests::time_entry_wire_does_not_accept_invoice_identity_from_input ... ok933test models::time_entry::tests::time_entry_wire_omits_invoice_identity_without_mutating_internal_record ... ok934test jobs::tests::expired_lease_cannot_renew_or_commit_using_an_old_transaction_timestamp has been running for over 60 seconds935test jobs::tests::expired_final_attempt_fails_without_claiming_again ... ok936test jobs::tests::failed_csv_commit_retains_confirmed_report_through_history_and_retry has been running for over 60 seconds937test jobs::tests::upload_organization_must_match_its_job ... ok938test notifications::tests::acknowledged_email_is_never_claimed_again ... ok939test jobs::tests::failed_csv_preview_retains_confirmed_report_through_history_and_retry has been running for over 60 seconds940test jobs::tests::import_adapters_reject_a_lease_from_another_organization has been running for over 60 seconds941test notifications::tests::authority::budget_delivery_observes_winning_activation_and_alert_enable ... ok942test jobs::tests::missing_configuration_records_error_and_requeues ... ok943test jobs::tests::invalid_policy_cannot_enqueue_a_job_or_upload has been running for over 60 seconds944test jobs::tests::invalid_stored_payloads_reach_a_terminal_error has been running for over 60 seconds945test notifications::tests::authority::budget_delivery_rejects_missing_settings_without_waiting_on_child_locks ... ok946test notifications::tests::authority::budget_delivery_rechecks_claim_and_clock_after_final_wait ... ok947test notifications::tests::authority::budget_delivery_refreshes_after_recipient_and_project_waits ... ok948test jobs::tests::invalid_stored_payloads_reach_a_terminal_error ... ok949test notifications::tests::authority::budget_delivery_releases_all_gates_before_blocked_transport ... ok950test notifications::tests::authority::budget_delivery_skips_notification_appearing_after_discovery ... ok951test jobs::tests::missing_csv_upload_records_error_and_requeues has been running for over 60 seconds952test notifications::tests::authority::budget_delivery_skips_retargeted_notification_without_terminalizing ... ok953test notifications::tests::authority::budget_delivery_terminal_rejections_preserve_existing_reasons ... ok954test jobs::tests::outbox_claims_only_the_requested_event_kind has been running for over 60 seconds955test notifications::tests::authority::budget_delivery_skips_project_drift_or_disappearance ... ok956test notifications::tests::cancelling_delivery_kills_the_active_sender ... ok957test notifications::tests::authority::budget_delivery_uses_current_payload_after_recipient_wait ... ok958test jobs::report::stream_tests::download_reports_missing_fragments_after_its_buffered_page ... ok959test notifications::tests::authority::budget_preparation_cancellation_and_deadline_release_single_connection ... ok960test notifications::tests::mail_configuration_is_disabled_by_default_and_rejects_partial_values ... ok961test notifications::tests::mail_configuration_requires_an_executable_file_and_safe_sender ... ok962test notifications::tests::authority::budget_delivery_waits_for_organization_and_rechecks_recipient ... ok963test notifications::tests::recipient_injection_is_rejected_before_starting_a_process ... ok964test notifications::tests::rendered_mail_bounds_body_lines_for_long_unicode_and_control_names ... ok965test jobs::tests::outbox_stale_claims_cannot_acknowledge_or_reschedule_delivery has been running for over 60 seconds966test notifications::tests::authority::budget_preparation_overrides_read_only_without_leaking_transaction_settings ... ok967test notifications::tests::disabled_mail_worker_does_not_claim_pending_notifications ... ok968test jobs::tests::import_adapters_reject_a_lease_from_another_organization ... ok969test notifications::tests::sendmail_failure_does_not_expose_program_output ... ok970test notifications::tests::sendmail_receives_fixed_arguments_and_stable_message_identity ... ok971test notifications::tests::sendmail_timeout_kills_and_reaps_the_child ... ok972test notifications::tests::verbose_sender_output_is_discarded_without_blocking_delivery ... ok973test pages::clients::filters::tests::clearing_query_preserves_selected_currency_and_lifecycle ... ok974test pages::clients::filters::tests::lifecycle_counts_share_query_and_currency_filters ... ok975test pages::clients::filters::tests::name_search_ignores_case_and_surrounding_whitespace ... ok976test pages::clients::filters::tests::preferred_or_visible_project_currency_matches_but_query_still_applies ... ok977test pages::clients::form::tests::absent_billing_authority_never_produces_an_edit_payload ... ok978test pages::clients::form::tests::ambiguous_creation_errors_require_explicit_recovery ... ok979test pages::clients::form::tests::clearing_a_rate_is_explicit_and_needs_no_currency_confirmation ... ok980test pages::clients::form::tests::invalid_fields_are_not_rewritten_by_validation ... ok981test pages::clients::form::tests::rate_replacement_requires_confirmation_in_the_current_currency ... ok982test pages::clients::form::tests::untouched_fields_keep_zero_rate_and_original_snapshot ... ok983test pages::importers::presentation::tests::interrupted_report_is_partial_regardless_of_retry_prerequisites ... ok984test pages::importers::presentation::tests::no_selection_does_not_claim_no_import_history ... ok985test pages::importers::presentation::tests::source_labels_do_not_guess_unknown_importers ... ok986test pages::importers::presentation::tests::states_and_phases_have_readable_unknown_fallbacks ... ok987test pages::importers::presentation::tests::summaries_distinguish_zero_skipped_and_mixed_outcomes ... ok988test pages::invoices::defaults_form::tests::invoice_fields_bound_metadata_by_characters_and_reject_nul ... ok989test pages::invoices::defaults_form::tests::invoice_fields_preserve_exact_percentages_and_custom_terms ... ok990test pages::invoices::defaults_form::tests::invoice_fields_preserve_receipt_terms_and_empty_optional_percentages ... ok991test pages::invoices::defaults_form::tests::invoice_fields_reject_invalid_percentages_terms_and_second_tax ... ok992test pages::invoices::preparation::fees::tests::fee_inputs_require_exact_amounts_and_an_explicit_positive_charge ... ok993test pages::invoices::preparation::fees::tests::refresh_keeps_raw_edits_and_does_not_select_new_sources ... ok994test pages::invoices::preparation::fees::tests::refresh_preserves_missing_or_relabelled_edits_until_explicit_removal ... ok995test pages::invoices::preparation::tests::invoice_context_selects_only_the_exact_available_client ... ok996test pages::invoices::preparation::tests::invoice_review_requires_matching_sources_and_valid_values ... ok997test pages::invoices::preparation::tests::unavailable_or_malformed_invoice_context_never_uses_the_first_client ... ok998test pages::new_project::basics::tests::a_batch_that_would_exceed_the_tag_limit_is_rejected ... ok999test pages::new_project::basics::tests::a_full_tag_list_still_accepts_a_duplicate ... ok1000test pages::new_project::basics::tests::overlong_tags_are_rejected_without_truncation ... ok1001test pages::new_project::basics::tests::tag_length_counts_characters_instead_of_bytes ... ok1002test pages::new_project::basics::tests::tags_trim_and_deduplicate_without_changing_existing_spelling ... ok1003test notifications::tests::failed_email_retries_same_identity_and_eventually_stops ... ok1004test pages::new_project::draft::tests::a_mismatched_acknowledgement_does_not_lose_pending_input ... ok1005test pages::new_project::draft::tests::a_retry_keeps_the_unacknowledged_payload_and_revision ... ok1006test pages::new_project::draft::tests::a_validation_rejection_allows_corrected_input_at_the_same_revision ... ok1007test pages::new_project::draft::tests::an_empty_form_is_not_reported_as_saved ... ok1008test pages::new_project::draft::tests::any_saved_draft_wins_over_context_including_empty_or_matching_client ... ok1009test pages::new_project::draft::tests::context_prefills_only_a_new_form_without_fixing_its_currency ... ok1010test pages::new_project::draft::tests::resuming_preserves_the_server_identity_and_incomplete_fields ... ok1011test pages::new_project::team::tests::adding_everyone_deduplicates_without_replacing_project_overrides ... ok1012test pages::new_project::team::tests::exceeding_the_team_limit_does_not_partially_add_people ... ok1013test pages::new_project::team::tests::removing_a_member_keeps_an_empty_restricted_task_restricted ... ok1014test pages::new_project::tests::a_rejected_creation_can_be_edited_but_an_uncertain_commit_must_be_retried ... ok1015test pages::new_project::tests::only_known_validation_fields_can_target_a_control ... ok1016test pages::projects::budget_display_tests::configured_scopes_sum_without_hiding_an_individual_overrun ... ok1017test pages::projects::budget_display_tests::display_preserves_units_sign_and_large_integer_values ... ok1018test pages::projects::budget_display_tests::tag_filter_matches_identity_without_duplicates_or_name_collisions ... ok1019test pages::projects::budget_display_tests::unallocated_zero_and_overflow_budgets_are_not_conflated ... ok1020test pages::reports::tests::cost_total_uses_organization_currency_across_billing_currencies ... ok1021test pages::reports::tests::mixed_currencies_are_not_added_even_when_the_numbers_would_overflow ... ok1022test pages::reports::tests::monetary_total_overflow_is_visible_instead_of_panicking ... ok1023test pages::reports::tests::redacted_costs_do_not_become_zero_or_partial_totals ... ok1024test pages::reports::tests::single_currency_totals_are_formatted_and_empty_reports_have_no_amount ... ok1025test pages::settings::own_permissions::tests::own_permissions_view_admin_identity_is_explicit_not_derived_from_grants ... ok1026test pages::settings::own_permissions::tests::own_permissions_view_distinguishes_authentication_forbidden_and_failure ... ok1027test pages::settings::own_permissions::tests::own_permissions_view_does_not_disclose_internal_fields_or_offer_edits ... ok1028test pages::settings::own_permissions::tests::own_permissions_view_empty_grants_are_not_normalized ... ok1029test pages::settings::own_permissions::tests::own_permissions_view_grants_do_not_promise_unavailable_features ... ok1030test pages::settings::own_permissions::tests::own_permissions_view_legacy_is_not_empty_or_a_profile ... ok1031test pages::settings::own_permissions::tests::own_permissions_view_loading_hides_previous_snapshot ... ok1032test pages::settings::own_permissions::tests::own_permissions_view_preserves_exact_grants_without_profile_inference ... ok1033test pages::settings::own_permissions::tests::own_permissions_view_unsupported_catalog_hides_uninterpretable_grants ... ok1034test pages::timesheet::tests::cal_span_day_shows_only_the_anchor_column ... ok1035test pages::timesheet::tests::cal_span_defaults_to_week ... ok1036test pages::timesheet::tests::cal_span_unknown_falls_back_to_week ... ok1037test pages::timesheet::tests::cal_span_url_roundtrips ... ok1038test pages::timesheet::tests::cal_span_week_shows_all_seven_days ... ok1039test pages::timesheet::tests::cal_span_work_week_preserves_date_order_across_weekends ... ok1040test pages::timesheet::tests::cal_span_work_week_shows_monday_to_friday ... ok1041test pages::timesheet::tests::cal_span_work_week_skips_sunday_when_it_is_the_first_column ... ok1042test pages::timesheet::tests::day_col_class_marks_today ... ok1043test pages::timesheet::tests::day_col_class_marks_weekend ... ok1044test pages::timesheet::tests::day_col_class_plain_weekday ... ok1045test pages::timesheet::tests::day_col_class_today_wins_over_weekend ... ok1046test pages::timesheet::tests::invalid_duration_cannot_start_a_timer_save_or_clear_a_cell ... ok1047test pages::timesheet::tests::only_a_blank_duration_can_start_an_eligible_timer ... ok1048test pages::timesheet::tests::timed_lanes_still_widens_overlapping_entries ... ok1049test pages::timesheet::tests::timed_lanes_terminates_on_a_zero_length_entry ... ok1050test pages::timesheet::tests::today_offset_is_none_after_the_week ... ok1051test pages::timesheet::tests::today_offset_is_none_before_the_week ... ok1052test pages::timesheet::tests::today_offset_is_six_on_the_sunday ... ok1053test pages::timesheet::tests::today_offset_is_zero_on_the_monday ... ok1054test pages::new_project::billing::tests::budget_errors_target_a_control_that_can_be_corrected ... ok1055test pages::timesheet::tests::value_cell_class_empty_wins_over_today ... ok1056test pages::timesheet::tests::value_cell_class_marks_today_when_nonzero ... ok1057test pages::timesheet::tests::weekend_style_follows_the_date_not_the_column_offset ... ok1058test pages::timesheet::tests::weekly_duration_edit_preserves_nine_am_start_notes_and_billability ... ok1059test pages::timesheet::tests::weekly_new_entries_are_untimed_and_explicit_clears_still_work ... ok1060test notifications::tests::foreign_notification_payload_is_terminal_and_never_sent ... ok1061test notifications::tests::retry_can_recover_without_changing_message_identity ... ok1062test notifications::tests::mail_worker_delivers_only_its_kind_and_drains_cleanly ... ok1063test jobs::tests::reclaimed_attempt_rejects_stale_results_even_with_the_same_worker_name has been running for over 60 seconds1064test jobs::tests::stopped_worker_leaves_queued_jobs_unclaimed ... ok1065test notifications::tests::revoked_recipient_does_not_receive_a_pending_email ... ok1066test notifications::tests::stale_email_lease_cannot_start_delivery ... ok1067test plugin::database::tests::reader_cannot_have_access_to_credentials ... ok1068test plugin::event::tests::active_transition_fires_only_on_a_real_flip ... ok1069test plugin::event::tests::budget_and_timer_events_serialize ... ok1070test plugin::event::tests::new_events_have_stable_hook_names ... ok1071test plugin::event::tests::project_membership_payload_excludes_private_configuration ... ok1072test plugin::event::tests::role_change_event_carries_previous_role ... ok1073test plugin::event::tests::submission_event_serializes_payload ... ok1074test plugin::event::tests::us2_events_have_stable_hook_names ... ok1075test plugin::database::tests::reader_cannot_execute_security_definer_functions ... ok1076test jobs::outbox::tests::worker_delivers_available_events_and_stops_cleanly ... ok1077test plugin::host::tests::config_lookup::an_unset_key_is_none ... ok1078test plugin::host::tests::config_lookup::a_set_key_is_returned ... ok1079test plugin::database::tests::dedicated_reader_is_accepted_but_new_write_grants_are_rejected ... ok1080test plugin::database::tests::reader_cannot_switch_into_another_role ... ok1081test plugin::database::tests::project_configuration_is_private_even_when_plugin_grants_are_misconfigured ... ok1082test plugin::host::tests::database_tests::unconfigured_sql_never_falls_back_to_application_state ... ok1083test plugin::database::tests::reader_accepts_optional_first_party_rounding_helper ... ok1084test plugin::host::tests::response_shaping::error_json_wraps_the_message ... ok1085test plugin::database::tests::application_database_owner_is_not_a_plugin_identity ... ok1086test plugin::host::tests::response_shaping::http_response_carries_status_and_body ... ok1087test plugin::host::tests::response_shaping::http_body_accepts_the_size_limit_and_rejects_larger_responses ... ok1088test plugin::host::tests::statement_is_read_only::a_cte_select_is_allowed ... ok1089test plugin::host::tests::response_shaping::invalid_http_utf8_is_an_error_not_an_empty_success ... ok1090test plugin::host::tests::statement_is_read_only::a_second_statement_is_rejected ... ok1091test plugin::host::tests::statement_is_read_only::a_single_trailing_semicolon_is_allowed ... ok1092test plugin::host::tests::statement_is_read_only::a_write_hidden_behind_a_comment_is_rejected ... ok1093test plugin::host::tests::statement_is_read_only::plain_select_is_allowed ... ok1094test plugin::host::tests::statement_is_read_only::writes_are_rejected ... ok1095test plugin::host::tests::wrap_select::strips_a_trailing_semicolon_before_wrapping ... ok1096test plugin::host::tests::wrap_select::wraps_as_a_bounded_row_query ... ok1097test plugin::manifest::tests::config_defaults_to_empty_when_absent ... ok1098test plugin::manifest::tests::accepts_all_published_business_events ... ok1099test plugin::manifest::tests::parse_valid_manifest ... ok1100test plugin::manifest::tests::reject_empty_hooks ... ok1101test plugin::manifest::tests::reject_unknown_hook ... ok1102test plugin::manifest::tests::parses_optional_config_table ... ok1103test jobs::tests::submission_key_cannot_change_api_mode_or_scope has been running for over 60 seconds1104test plugin::host::tests::database_queries_preserve_parameters_and_rollback_session_settings ... ok1105test jobs::tests::submission_key_cannot_change_csv_bytes_or_mode has been running for over 60 seconds1106test jobs::tests::outbox_stale_claims_cannot_acknowledge_or_reschedule_delivery ... ok1107test plugin::database::tests::reader_rejects_unapproved_invoker_functions ... ok1108test plugin::host::tests::database_tests::query_discards_session_advisory_locks ... ok11091110running 1 test1111test plugin::registry::tests::initialization::guest_initializers_have_an_engine_instruction_budget ... ok11121113test result: ok. 1 passed; 0 failed; 0 ignored; 0 measured; 1165 filtered out; finished in 1.84s11141115test plugin::host::tests::database_tests::select_cannot_write_or_gain_application_privileges ... ok11161117running 1 test1118test plugin::registry::tests::initialization::instruction_budget_is_replenished_for_each_call ... ok1119test plugin::registry::tests::initialization::guest_initializers_have_an_engine_instruction_budget ... ok11201121test result: ok. 1 passed; 0 failed; 0 ignored; 0 measured; 1165 filtered out; finished in 1.79s112211231124running 1 test1125test plugin::registry::tests::collect_widgets_from_echo_plugin ... ok1126test plugin::registry::tests::isolation::cancelling_a_waiter_keeps_capacity_reserved_until_the_host_call_exits ... ok1127test plugin::host::tests::a_query_cannot_disable_its_own_deadline ... ok1128test plugin::registry::tests::isolation::confirmed_dispatch_returns_overload_for_retry ... ok1129test plugin::registry::tests::isolation::confirmed_dispatch_attempts_other_plugins_after_one_fails ... ok1130test plugin::registry::tests::dispatch_event_with_no_subscribers ... ok1131test plugin::registry::tests::isolation::confirmed_dispatch_returns_plugin_failure_for_retry ... ok1132test plugin::registry::tests::isolation::confirmed_dispatch_waits_for_the_plugin_to_finish ... ok1133test plugin::registry::tests::isolation::different_plugins_share_the_running_call_limit ... ok1134test plugin::registry::tests::isolation::events_execute_outside_the_async_worker ... ok1135test harvest::tests::imported_legacy_rates_survive_retry_in_harvest_list_and_detail ... ok1136test plugin::registry::tests::initialization::guest_initializers_have_an_engine_instruction_budget ... ok11371138test result: ok. 1 passed; 0 failed; 0 ignored; 0 measured; 1165 filtered out; finished in 1.36s11391140test plugin::registry::tests::isolation::loaded_plugins_cannot_start_with_excessive_memory ... ok11411142running 1 test1143test plugin::host::tests::database_tests::query_results_are_bounded_without_silent_truncation ... ok1144test plugin::registry::tests::isolation::oversized_wasm_output_is_rejected_before_copying_it ... ok1145test plugin::registry::tests::isolation::oversized_event_payloads_are_not_queued ... ok1146test plugin::registry::tests::load_empty_directory ... ok1147test plugin::registry::tests::isolation::widgets_execute_outside_the_async_worker ... ok1148test plugin::registry::tests::load_nonexistent_directory ... ok1149test plugin::registry::tests::isolation::pending_capacity_rejects_new_work_without_spawning_tasks ... ok1150test reports::bounded::tests::cancelled_export_keeps_its_slot_until_the_renderer_exits ... ok1151test reports::bounded::tests::export_admission_stays_reserved_until_the_body_is_dropped ... ok1152test reports::bounded::tests::output_budget_checks_writes_and_seeks_without_truncation ... ok1153test plugin::registry::tests::isolation::loaded_plugins_cannot_grow_memory_past_the_limit ... ok1154test reports::bounded::tests::export_rendering_runs_off_the_async_worker ... ok1155test reports::bounded::tests::rendered_output_limit_rejects_oversized_files_and_releases_admission ... ok1156test reports::bounded::tests::renderer_errors_and_panics_release_admission ... ok1157test plugin::registry::tests::dispatch_to_echo_plugin_succeeds ... ok1158test plugin::registry::tests::failing_plugin_does_not_block_caller ... ok1159test plugin::registry::tests::load_test_plugins ... ok1160test plugin::host::tests::database_tests::wasm_host_uses_the_restricted_connection_on_a_current_thread_runtime ... ok1161test plugin::registry::tests::initialization::guest_initializers_have_an_engine_instruction_budget ... ok11621163test result: ok. 1 passed; 0 failed; 0 ignored; 0 measured; 1165 filtered out; finished in 1.33s11641165test reports::bounded::tests::timed_out_export_keeps_its_slot_until_the_renderer_exits ... ok1166test plugin::registry::tests::initialization::guest_initializers_have_an_engine_instruction_budget ... ok1167test plugin::registry::tests::dispatch_invoice_sent_to_echo_plugin ... ok1168test render::tests::invoice_template_formats_large_minor_units_exactly ... ok1169test plugin::registry::tests::isolation::a_wasm_timeout_releases_the_worker_and_instance ... ok1170test jobs::tests::concurrent_csv_resubmission_preserves_identity_after_upload_cleanup ... ok1171test jobs::outbox::tests::acknowledges_confirmed_delivery_without_reclaiming_it ... ok1172test harvest::pagination_tests::harvest_pagination_rejects_invalid_windows_on_every_collection ... ok1173test reports::limits::tests::bounded_entries_reject_large_fields_and_combined_text ... ok1174test jobs::tests::api_job_keeps_its_policy_across_duplicate_enqueue_and_manual_retry ... ok1175test jobs::report::stream_tests::download_preparation_denies_revoked_authority ... ok1176test jobs::tests::outbox_claims_only_the_requested_event_kind ... ok1177test reports::limits::tests::authorization::materialized_exports_retain_authority_and_release_cancelled_reads ... ok1178test reports::limits::tests::measure_bounded_export_limits ... ignored, manual release export measurement; set HORAE_EXPORT_PROBE_DIR for artifacts1179test jobs::report::stream_tests::download_reads_only_when_consumed_and_releases_its_connection ... ok1180test harvest::pagination_tests::harvest_task_access_filters_counts_and_preserves_rate_free_history ... ok1181test reports::limits::tests::authorization::materialized_exports_deny_revoked_managers has been running for over 60 seconds1182test reports::limits::tests::authorization::materialized_exports_deny_winning_legacy_revocations has been running for over 60 seconds1183test reports::limits::tests::authorization::materialized_exports_keep_deadlines_and_restore_pool_defaults has been running for over 60 seconds1184test reports::limits::tests::authorization::materialized_exports_preserve_checked_snapshots has been running for over 60 seconds1185test reports::limits::tests::authorization::materialized_exports_recheck_after_render_without_retaining_authority has been running for over 60 seconds1186test reports::limits::tests::authorization::materialized_exports_refresh_after_access_revision_change has been running for over 60 seconds1187test reports::limits::tests::authorization::materialized_exports_release_rendered_body_when_final_check_is_interrupted has been running for over 60 seconds1188test reports::limits::tests::authorization::materialized_exports_require_same_tenant_active_actor has been running for over 60 seconds1189test reports::limits::tests::bounded_entries_enforce_the_row_limit_after_all_filters has been running for over 60 seconds1190test reports::limits::tests::bounded_exports_preserve_real_workbooks_and_deterministic_pdf has been running for over 60 seconds1191test reports::limits::tests::authorization::materialized_exports_refresh_after_access_revision_change ... ok1192test reports::limits::tests::bounded_invoice_limits_include_branding_and_preserve_tenant_scope has been running for over 60 seconds1193test reports::limits::tests::authorization::materialized_exports_release_rendered_body_when_final_check_is_interrupted ... ok1194test reports::limits::tests::bounded_projects_filter_archives_before_size_checks has been running for over 60 seconds1195test reports::limits::tests::export_queries_are_read_only_and_have_a_database_deadline has been running for over 60 seconds1196test jobs::report::stream_tests::download_boundaries_recheck_after_organization_and_actor_waits ... ok1197test reports::limits::tests::export_size_checks_and_reads_share_a_repeatable_read_snapshot has been running for over 60 seconds1198test jobs::tests::csv_job_persists_its_policy_with_the_upload ... ok1199test jobs::report::tests::legacy_upgrade_preserves_job_states_and_existing_archives ... ok1200test reports::limits::tests::fee_exports_preserve_absent_quantities_and_render_a_real_pdf has been running for over 60 seconds1201test jobs::tests::missing_csv_upload_records_error_and_requeues ... ok1202test reports::limits::tests::invoice_exports_show_saved_adjustments_and_exact_large_amounts has been running for over 60 seconds1203test reports::limits::tests::project_authorization::project_exports_release_every_captured_project_without_render_locks ... ok1204test harvest::pagination_tests::harvest_pagination_malformed_filters_are_client_errors ... ok1205test reports::limits::tests::project_authorization::project_exports_bound_rows_and_text_after_scope_filtering has been running for over 60 seconds1206test reports::limits::tests::bounded_exports_preserve_real_workbooks_and_deterministic_pdf ... ok1207test reports::limits::tests::project_authorization::project_exports_share_one_size_and_payload_snapshot ... ok1208test reports::limits::tests::project_authorization::project_exports_cancel_loading_without_retaining_authority has been running for over 60 seconds1209test jobs::report::tests::report_fragments_survive_until_the_owning_job_expires ... ok1210test reports::limits::tests::project_authorization::project_exports_deny_actor_revoked_during_either_authority_wait has been running for over 60 seconds1211test reports::limits::tests::bounded_invoice_limits_include_branding_and_preserve_tenant_scope ... ok1212test reports::limits::tests::project_authorization::project_exports_deny_actor_revoked_during_either_authority_wait ... ok1213test importers::harvest::credentials::authority_tests::disconnected_noop_still_requires_authority ... ok1214test reports::limits::tests::project_authorization::project_exports_preserve_membership_visibility_and_history_rules has been running for over 60 seconds1215test reports::limits::tests::authorization::materialized_exports_deny_winning_legacy_revocations ... ok1216test reports::limits::tests::project_authorization::project_exports_refresh_release_scope_after_parent_wait has been running for over 60 seconds1217test jobs::report::stream_tests::download_keeps_its_snapshot_when_later_progress_archives_the_inline_tail ... ok1218test reports::limits::tests::project_authorization::project_exports_refresh_scope_after_winning_relationship_changes has been running for over 60 seconds1219test reports::limits::tests::project_authorization::project_exports_reject_missing_foreign_and_unreadable_captured_ids has been running for over 60 seconds1220test reports::streaming::database_tests::authorization::streamed_cancelled_fetch_reclaims_connection_without_authority_locks ... ok1221test reports::limits::tests::project_authorization::project_exports_release_cancelled_and_timed_out_checks has been running for over 60 seconds1222test reports::limits::tests::tag_filter_applies_before_xlsx_size_checks_and_rendering ... ok1223test reports::limits::tests::project_authorization::project_exports_require_current_tenant_bound_actor has been running for over 60 seconds1224test reports::limits::tests::project_authorization::project_exports_retain_parent_authority_until_release_check_finishes has been running for over 60 seconds1225test reports::limits::tests::fee_exports_preserve_absent_quantities_and_render_a_real_pdf ... ok1226test reports::privacy_tests::project_downloads_follow_progress_visibility has been running for over 60 seconds1227test jobs::report::stream_tests::download_preparation_is_tenant_bound_and_releases_failed_transactions ... ok1228test reports::privacy_tests::unauthorized_project_text_does_not_affect_export_size_limits has been running for over 60 seconds1229test reports::streaming::database_tests::a_real_database_error_interrupts_the_csv_body has been running for over 60 seconds1230test reports::streaming::database_tests::authorization::streamed_authority_releases_successful_locks_and_overrides_inherited_settings has been running for over 60 seconds1231test reports::streaming::database_tests::authorization::streamed_cancelled_authorization_reclaims_its_single_connection has been running for over 60 seconds1232test importers::harvest::credentials::authority_tests::connection_changes_recheck_authority_after_organization_wait ... ok1233test reports::limits::tests::invoice_exports_show_saved_adjustments_and_exact_large_amounts ... ok1234test reports::limits::tests::project_authorization::project_exports_refresh_release_scope_after_parent_wait ... ok1235test jobs::report::stream_tests::download_readers_retain_authority_through_their_bounded_reads ... ok1236test reports::streaming::database_tests::authorization::streamed_compressible_unicode_payload_bounds_native_prefetch has been running for over 60 seconds1237test reports::limits::tests::project_authorization::project_exports_cancel_loading_without_retaining_authority ... ok1238test reports::streaming::database_tests::authorization::streamed_exports_refresh_after_organization_or_actor_wait has been running for over 60 seconds1239test reports::streaming::database_tests::authorization::streamed_native_projection_mismatch_fails_instead_of_coercing ... ok1240test reports::streaming::database_tests::authorization::streamed_exports_refresh_after_organization_or_actor_wait ... ok1241test reports::streaming::database_tests::authorization::streamed_exports_require_current_tenant_bound_actors_even_when_empty has been running for over 60 seconds1242test reports::limits::tests::bounded_projects_filter_archives_before_size_checks ... ok1243test reports::streaming::database_tests::authorization::streamed_source_stays_frozen_across_batches_while_authority_is_fresh ... ok1244test reports::streaming::database_tests::authorization::streamed_header_and_total_blocks_recheck_manager_after_capacity has been running for over 60 seconds1245test reports::limits::tests::project_authorization::project_exports_require_current_tenant_bound_actor ... ok1246test reports::streaming::database_tests::measure_streaming_csv_export ... ignored, Manual release measurement of a 100,000-row CSV download1247test reports::limits::tests::authorization::materialized_exports_deny_revoked_managers ... ok1248test reports::streaming::database_tests::authorization::streamed_invoice_keeps_original_metadata_lines_and_totals_between_batches has been running for over 60 seconds1249test reports::streaming::database_tests::authorization::streamed_native_batches_keep_crossing_rows_and_reject_invalid_limits has been running for over 60 seconds1250test reports::streaming::database_tests::authorization::streamed_exports_require_current_tenant_bound_actors_even_when_empty ... ok1251test reports::streaming::database_tests::authorization::streamed_pending_project_block_checks_all_captured_ids_after_capacity has been running for over 60 seconds1252test jobs::tests::submission_key_cannot_change_api_mode_or_scope ... ok1253test reports::streaming::database_tests::authorization::streamed_project_release_refreshes_scope_after_parent_wait has been running for over 60 seconds1254test reports::privacy_tests::unauthorized_project_text_does_not_affect_export_size_limits ... ok1255test reports::streaming::database_tests::authorization::streamed_projects_capture_scope_gained_during_initial_wait has been running for over 60 seconds1256test reports::limits::tests::authorization::materialized_exports_keep_deadlines_and_restore_pool_defaults ... ok1257test reports::limits::tests::project_authorization::project_exports_reject_missing_foreign_and_unreadable_captured_ids ... ok1258test reports::streaming::database_tests::authorization::streamed_timesheet_rechecks_after_backpressure_without_retaining_locks has been running for over 60 seconds1259test reports::streaming::database_tests::authorization::streamed_cancelled_authorization_reclaims_its_single_connection ... ok1260test reports::streaming::database_tests::dropping_streamed_timesheet_closes_its_database_connection has been running for over 60 seconds1261test jobs::tests::submission_key_cannot_change_csv_bytes_or_mode ... ok1262test reports::streaming::tests::completed_csv_keeps_admission_until_body_drop ... ok1263test reports::streaming::tests::csv_backpressure_and_body_drop_bound_and_cancel_source_reads ... ok1264test reports::streaming::tests::csv_does_not_truncate_a_quoted_unicode_record_larger_than_a_chunk ... ok1265test reports::streaming::tests::csv_emits_a_chunk_before_the_source_finishes ... ok1266test reports::streaming::tests::csv_failure_or_panic_after_a_chunk_is_not_successful_eof ... ok1267test reports::streaming::tests::csv_startup_errors_are_http_errors_and_release_admission ... ok1268test reports::streaming::tests::csv_timeout_interrupts_an_already_started_body ... ok1269test reports::streaming::tests::dropping_csv_during_startup_cancels_the_producer ... ok1270test route::tests::client_detail_preserves_identity_and_highlights_only_clients ... ok1271test route::tests::client_workflow_paths_preserve_context_and_navigation_section ... ok1272test route::tests::edit_project_preserves_identity_and_highlights_only_projects ... ok1273test route::tests::malformed_context_reaches_the_workflow_for_validation_after_recovery ... ok1274test route::tests::new_project_is_static_and_highlights_only_projects ... ok1275test reports::streaming::database_tests::a_real_database_error_interrupts_the_csv_body ... ok1276test reports::streaming::database_tests::streamed_fee_invoice_has_no_fabricated_hours_or_hourly_rate has been running for over 60 seconds1277test seed::tests::concurrent_initializers_cannot_create_two_organizations ... ok1278test reports::streaming::database_tests::streamed_invoice_metadata_and_lines_share_one_snapshot ... ok1279test seed::tests::late_seed_failure_rolls_back_all_demo_data ... ok1280test jobs::tests::failed_csv_commit_retains_confirmed_report_through_history_and_retry ... ok1281test reports::streaming::database_tests::authorization::streamed_header_and_total_blocks_recheck_manager_after_capacity ... ok1282test jobs::outbox::tests::plugin_failure_retries_with_the_same_event_identity ... ok1283test reports::streaming::database_tests::streamed_invoice_uses_stored_exact_cents_and_tenant_scoped_metadata has been running for over 60 seconds1284test reports::streaming::database_tests::streamed_timesheet_preserves_csv_escaping_frozen_zero_and_all_filters ... ok1285test reports::streaming::database_tests::streamed_invoice_uses_stored_exact_cents_and_tenant_scoped_metadata ... ok1286test reports::streaming::database_tests::authorization::streamed_project_release_refreshes_scope_after_parent_wait ... ok1287test reports::streaming::database_tests::authorization::streamed_native_batches_keep_crossing_rows_and_reject_invalid_limits ... ok1288test reports::streaming::database_tests::streamed_project_exports_deny_inactive_actors has been running for over 60 seconds1289test jobs::tests::expired_lease_cannot_renew_or_commit_using_an_old_transaction_timestamp ... ok1290test reports::streaming::database_tests::streamed_projects_preserve_scope_budget_and_tenant_isolation has been running for over 60 seconds1291test harvest::pagination_tests::harvest_pagination_empty_and_out_of_range_pages_keep_the_contract ... ok1292test server_fns::approvals::submission_tests::cancelling_a_submission_releases_its_write_barrier ... ok1293test reports::streaming::database_tests::streamed_tag_filter_excludes_other_projects_without_duplicating_rows has been running for over 60 seconds1294test server_fns::approvals::submission_tests::submission_barrier_allows_shared_writers_for_the_same_user ... ok1295test server_fns::approvals::submission_tests::submission_accepts_the_organizations_sunday_start ... ok1296test reports::streaming::database_tests::streamed_timesheet_exceeds_xlsx_row_limit_without_one_large_body_chunk has been running for over 60 seconds1297test server_fns::approvals::submission_tests::submission_does_not_wait_for_another_users_writer ... ok1298test reports::streaming::database_tests::streamed_projects_preserve_scope_budget_and_tenant_isolation ... ok1299test server_fns::approvals::submission_tests::submission_freezes_the_minutes_after_a_competing_edit ... ok1300test server_fns::approvals::submission_tests::submission_uses_one_pool_connection ... ok1301test seed::tests::seed_leaves_an_older_or_partial_demo_unchanged ... ok1302test server_fns::approvals::submission_tests::submission_rejects_a_start_that_is_not_the_organizations_week_start ... ok1303test server_fns::approvals::tests::ignores_stopped_and_out_of_week_timers ... ok1304test server_fns::approvals::submission_tests::submission_waits_for_a_new_timer_before_checking_the_week ... ok1305test server_fns::approvals::tests::sees_a_running_timer_inside_the_week ... ok1306test seed::tests::concurrent_init_and_seed_cannot_mix_organizations has been running for over 60 seconds1307test server_fns::budget_tests::budget_notification_schema_enforces_tenants_and_no_public_access ... ok1308test reports::limits::tests::authorization::materialized_exports_require_same_tenant_active_actor ... ok1309test seed::tests::concurrent_seed_runs_create_only_one_demo has been running for over 60 seconds1310test server_fns::budget_tests::concurrent_budget_checks_have_one_band_claimant ... ok1311test server_fns::budget_tests::configured_alert_and_outbox_roll_back_together ... ok1312test server_fns::budget_tests::configured_alerts_deduplicate_concurrent_checks_and_recrossing ... ok1313test server_fns::budget_tests::configured_alert_recipients_are_active_same_org_managers_and_project_leads ... ok1314test server_fns::budget_tests::configured_alerts_require_enabled_active_project_and_authorized_recipient ... ok1315test jobs::tests::reclaimed_attempt_rejects_stale_results_even_with_the_same_worker_name ... ok1316test seed::tests::repeated_seed_preserves_every_row_and_user_edits has been running for over 60 seconds1317test server_fns::budget_tests::configured_amount_budget_uses_resolved_rates_and_explicit_zero ... ok1318test server_fns::budget_tests::configured_monthly_budget_includes_leap_day_and_preserves_locked_rounding ... ok1319test server_fns::budget_tests::configured_nonbillable_projects_count_time_without_hidden_checkbox ... ok1320test server_fns::budget_tests::configured_budget_sweep_recovers_missed_checks_without_duplicates ... ok1321test server_fns::budget_tests::configured_monthly_budget_excludes_other_months_and_nonbillable_time ... ok1322test server_fns::budget_tests::configured_budget_does_not_read_foreign_or_legacy_projects ... ok1323test server_fns::budget_tests::configured_person_budget_excludes_other_people_and_has_its_own_alert ... ok1324test reports::limits::tests::authorization::materialized_exports_recheck_after_render_without_retaining_authority ... ok1325test server_fns::budget_tests::configured_task_and_person_budgets_do_not_share_consumption ... ok1326test server_fns::budget_tests::overview_budget_progress_includes_people_without_an_allowance ... ok1327test server_fns::budget_tests::overview_budget_progress_batches_projects_without_mixing_scopes ... ok1328test server_fns::clients::tests::both_activation_transitions_change_once_and_preserve_details ... ok1329test seed::tests::seed_refuses_a_second_organization_even_when_the_demo_exists has been running for over 60 seconds1330test server_fns::budget_tests::overview_budget_progress_is_current_period_scoped_and_authorized ... ok1331test server_fns::budget_tests::configured_task_fee_budget_respects_billability_and_alert_scope ... ok1332test reports::streaming::database_tests::streamed_tag_filter_excludes_other_projects_without_duplicating_rows ... ok1333test server_fns::clients::tests::client_default_rate_allows_detail_edits_and_equivalent_currency ... ok1334test server_fns::clients::tests::client_default_rate_prevents_currency_relabelling ... ok1335test server_fns::clients::tests::client_details_distinguish_unset_zero_and_positive_manager_rates ... ok1336test server_fns::clients::tests::client_invoices_keep_exact_client_scope_statuses_and_currencies ... ok1337test server_fns::clients::tests::client_invoices_reject_a_winning_concurrent_revocation ... ok1338test server_fns::clients::tests::client_details_hide_foreign_missing_and_inactive_actor_records ... ok1339test reports::limits::tests::project_authorization::project_exports_retain_parent_authority_until_release_check_finishes ... ok1340test server_fns::clients::tests::client_details_keep_catalog_identity_but_omit_member_billing ... ok1341test server_fns::clients::tests::client_summaries_follow_existing_progress_visibility_and_revoke_inactive_users ... ok1342test server_fns::clients::tests::client_summaries_exclude_foreign_clients_and_unreadable_project_currencies ... ok1343test server_fns::clients::tests::client_invoices_require_manager_authority_even_without_invoices ... ok1344test server_fns::clients::tests::client_invoices_hold_authority_until_the_read_finishes ... ok1345test seed::tests::seed_refuses_an_initialized_organization_without_writes has been running for over 60 seconds1346test server_fns::clients::tests::client_summaries_keep_catalog_without_projects_and_count_archived_projects ... ok1347test server_fns::approvals::isolation_tests::bulk_approval_only_returns_and_transitions_own_organization has been running for over 60 seconds1348test jobs::tests::invalid_policy_cannot_enqueue_a_job_or_upload ... ok1349test server_fns::clients::tests::each_field_changes_once_and_preserves_inactive_status ... ok1350test server_fns::clients::tests::concurrent_deletion_is_not_an_unchanged_mutation ... ok1351test server_fns::clients::tests::client_summaries_reject_a_foreign_actor_even_when_client_org_is_known ... ok1352test server_fns::clients::tests::currency_edit_rechecks_a_concurrently_added_client_default_rate ... ok1353test server_fns::clients::tests::profile_currency_change_without_a_rate_keeps_it_unset ... ok1354test server_fns::clients::tests::missing_and_foreign_clients_are_not_noops ... ok1355test server_fns::clients::tests::profile_noop_preserves_row_and_returns_no_update_event_signal ... ok1356test server_fns::clients::tests::profile_create_persists_normalized_identity_and_exact_optional_rate ... ok1357test server_fns::clients::tests::profile_saves_reject_invalid_input_without_partial_writes ... ok1358test server_fns::clients::tests::profile_saves_recheck_manager_org_and_active_actor ... ok1359test server_fns::approvals::isolation_tests::foreign_approval_ids_do_not_change_another_organizations_week has been running for over 60 seconds1360test server_fns::clients::tests::profile_update_rechecks_financial_snapshot_after_waiting_for_a_concurrent_edit ... ok1361test server_fns::approvals::isolation_tests::foreign_reopen_is_not_found_and_preserves_pending_and_approved_work has been running for over 60 seconds1362test reports::streaming::database_tests::authorization::streamed_compressible_unicode_payload_bounds_native_prefetch ... ok1363test server_fns::clients::tests::profile_update_preserves_historical_rows_and_inactive_status ... ok1364test server_fns::importers::authorization_tests::cli_job_endpoints_have_stable_registered_paths ... ok1365test server_fns::clients::tests::profile_update_rejects_stale_rate_even_when_the_target_currency_is_unchanged ... ok1366test server_fns::importers::authorization_tests::report_stress::large_report_streams_over_http_without_buffering_the_archive ... ignored, isolated Linux HTTP/memory stress; run with --release --exact --ignored --nocapture1367test server_fns::importers::authorization_tests::request_bound_import_endpoints_are_not_registered ... ok1368test server_fns::clients::tests::restoring_values_after_a_competing_edit_reports_a_change ... ok1369test server_fns::clients::tests::repeating_a_competing_deactivation_does_not_report_a_transition ... ok1370test server_fns::clients::tests::restoring_a_competing_deactivation_reports_reactivation ... ok1371test server_fns::clients::tests::profile_update_rejects_stale_currency_even_when_the_rate_is_still_unset ... ok1372test server_fns::clients::tests::profile_update_requires_explicit_rate_intent_for_currency_changes ... ok1373test server_fns::clients::tests::profile_update_rechecks_authority_after_waiting_for_a_concurrent_demotion ... ok1374test server_fns::clients::tests::repeating_a_competing_edit_does_not_report_a_change ... ok1375test server_fns::clients::tests::unchanged_activation_preserves_the_row ... ok1376test jobs::report::tests::legacy_converter_uses_replaced_payload_after_waiting ... ok1377test server_fns::approvals::isolation_tests::own_organization_can_reopen_without_unlocking_invoiced_entries has been running for over 60 seconds1378test server_fns::clients::tests::unchanged_edit_preserves_the_row ... ok1379test harvest::pagination_tests::harvest_project_progress_permissions_cover_counts_pages_and_details ... ok1380test reports::streaming::database_tests::dropping_streamed_timesheet_closes_its_database_connection ... ok1381test jobs::report::tests::legacy_upgrade_preserves_a_concurrently_archived_workers_lease ... ok1382test jobs::report::stream_tests::download_rechecks_after_buffered_pages_and_before_the_captured_tail ... ok1383test server_fns::importers::csv_upload::tests::csv_upload_extractor_preserves_raw_bytes ... ok1384test server_fns::importers::csv_upload::tests::csv_upload_requires_its_header_without_reading_the_body ... ok1385test server_fns::importers::tests::concurrent_api_import_returns_a_retryable_conflict ... ok1386test server_fns::importers::tests::csv_route_rejects_invalid_modes_and_headers_without_reading_uploads ... ok1387test server_fns::importers::tests::revoked_connection_authority_maps_to_forbidden_without_private_context ... ok1388test server_fns::importers::tests::submission_identity_rejects_expired_future_and_non_v7_keys ... ok1389test server_fns::importers::authorization_tests::job_endpoints_enforce_session_role_and_organization has been running for over 60 seconds1390test server_fns::importers::commands::tests::authorized_job_lifecycle_and_duplicate_retention_work_with_one_connection has been running for over 60 seconds1391test server_fns::importers::commands::tests::authorized_submissions_do_not_wait_for_the_running_import_reservation has been running for over 60 seconds1392test server_fns::importers::commands::tests::commands_and_status_require_current_active_tenant_administrator has been running for over 60 seconds1393test server_fns::importers::commands::tests::conflicting_and_stale_commands_preserve_payload_policy_and_retained_state has been running for over 60 seconds1394test server_fns::importers::commands::tests::duplicate_submission_and_noop_cancellation_do_not_bypass_revocation has been running for over 60 seconds1395test server_fns::importers::commands::tests::failed_upload_insert_rolls_back_the_job_and_releases_authority has been running for over 60 seconds1396test server_fns::importers::commands::tests::foreign_and_missing_jobs_never_reveal_or_change_another_tenant has been running for over 60 seconds1397test server_fns::importers::commands::tests::import_access_rechecks_revocation_after_organization_and_actor_waits has been running for over 60 seconds1398test server_fns::importers::commands::tests::import_commands_and_results_hold_actor_authority_until_commit has been running for over 60 seconds1399test server_fns::importers::commands::tests::requester::duplicates_and_job_lifecycle_never_replace_or_invent_the_original_requester has been running for over 60 seconds1400test server_fns::importers::commands::tests::requester::new_import_jobs_record_the_authorized_original_requester has been running for over 60 seconds1401test server_fns::importers::commands::tests::requester::original_requester_foreign_key_preserves_tenant_and_known_identity has been running for over 60 seconds1402test server_fns::importers::authorization_tests::job_endpoints_enforce_session_role_and_organization ... ok1403test server_fns::importers::commands::tests::requester::requester_migration_preserves_unknown_authors_in_all_job_states has been running for over 60 seconds1404test server_fns::importers::commands::tests::requester::waiting_duplicate_keeps_the_first_committed_requester has been running for over 60 seconds1405test server_fns::invoices::fee_tests::concurrent_invoices_claim_a_single_fee_once ... ok1406test seed::tests::concurrent_init_and_seed_cannot_mix_organizations ... ok1407test server_fns::invoices::fee_tests::concurrent_discounted_invoice_retries_return_one_invoice has been running for over 60 seconds1408test harvest::pagination_tests::harvest_pagination_catalog_links_preserve_filters_and_break_name_ties ... ok1409test server_fns::importers::commands::tests::requester::original_requester_foreign_key_preserves_tenant_and_known_identity ... ok1410test reports::limits::tests::authorization::materialized_exports_preserve_checked_snapshots ... ok1411test reports::streaming::database_tests::streamed_fee_invoice_has_no_fabricated_hours_or_hourly_rate ... ok1412test server_fns::invoices::fee_tests::draft_fee_edit_rejects_invalid_lines_and_current_unauthorized_actors ... ok1413test reports::streaming::database_tests::authorization::streamed_projects_capture_scope_gained_during_initial_wait ... ok1414test server_fns::invoices::fee_tests::fee_invoice_does_not_claim_hours_or_another_clients_fee ... ok1415test server_fns::invoices::fee_tests::fee_occurrence_rejects_cross_organization_project ... ok1416test seed::tests::repeated_seed_preserves_every_row_and_user_edits ... ok1417test reports::streaming::database_tests::authorization::streamed_invoice_keeps_original_metadata_lines_and_totals_between_batches ... ok1418test server_fns::invoices::fee_tests::fee_total_overflow_rolls_back_occurrences_and_invoice ... ok1419test server_fns::invoices::fee_tests::discounted_fee_leaves_a_balance_and_void_releases_only_its_contribution has been running for over 60 seconds1420test server_fns::invoices::fee_tests::invoice_line_sources_reject_mixed_sources_and_invented_fee_quantities ... ok1421test server_fns::importers::commands::tests::requester::requester_migration_preserves_unknown_authors_in_all_job_states ... ok1422test jobs::tests::cleanup_retains_retryable_uploads_and_deletes_expired_jobs ... ok1423test server_fns::invoices::fee_tests::draft_fee_edit_replaces_amount_and_preserves_source_and_retry_identity has been running for over 60 seconds1424test server_fns::invoices::fee_tests::draft_fee_edit_requires_current_balance_and_exact_excess_confirmation has been running for over 60 seconds1425test server_fns::invoices::fee_tests::milestones_include_unbilled_overdue_fees_but_not_future_fees ... ok1426test server_fns::invoices::fee_tests::invoice_status_rechecks_authority_after_waiting_for_the_invoice_lock ... ok1427test server_fns::invoices::fee_tests::draft_fee_edit_serializes_retries_and_rejects_stale_revisions has been running for over 60 seconds1428test server_fns::invoices::fee_tests::fee_balance_migration_allocates_discount_without_rewriting_invoice_snapshots has been running for over 60 seconds1429test server_fns::invoices::fee_tests::monthly_fees_use_calendar_dates_and_skip_already_claimed_months ... ok1430test server_fns::importers::commands::tests::foreign_and_missing_jobs_never_reveal_or_change_another_tenant ... ok1431test server_fns::invoices::fee_tests::monthly_first_and_fifteenth_respect_partial_period_and_project_end ... ok1432test seed::tests::seed_refuses_a_second_organization_even_when_the_demo_exists ... ok1433test server_fns::invoices::fee_tests::project_fee_context_matches_invoice_balances_and_current_authority ... ok1434test server_fns::invoices::fee_tests::fee_preview_discount_ties_follow_source_keys_not_display_dates has been running for over 60 seconds1435test server_fns::invoices::fee_tests::fee_preview_keeps_source_identity_and_reports_discounted_draft_balances has been running for over 60 seconds1436test server_fns::invoices::fee_tests::removing_discount_and_billing_the_remainder_cannot_both_succeed ... ok1437test reports::streaming::database_tests::authorization::streamed_pending_project_block_checks_all_captured_ids_after_capacity ... ok1438test server_fns::invoices::fee_tests::fee_preview_discount_ties_follow_source_keys_not_display_dates ... ok1439test server_fns::invoices::fee_tests::invoice_defaults_apply_to_selected_fees_without_claiming_other_projects has been running for over 60 seconds1440test server_fns::invoices::fee_tests::invoice_preview_does_not_materialize_fees_and_preserves_released_snapshots has been running for over 60 seconds1441test reports::limits::tests::bounded_entries_enforce_the_row_limit_after_all_filters ... ok1442test server_fns::invoices::fee_tests::prepared_fee_selection_rejects_invalid_values_and_empty_generation ... ok1443test server_fns::importers::commands::tests::conflicting_and_stale_commands_preserve_payload_policy_and_retained_state ... ok1444test server_fns::invoices::fee_tests::mixed_time_and_fee_discount_conserves_cents_without_reopening_time has been running for over 60 seconds1445test server_fns::invoices::fee_tests::single_fee_can_be_invoiced_without_time ... ok1446test server_fns::invoices::fee_tests::draft_fee_edit_replaces_amount_and_preserves_source_and_retry_identity ... ok1447test server_fns::invoices::fee_tests::void_releases_fee_identity_without_rewriting_the_original_line ... ok1448test server_fns::invoices::preview::tests::excess_rejects_an_unrepresentable_total_even_when_the_remainder_fits ... ok1449test server_fns::invoices::preview::tests::unselected_fee_currencies_do_not_relabel_or_block_selected_charges ... ok1450test jobs::report::tests::legacy_converter_gate_allows_a_job_locked_workers_chunk_foreign_keys ... ok1451test server_fns::invoices::fee_tests::project_fee_context_keeps_monthly_balances_separate has been running for over 60 seconds1452test server_fns::approvals::isolation_tests::foreign_approval_ids_do_not_change_another_organizations_week ... ok1453test server_fns::invoices::fee_tests::reviewed_generation_bills_partial_fees_and_rejects_stale_balances ... ok1454test server_fns::invoices::fee_tests::reviewed_generation_does_not_materialize_unselected_months has been running for over 60 seconds1455test server_fns::invoices::snapshot_tests::editor::editor_snapshots_keep_invoice_metadata_revision_and_lines_together ... ok1456test server_fns::invoices::fee_tests::reviewed_generation_rejects_changed_time_before_claiming_it has been running for over 60 seconds1457test server_fns::importers::commands::tests::requester::waiting_duplicate_keeps_the_first_committed_requester ... ok1458test seed::tests::seed_refuses_an_initialized_organization_without_writes ... ok1459test server_fns::invoices::fee_tests::reviewed_generation_requires_exact_excess_and_current_authority has been running for over 60 seconds1460test server_fns::invoices::fee_tests::fee_balance_migration_allocates_discount_without_rewriting_invoice_snapshots ... ok1461test server_fns::invoices::fee_tests::reviewed_generation_requires_exact_excess_and_current_authority ... ok1462test server_fns::invoices::fee_tests::settled_fee_sources_remain_reviewable_without_automatic_charges has been running for over 60 seconds1463test reports::limits::tests::project_authorization::project_exports_refresh_scope_after_winning_relationship_changes ... ok1464test server_fns::invoices::snapshot_tests::races::financial_snapshots_release_cancelled_reads_for_one_connection ... ok1465test server_fns::invoices::snapshot_tests::races::financial_snapshots_retry_organization_row_change_and_refresh_amounts ... ok1466test server_fns::invoices::fee_tests::zero_fee_is_invoiced_once_until_voided has been running for over 60 seconds1467test server_fns::invoices::snapshot_tests::editor::editor_snapshots_deny_winning_legacy_revocation has been running for over 60 seconds1468test server_fns::importers::commands::tests::commands_and_status_require_current_active_tenant_administrator ... ok1469test server_fns::invoices::snapshot_tests::settings::financial_snapshots_override_isolation_but_restore_connection_settings ... ok1470test server_fns::invoices::snapshot_tests::editor::editor_snapshots_preserve_rows_and_override_inherited_read_only has been running for over 60 seconds1471test server_fns::invoices::snapshot_tests::editor::editor_snapshots_deny_winning_legacy_revocation ... ok1472test server_fns::invoices::snapshot_tests::editor::editor_snapshots_refresh_after_organization_row_change_without_rebasing_edits has been running for over 60 seconds1473test jobs::tests::failed_csv_preview_retains_confirmed_report_through_history_and_retry ... ok1474test server_fns::invoices::snapshot_tests::editor::editor_snapshots_retain_authority_and_release_cancelled_reads has been running for over 60 seconds1475test server_fns::invoices::tests::assignment_gate_allows_inflight_invoice_organization_fks_to_finish ... ok1476test server_fns::invoices::fee_tests::mixed_time_and_fee_discount_conserves_cents_without_reopening_time ... ok1477test server_fns::invoices::snapshot_tests::financial_snapshots_require_current_same_tenant_manager has been running for over 60 seconds1478test server_fns::invoices::fee_tests::discounted_fee_leaves_a_balance_and_void_releases_only_its_contribution ... ok1479test server_fns::invoices::snapshot_tests::races::financial_snapshots_deny_winning_actor_revocation_without_organization_change has been running for over 60 seconds1480test server_fns::invoices::snapshot_tests::races::financial_snapshots_hold_authority_until_materialization has been running for over 60 seconds1481test reports::limits::tests::export_queries_are_read_only_and_have_a_database_deadline ... ok1482test server_fns::invoices::snapshot_tests::races::financial_snapshots_keep_fee_values_from_their_initial_snapshot has been running for over 60 seconds1483test server_fns::invoices::tests::billing_cascade_agrees_across_all_four_levels_including_zero ... ok1484test harvest::pagination_tests::harvest_project_cost_overrides_require_admin_without_fabricated_fallback ... ok1485test server_fns::invoices::fee_tests::invoice_defaults_apply_to_selected_fees_without_claiming_other_projects ... ok1486test server_fns::invoices::tests::configured_project_currency_and_cost_override_keep_their_denominations ... ok1487test server_fns::invoices::tests::configured_fixed_fee_hours_are_not_invoiced_but_legacy_fees_are_unchanged ... ok1488test reports::streaming::database_tests::streamed_project_exports_deny_inactive_actors ... ok1489test server_fns::invoices::tests::effective_minutes_migration_preserves_historical_invoice_quantities ... ok1490test server_fns::invoices::snapshot_tests::races::financial_snapshots_hold_authority_until_materialization ... ok1491test server_fns::invoices::tests::effective_minutes_sql_matches_domain_rounding ... ok1492test server_fns::invoices::fee_tests::project_fee_context_keeps_monthly_balances_separate ... ok1493test server_fns::invoices::snapshot_tests::settings::financial_snapshots_honor_stricter_lock_timeout_during_authorization has been running for over 60 seconds1494test server_fns::invoices::snapshot_tests::races::financial_snapshots_keep_fee_values_from_their_initial_snapshot ... ok1495test server_fns::invoices::tests::authority::invoice_edit_and_transition_observe_user_revocation_order ... ok1496test server_fns::invoices::snapshot_tests::settings::financial_snapshots_honor_stricter_lock_timeout_during_authorization ... ok1497test server_fns::invoices::snapshot_tests::settings::financial_snapshots_retry_only_serialization_failures_and_stop_after_three has been running for over 60 seconds1498test server_fns::invoices::fee_tests::draft_fee_edit_serializes_retries_and_rejects_stale_revisions ... ok1499test server_fns::invoices::tests::invoice_defaults_validate_all_override_fields ... ok1500test server_fns::invoices::tests::invoice_line_overflow_leaves_time_unbilled ... ok1501test server_fns::invoices::snapshot_tests::editor::editor_snapshots_retain_authority_and_release_cancelled_reads ... ok1502test server_fns::invoices::fee_tests::settled_fee_sources_remain_reviewable_without_automatic_charges ... ok1503test server_fns::invoices::tests::imported_rates::imported_legacy_project_keeps_exact_rates_and_totals_on_retry ... ok1504test server_fns::invoices::tests::invoice_defaults_selection_rejects_unavailable_projects_before_claiming ... ok1505test server_fns::invoices::tests::invoice_total_overflow_leaves_all_time_unbilled ... ok1506test server_fns::invoices::fee_tests::zero_fee_is_invoiced_once_until_voided ... ok1507test server_fns::invoices::tests::authority::cancelled_invoice_writers_roll_back_and_release_single_connection has been running for over 60 seconds1508test server_fns::invoices::snapshot_tests::editor::editor_snapshots_preserve_rows_and_override_inherited_read_only ... ok1509test server_fns::invoices::tests::invoice_transitions_reject_invalid_states_and_foreign_organizations ... ok1510test server_fns::invoices::tests::invoiced_amounts_survive_rate_changes_and_void_uses_current_rates ... ok1511test server_fns::invoices::tests::authority::invoice_generation_and_user_revocation_commit_in_gate_order has been running for over 60 seconds1512test server_fns::importers::commands::tests::authorized_submissions_do_not_wait_for_the_running_import_reservation ... ok1513test server_fns::invoices::tests::invoiced_billability_survives_later_project_changes ... ok1514test server_fns::invoices::tests::invoicing_leaves_running_time_open ... ok1515test server_fns::invoices::tests::invoicing_uses_and_freezes_effective_minutes ... ok1516test server_fns::invoices::tests::mixed_project_currencies_cannot_partially_create_an_invoice ... ok1517test server_fns::invoices::tests::large_invoice_and_reports_agree_without_intermediate_overflow ... ok1518test server_fns::invoices::tests::authority::cancelled_invoice_writers_roll_back_and_release_single_connection ... ok1519test server_fns::invoices::tests::non_billable_context_produces_no_unbilled_amount_on_any_report ... ok1520test server_fns::invoices::tests::project_rate_is_used_by_invoices_reports_and_spend ... ok1521test server_fns::invoices::tests::only_running_time_does_not_create_an_invoice ... ok1522test server_fns::invoices::tests::authority::invoice_writers_override_readonly_defaults_without_changing_the_session has been running for over 60 seconds1523test server_fns::invoices::tests::void_waits_for_a_concurrent_payment_and_then_refuses ... ok1524test server_fns::invoices::tests::invoice_defaults_edit_rechecks_status_after_waiting_for_a_concurrent_send ... ok1525test server_fns::invoices::tests::void_reopens_time_without_stale_rounding ... ok1526test server_fns::invoices::tests::selected_project_rate_modes_agree_across_billing_consumers ... ok1527test server_fns::invoices::tests::authority::invoice_generation_and_user_revocation_commit_in_gate_order ... ok1528test server_fns::organization::tests::each_branding_field_changes_once_including_null_and_empty ... ok1529test server_fns::organization::tests::missing_organization_is_not_an_unchanged_update ... ok1530test reports::limits::tests::project_authorization::project_exports_release_cancelled_and_timed_out_checks ... ok1531test server_fns::organization::tests::repeating_a_competing_branding_edit_does_not_report_a_change ... ok1532test server_fns::organization::tests::restoring_branding_after_a_competing_edit_reports_a_change ... ok1533test server_fns::organization::tests::unchanged_branding_preserves_the_row ... ok1534test server_fns::invoices::snapshot_tests::editor::editor_snapshots_refresh_after_organization_row_change_without_rebasing_edits ... ok1535test server_fns::importers::commands::tests::import_commands_and_results_hold_actor_authority_until_commit ... ok1536test server_fns::invoices::tests::imported_rates::imported_task_rates_require_matching_currency_only_for_new_configured_links has been running for over 60 seconds1537test server_fns::invoices::tests::imported_rates::rejected_import_rate_does_not_poison_the_next_row_or_its_catalog_rate has been running for over 60 seconds1538test server_fns::permissions::audit_tests::audit_reader_holds_requester_until_materialization_finishes ... ok1539test server_fns::invoices::tests::invoice_defaults_apply_exact_adjustments_and_payment_terms has been running for over 60 seconds1540test server_fns::invoices::tests::invoice_defaults_are_invoice_owned_and_only_drafts_are_editable has been running for over 60 seconds1541test server_fns::invoices::tests::invoice_defaults_conflict_rolls_back_all_claims has been running for over 60 seconds1542test reports::streaming::database_tests::authorization::streamed_timesheet_rechecks_after_backpressure_without_retaining_locks ... ok1543test harvest::pagination_tests::harvest_own_time_omits_private_project_budget_metadata ... ok1544test server_fns::invoices::tests::invoice_defaults_legacy_insert_preserves_dates_and_exact_total has been running for over 60 seconds1545test server_fns::invoices::tests::invoice_preview_keeps_time_rates_and_defaults_in_one_snapshot has been running for over 60 seconds1546test server_fns::invoices::tests::invoice_preview_matches_generation_without_claiming_time has been running for over 60 seconds1547test server_fns::invoices::tests::invoice_preview_rejects_large_results_instead_of_truncating_them has been running for over 60 seconds1548test server_fns::importers::commands::tests::import_access_rechecks_revocation_after_organization_and_actor_waits ... ok1549test server_fns::invoices::tests::invoice_preview_requires_explicit_resolution_and_scopes_selected_projects has been running for over 60 seconds1550test server_fns::invoices::tests::authority::invoice_writers_override_readonly_defaults_without_changing_the_session ... ok1551test seed::tests::concurrent_seed_runs_create_only_one_demo ... ok1552test server_fns::invoices::tests::imported_rates::imported_task_rates_require_matching_currency_only_for_new_configured_links ... ok1553test server_fns::permissions::audit_tests::audit_timeout_preserves_stricter_limits_and_releases_locks ... ok1554test server_fns::invoices::tests::invoice_preview_matches_generation_without_claiming_time ... ok1555test server_fns::organization::tests::branding_holds_actor_authority_until_its_write_commits has been running for over 60 seconds1556test server_fns::organization::tests::branding_rechecks_authority_after_an_actor_only_wait has been running for over 60 seconds1557test server_fns::organization::tests::branding_rechecks_authority_after_the_organization_wait has been running for over 60 seconds1558test server_fns::organization::tests::branding_requires_current_tenant_bound_authority_even_for_noops has been running for over 60 seconds1559test server_fns::invoices::tests::invoice_defaults_apply_exact_adjustments_and_payment_terms ... ok1560test server_fns::permissions::audit_tests::historical_decoder_distinguishes_missing_change_from_explicit_noop ... ok1561test server_fns::permissions::audit_tests::historical_decoder_rejects_missing_template_snapshots_and_invalid_grants ... ok1562test server_fns::permissions::audit_tests::historical_decoder_rejects_unknown_mixed_fields_and_invalid_revision_steps ... ok1563test server_fns::permissions::audit_tests::historical_person_snapshot_validates_provenance_without_inferring_admin_identity ... ok1564test server_fns::organization::tests::failed_branding_write_rolls_back_and_releases_authority has been running for over 60 seconds1565test server_fns::invoices::tests::invoice_defaults_conflict_rolls_back_all_claims ... ok1566test server_fns::invoices::snapshot_tests::settings::financial_snapshots_retry_only_serialization_failures_and_stop_after_three ... ok1567test server_fns::permissions::audit_tests::administrator_reads_historical_template_without_intent_or_replay_result has been running for over 60 seconds1568test server_fns::permissions::audit_tests::audit_reader_overrides_transaction_defaults_without_changing_connection has been running for over 60 seconds1569test server_fns::organization::tests::branding_requires_current_tenant_bound_authority_even_for_noops ... ok1570test reports::streaming::database_tests::streamed_timesheet_exceeds_xlsx_row_limit_without_one_large_body_chunk ... ok1571test server_fns::permissions::audit_tests::reader_winning_gate_finishes_before_revocation_and_later_reads_fail ... ok1572test server_fns::permissions::audit_tests::browsing::admitted_history_page_finishes_before_revocation_at_each_gate has been running for over 60 seconds1573test server_fns::permissions::audit_tests::browsing::cancelling_history_page_releases_both_authority_gates has been running for over 60 seconds1574test server_fns::invoices::fee_tests::invoice_preview_does_not_materialize_fees_and_preserves_released_snapshots ... ok1575test server_fns::permissions::audit_tests::browsing::history_page_reauthorizes_empty_and_continuation_requests_and_binds_requester has been running for over 60 seconds1576test server_fns::invoices::snapshot_tests::financial_snapshots_require_current_same_tenant_manager ... ok1577test server_fns::permissions::audit_tests::browsing::history_page_rejects_malformed_history_without_partial_success has been running for over 60 seconds1578test server_fns::permissions::audit_tests::tenant_activity_and_policy_checks_precede_receipt_existence_and_decode ... ok1579test server_fns::permissions::audit_tests::legacy_admin_and_all_grants_without_explicit_identity_cannot_read_audit ... ok1580test server_fns::permissions::audit_tests::audit_reader_overrides_transaction_defaults_without_changing_connection ... ok1581test server_fns::permissions::audit_tests::browsing::cancelling_history_page_releases_both_authority_gates ... ok1582test server_fns::importers::commands::tests::requester::duplicates_and_job_lifecycle_never_replace_or_invent_the_original_requester ... ok1583test server_fns::organization::tests::branding_rechecks_authority_after_the_organization_wait ... ok1584test server_fns::permissions::audit_tests::browsing::history_page_waits_for_revocation_commit_or_rollback_at_each_gate has been running for over 60 seconds1585test server_fns::permissions::own_tests::own_permissions_scope_is_sorted_and_excludes_membership_and_other_managers ... ok1586test server_fns::permissions::audit_tests::browsing::history_pages_scope_before_limit_and_use_stable_exclusive_timestamp_id_bounds has been running for over 60 seconds1587test server_fns::invoices::fee_tests::reviewed_generation_does_not_materialize_unselected_months ... ok1588test server_fns::invoices::tests::invoice_preview_keeps_time_rates_and_defaults_in_one_snapshot ... ok1589test server_fns::permissions::audit_tests::cancelled_audit_read_releases_both_gates_and_single_connection has been running for over 60 seconds1590test server_fns::organization::tests::failed_branding_write_rolls_back_and_releases_authority ... ok1591test server_fns::invoices::snapshot_tests::races::financial_snapshots_deny_winning_actor_revocation_without_organization_change ... ok1592test server_fns::permissions::preflight_tests::preflight_lock_failure_releases_organization_without_mutating_data ... ok1593test server_fns::permissions::audit_tests::current_administrator_reads_inactive_authors_history_without_live_state has been running for over 60 seconds1594test server_fns::permissions::audit_tests::administrator_reads_historical_template_without_intent_or_replay_result ... ok1595test server_fns::permissions::audit_tests::direct_deactivation_winning_user_lock_denies_audit_read has been running for over 60 seconds1596test server_fns::permissions::audit_tests::failed_mutation_has_no_success_audit_and_reads_do_not_write has been running for over 60 seconds1597test server_fns::permissions::preflight_tests::preflight_requires_current_legacy_administrator_not_staged_grants ... ok1598test server_fns::permissions::preflight_tests::preflight_separates_unknown_import_requesters_without_changing_artifacts ... ok1599test server_fns::permissions::audit_tests::operator_attribution_is_not_a_user_and_excludes_private_replay_payload has been running for over 60 seconds1600test server_fns::importers::commands::tests::requester::new_import_jobs_record_the_authorized_original_requester ... ok1601test server_fns::permissions::audit_tests::profile_and_project_history_decode_exact_changes_and_noops has been running for over 60 seconds1602test server_fns::permissions::own_tests::own_permissions_legacy_mode_never_discloses_staging ... ok1603test server_fns::permissions::audit_tests::profile_history_keeps_removed_relationships_after_grants_change_again has been running for over 60 seconds1604test server_fns::permissions::audit_tests::browsing::history_pages_scope_before_limit_and_use_stable_exclusive_timestamp_id_bounds ... ok1605test server_fns::permissions::profile_tests::cancelled_profile_save_rolls_back_effects_and_releases_single_connection ... ok1606test server_fns::permissions::audit_tests::profile_and_project_history_decode_exact_changes_and_noops ... ok1607test server_fns::permissions::audit_tests::revocation_winning_gate_denies_waiting_historical_reader has been running for over 60 seconds1608test server_fns::permissions::audit_tests::cancelled_audit_read_releases_both_gates_and_single_connection ... ok1609test server_fns::permissions::audit_tests::template_detachment_history_preserves_exact_grants_and_provenance has been running for over 60 seconds1610test server_fns::organization::tests::branding_rechecks_authority_after_an_actor_only_wait ... ok1611test server_fns::permissions::profile_tests::directory_tests::directory_cancellation_releases_connection_and_preserves_pool_defaults ... ok1612test server_fns::invoices::tests::imported_rates::rejected_import_rate_does_not_poison_the_next_row_or_its_catalog_rate ... ok1613test server_fns::permissions::own_tests::own_permissions_deny_invalid_identity_policy_and_state has been running for over 60 seconds1614test server_fns::permissions::audit_tests::browsing::history_page_reauthorizes_empty_and_continuation_requests_and_binds_requester ... ok1615test server_fns::importers::commands::tests::failed_upload_insert_rolls_back_the_job_and_releases_authority ... ok1616test server_fns::permissions::own_tests::own_permissions_preserve_exact_grants_and_independent_identity has been running for over 60 seconds1617test server_fns::permissions::own_tests::own_permissions_reader_retains_actor_activity_until_snapshot_is_loaded ... ok1618test server_fns::permissions::profile_tests::directory_tests::directory_uses_each_profiles_people_grants_not_legacy_role_or_other_scope ... ok1619test server_fns::approvals::isolation_tests::bulk_approval_only_returns_and_transitions_own_organization ... ok1620test server_fns::invoices::tests::invoice_defaults_legacy_insert_preserves_dates_and_exact_total ... ok1621test server_fns::permissions::own_tests::own_permissions_reload_after_winning_gate_under_repeatable_read_defaults has been running for over 60 seconds1622test server_fns::permissions::own_tests::own_permissions_wait_for_current_actor_deactivation has been running for over 60 seconds1623test server_fns::permissions::preflight_tests::preflight_approval_diagnostics_preserve_stored_history has been running for over 60 seconds1624test reports::limits::tests::project_authorization::project_exports_bound_rows_and_text_after_scope_filtering ... ok1625test server_fns::permissions::preflight_tests::preflight_cancellation_releases_organization_and_single_connection has been running for over 60 seconds1626test server_fns::permissions::profile_tests::directory_tests::directory_scopes_before_activity_pagination_and_only_returns_basic_identity ... ok1627test server_fns::permissions::preflight_tests::preflight_counts_cross_tenant_memberships_from_both_ends has been running for over 60 seconds1628test reports::privacy_tests::project_downloads_follow_progress_visibility ... ok1629test server_fns::permissions::preflight_tests::preflight_rechecks_revocation_after_organization_and_actor_waits has been running for over 60 seconds1630test reports::limits::tests::export_size_checks_and_reads_share_a_repeatable_read_snapshot ... ok1631test server_fns::permissions::profile_tests::audit_failure_rolls_back_profile_and_both_relationship_sets ... ok1632test server_fns::permissions::preflight_tests::preflight_cancellation_releases_organization_and_single_connection ... ok1633test server_fns::invoices::fee_tests::concurrent_discounted_invoice_retries_return_one_invoice ... ok1634test server_fns::permissions::profile_tests::adjusted_template_reset_and_replay_after_deletion_use_explicit_intent has been running for over 60 seconds1635test server_fns::permissions::profile_tests::explicit_identity_changes_and_inactive_targets_do_not_change_activation ... ok1636test server_fns::permissions::profile_tests::all_grant_template_cannot_confer_identity_and_cross_command_keys_conflict has been running for over 60 seconds1637test server_fns::permissions::profile_tests::existing_user_share_lock_does_not_block_profile_command ... ok1638test server_fns::permissions::preflight_tests::preflight_counts_cross_tenant_memberships_from_both_ends ... ok1639test server_fns::permissions::profile_tests::editor_tests::template_deletion_preview_preserves_people_and_fences_its_affected_set ... ok1640test server_fns::permissions::audit_tests::profile_history_keeps_removed_relationships_after_grants_change_again ... ok1641test server_fns::permissions::profile_tests::canonical_actor_policy_tenant_and_target_checks_precede_mutation has been running for over 60 seconds1642test server_fns::importers::commands::tests::duplicate_submission_and_noop_cancellation_do_not_bypass_revocation ... ok1643test server_fns::permissions::profile_tests::concurrent_self_demotions_leave_one_active_explicit_administrator has been running for over 60 seconds1644test server_fns::permissions::own_tests::own_permissions_preserve_exact_grants_and_independent_identity ... ok1645test server_fns::permissions::profile_tests::editor_tests::editor_loss_names_cover_only_current_outgoing_effects ... ok1646test server_fns::permissions::profile_tests::profile_command_retains_target_activity_through_receipt_insert ... ok1647test server_fns::permissions::profile_tests::directory_tests::directory_denies_legacy_foreign_inactive_and_invalid_authority_even_for_empty_pages has been running for over 60 seconds1648test server_fns::permissions::own_tests::own_permissions_reload_after_winning_gate_under_repeatable_read_defaults ... ok1649test server_fns::permissions::profile_tests::directory_tests::directory_does_not_use_project_management_and_rechecks_relationship_removal has been running for over 60 seconds1650test server_fns::permissions::profile_tests::directory_tests::directory_does_not_use_project_management_and_rechecks_relationship_removal ... ok1651test server_fns::permissions::profile_tests::directory_tests::directory_orders_by_name_then_id_and_accepts_deleted_cursor_without_extra_page has been running for over 60 seconds1652test server_fns::permissions::profile_tests::directory_tests::directory_rechecks_grant_revocation_and_direct_deactivation_after_wait has been running for over 60 seconds1653test server_fns::permissions::profile_tests::project_people_tests::project_people_accepts_unconfigured_targets_and_exact_page_without_more ... ok1654test server_fns::permissions::profile_tests::editor_tests::editor_denies_wrong_authority_policy_and_foreign_targets has been running for over 60 seconds1655test server_fns::permissions::profile_tests::editor_tests::editor_noop_and_last_admin_proposals_are_truthful ... ok1656test server_fns::permissions::profile_tests::editor_tests::editor_direct_actor_deactivation_wins_preview_and_load has been running for over 60 seconds1657test server_fns::permissions::profile_tests::explicit_application_and_adjustments_preserve_confirmed_grants ... ok1658test server_fns::permissions::profile_tests::adjusted_template_reset_and_replay_after_deletion_use_explicit_intent ... ok1659test server_fns::permissions::profile_tests::last_active_administrator_cannot_be_demoted_or_replaced_by_equivalent_grants ... ok1660test server_fns::permissions::profile_tests::editor_tests::editor_denies_wrong_authority_policy_and_foreign_targets ... ok1661test server_fns::permissions::profile_tests::project_people_tests::project_people_filters_before_paging_and_resolves_outside_the_search ... ok1662test server_fns::permissions::profile_tests::editor_tests::editor_preview_matches_saved_effects_without_writing has been running for over 60 seconds1663test server_fns::permissions::profile_tests::invalid_confirmations_and_noncanonical_grants_are_not_silently_repaired ... ok1664test server_fns::permissions::profile_tests::all_grant_template_cannot_confer_identity_and_cross_command_keys_conflict ... ok1665test server_fns::permissions::profile_tests::editor_tests::every_builtin_preview_matches_its_actual_save has been running for over 60 seconds1666test server_fns::permissions::profile_tests::project_people_tests::project_people_denies_invalid_authority_even_for_empty_resolution ... ok1667test server_fns::permissions::profile_tests::project_people_tests::project_people_authorizes_the_operation_not_the_directory_or_legacy_role ... ok1668test server_fns::permissions::profile_tests::recreated_relationship_invalidates_waiting_confirmation_without_partial_removal ... ok1669test server_fns::approvals::isolation_tests::foreign_reopen_is_not_found_and_preserves_pending_and_approved_work ... ok1670test server_fns::permissions::profile_tests::directory_tests::directory_orders_by_name_then_id_and_accepts_deleted_cursor_without_extra_page ... ok1671test server_fns::permissions::profile_tests::malformed_person_or_remaining_administrator_state_fails_closed has been running for over 60 seconds1672test server_fns::permissions::profile_tests::reduced_administrator_and_stale_person_proposals_are_rejected ... ok1673test server_fns::permissions::profile_tests::management_schema_rejects_foreign_parents_self_links_and_duplicate_pairs has been running for over 60 seconds1674test server_fns::permissions::audit_tests::operator_attribution_is_not_a_user_and_excludes_private_replay_payload ... ok1675test server_fns::permissions::profile_tests::profile_command_overrides_readonly_defaults_locally has been running for over 60 seconds1676test server_fns::permissions::profile_tests::profile_command_rechecks_remaining_administrator_after_deactivation_wait has been running for over 60 seconds1677test server_fns::permissions::profile_tests::editor_tests::every_builtin_preview_matches_its_actual_save ... ok1678test server_fns::permissions::profile_tests::profile_command_rechecks_target_activation_before_demotion has been running for over 60 seconds1679test server_fns::permissions::profile_tests::directory_tests::directory_rechecks_grant_revocation_and_direct_deactivation_after_wait ... ok1680test server_fns::permissions::profile_tests::profile_command_waits_for_direct_actor_deactivation_even_on_replay has been running for over 60 seconds1681test server_fns::permissions::profile_tests::profile_demotion_retains_surviving_administrator_until_commit has been running for over 60 seconds1682test server_fns::permissions::profile_tests::profile_command_rechecks_remaining_administrator_after_deactivation_wait ... ok1683test server_fns::permissions::profile_tests::profile_command_waits_for_direct_actor_deactivation_even_on_replay ... ok1684test server_fns::permissions::audit_tests::failed_mutation_has_no_success_audit_and_reads_do_not_write ... ok1685test server_fns::permissions::audit_tests::current_administrator_reads_inactive_authors_history_without_live_state ... ok1686test server_fns::permissions::profile_tests::time_entries_tests::time_reads_distinguish_project_management_from_membership_and_people_scope ... ok1687test server_fns::permissions::profile_tests::read_only_retention_and_explicit_keep_project_access_preserve_independent_person_losses ... ok1688test server_fns::permissions::profile_tests::project_people_tests::project_people_cancellation_releases_connection_and_preserves_pool_defaults has been running for over 60 seconds1689test server_fns::permissions::profile_tests::profile_demotion_retains_surviving_administrator_until_commit ... ok1690test server_fns::permissions::profile_tests::time_entries_tests::time_reads_finish_before_competing_revocation_when_read_admitted_first ... ok1691test server_fns::permissions::audit_tests::browsing::admitted_history_page_finishes_before_revocation_at_each_gate ... ok1692test server_fns::invoices::fee_tests::fee_preview_keeps_source_identity_and_reports_discounted_draft_balances ... ok1693test server_fns::permissions::profile_tests::time_entries_tests::time_reads_use_effective_profile_scope_and_union_without_duplicates ... ok1694test server_fns::permissions::preflight_tests::preflight_approval_diagnostics_preserve_stored_history ... ok1695test server_fns::permissions::profile_tests::timesheet_people_tests::cancellation_releases_discovery_locks_and_keeps_pool_defaults ... ok1696test server_fns::permissions::profile_tests::timesheet_people_tests::candidates_include_empty_project_members_and_retained_history_without_directory_access ... ok1697test server_fns::permissions::profile_tests::timesheet_people_tests::discovery_fails_closed_for_policy_identity_and_invalid_state ... ok1698test server_fns::permissions::profile_tests::timesheet_people_tests::discovery_rechecks_revocation_and_actor_activity_after_waiting ... ok1699test server_fns::permissions::profile_tests::timesheet_people_tests::history_keeps_archived_context_but_excludes_inactive_people_and_foreign_parents ... ok1700test server_fns::permissions::own_tests::own_permissions_wait_for_current_actor_deactivation ... ok1701test server_fns::permissions::profile_tests::directory_tests::directory_denies_legacy_foreign_inactive_and_invalid_authority_even_for_empty_pages ... ok1702test server_fns::permissions::profile_tests::unchanged_and_unrelated_edits_do_not_clean_up_preexisting_incompatible_links ... ok1703test server_fns::permissions::profile_tests::subjects_tests::subject_discovery_rechecks_direct_deactivation ... ok1704test server_fns::invoices::fee_tests::reviewed_generation_rejects_changed_time_before_claiming_it ... ok1705test server_fns::permissions::profile_tests::project_people_tests::project_people_rechecks_grants_and_direct_deactivation_after_wait ... ok1706test server_fns::permissions::profile_tests::profile_command_overrides_readonly_defaults_locally ... ok1707test server_fns::permissions::profile_tests::project_people_tests::project_people_holds_authority_until_read_finishes has been running for over 60 seconds1708test server_fns::permissions::profile_tests::stale_template_and_org_revision_and_exhausted_revisions_roll_back ... ok1709test server_fns::permissions::profile_tests::management_schema_rejects_foreign_parents_self_links_and_duplicate_pairs ... ok1710test server_fns::permissions::profile_tests::timesheet_people_tests::admitted_discovery_finishes_before_competing_revocation ... ok1711test server_fns::permissions::profile_tests::project_people_tests::project_people_rechecks_designation_after_waiting_for_revocation has been running for over 60 seconds1712test server_fns::permissions::project_management_tests::foreign_missing_inactive_and_malformed_additions_fail_without_disclosure ... ok1713test server_fns::invoices::tests::invoice_preview_requires_explicit_resolution_and_scopes_selected_projects ... ok1714test server_fns::permissions::profile_tests::malformed_person_or_remaining_administrator_state_fails_closed ... ok1715test server_fns::permissions::profile_tests::canonical_actor_policy_tenant_and_target_checks_precede_mutation ... ok1716test server_fns::permissions::profile_tests::subjects_tests::subject_discovery_cancellation_releases_connection_and_preserves_pool_defaults ... ok1717test server_fns::permissions::project_management_tests::mixed_invalid_addition_preserves_entire_previous_set ... ok1718test server_fns::permissions::project_management_tests::canonical_actor_grants_activity_tenant_and_policy_are_required ... ok1719test server_fns::permissions::profile_tests::subjects_tests::subject_pages_preserve_all_local_identities_with_only_display_fields ... ok1720test server_fns::permissions::project_management_tests::project_delegation_overrides_readonly_defaults_locally ... ok1721test server_fns::permissions::project_management_tests::project_delegation_retains_actor_activity_until_commit ... ok1722test server_fns::permissions::preflight_tests::preflight_rechecks_revocation_after_organization_and_actor_waits ... ok1723test server_fns::permissions::project_management_tests::audit_failure_rolls_back_removal_addition_and_revision ... ok1724test server_fns::permissions::project_management_tests::reader_tests::manager_reader_holds_authority_and_cancellation_releases_it ... ok1725test server_fns::permissions::project_management_tests::reader_tests::manager_reader_materializes_before_a_waiting_actor_deactivation ... ok1726test server_fns::permissions::profile_tests::project_people_tests::project_people_validates_bounded_input_only_after_authorization has been running for over 60 seconds1727test server_fns::permissions::project_management_tests::reader_tests::manager_reader_observes_direct_deactivation_before_its_actor_lock ... ok1728test server_fns::permissions::project_management_tests::reader_tests::manager_reader_preserves_the_complete_retained_set_without_private_fields ... ok1729test server_fns::permissions::profile_tests::subjects_tests::subject_discovery_rechecks_revocation_after_gate_wait_and_between_pages ... ok1730test server_fns::permissions::profile_tests::time_entries_tests::time_reads_fail_closed_for_policy_identity_and_invalid_state ... ok1731test server_fns::permissions::audit_tests::direct_deactivation_winning_user_lock_denies_audit_read ... ok1732test server_fns::permissions::project_management_tests::legacy_user_share_locks_allow_manager_and_receipt_foreign_keys ... ok1733test server_fns::permissions::audit_tests::template_detachment_history_preserves_exact_grants_and_provenance ... ok1734test server_fns::permissions::project_management_tests::legacy_project_lock_returns_busy_instead_of_forming_an_org_fk_cycle ... ok1735test server_fns::permissions::project_management_tests::stale_duplicate_and_exhausted_revisions_never_replace_the_set ... ok1736test server_fns::permissions::own_tests::own_permissions_deny_invalid_identity_policy_and_state ... ok1737test server_fns::permissions::project_management_tests::concurrent_replacements_commit_only_one_current_revision ... ok1738test server_fns::permissions::audit_tests::browsing::history_page_rejects_malformed_history_without_partial_success ... ok1739test server_fns::permissions::project_management_tests::managed_scope_never_uses_another_project_or_legacy_membership ... ok1740test server_fns::permissions::storage_tests::concurrent_equivalent_names_create_only_one_template ... ok1741test server_fns::permissions::project_management_tests::transaction_tests::project_rollback_discards_managers_revision_and_receipt ... ok1742test server_fns::permissions::profile_tests::project_people_tests::project_people_holds_authority_until_read_finishes ... ok1743test server_fns::permissions::project_management_tests::cancelled_project_delegation_rolls_back_and_releases_single_connection ... ok1744test server_fns::permissions::storage_tests::referenced_template_deletion_requires_detaching_without_grant_or_identity_loss ... ok1745test server_fns::permissions::storage_tests::person_state_rejects_duplicates_and_foreign_users_and_templates ... ok1746test server_fns::permissions::project_management_tests::transaction_tests::delegation_reuses_editor_gate_without_upgrading_past_foreign_keys ... ok1747test server_fns::permissions::profile_tests::time_entries_tests::time_reads_page_ties_without_loss_and_filters_never_expand_scope ... ok1748test server_fns::invoices::tests::invoice_defaults_are_invoice_owned_and_only_drafts_are_editable ... ok1749test server_fns::permissions::project_management_tests::project_delegation_denies_actor_deactivated_before_check ... ok1750test server_fns::permissions::storage_tests::person_grants_and_identity_round_trip_independently_of_source ... ok1751test server_fns::permissions::audit_tests::browsing::history_page_waits_for_revocation_commit_or_rollback_at_each_gate ... ok1752test server_fns::permissions::project_management_tests::replacement_audits_exact_delta_and_preserves_membership_history_and_other_scopes ... ok1753test server_fns::permissions::project_management_tests::retained_ineligible_managers_and_archived_projects_allow_noop_and_removal ... ok1754test server_fns::permissions::project_management_tests::project_editor_delegates_existing_read_grants_without_promotion ... ok1755test server_fns::permissions::profile_tests::editor_tests::editor_direct_actor_deactivation_wins_preview_and_load ... ok1756test server_fns::permissions::storage_tests::malformed_stored_grants_fail_without_repair ... ok1757test server_fns::permissions::project_management_tests::reader_tests::manager_reader_requires_current_project_edit_scope_not_identity_or_membership ... ok1758test server_fns::permissions::profile_tests::revocation_winning_gate_denies_new_and_replayed_changes has been running for over 60 seconds1759test server_fns::permissions::project_management_tests::actual_template_command_receipt_cannot_be_reused_for_project_delegation ... ok1760test server_fns::organization::tests::branding_holds_actor_authority_until_its_write_commits ... ok1761test server_fns::permissions::profile_tests::time_entries_tests::time_reads_cancel_without_leaking_locks_or_changing_pool_defaults ... ok1762test server_fns::permissions::profile_tests::simultaneous_losses_require_exact_confirmation_preserve_history_and_never_restore_links ... ok1763test server_fns::permissions::profile_tests::timesheet_people_tests::paging_search_and_identity_filters_only_narrow_current_scope ... ok1764test server_fns::permissions::template_tests::concurrent_creators_never_exceed_fifty_profiles ... ok1765test server_fns::permissions::template_tests::failed_audit_insert_rolls_back_creation_and_detachment ... ok1766test reports::limits::tests::project_authorization::project_exports_preserve_membership_visibility_and_history_rules ... ok1767test server_fns::permissions::profile_tests::subjects_tests::subject_cursor_is_only_a_bound_and_exact_page_has_no_continuation has been running for over 60 seconds1768test server_fns::permissions::template_tests::template_command_waits_for_direct_actor_deactivation_on_replay ... ok1769test server_fns::permissions::template_tests::unknown_grants_and_authority_fields_cannot_deserialize_as_commands ... ok1770test server_fns::permissions::profile_tests::time_entries_tests::time_reads_exclude_foreign_parents_but_preserve_archived_history ... ok1771test server_fns::permissions::profile_tests::unchanged_edit_preserves_identity_source_timestamp_and_revisions ... ok1772test server_fns::project_creation::assignment_tests::finalization_reuses_catalog_and_keeps_lead_overrides_local_on_retry ... ok1773test server_fns::permissions::storage_tests::template_names_are_case_insensitive_and_tenant_local ... ok1774test server_fns::project_creation::assignment_tests::invalid_assignment_graphs_leave_no_partial_creation_or_draft_change ... ok1775test server_fns::project_creation::editing::tests::concurrent_edits_have_one_winner_and_association_writes_invalidate_open_forms ... ok1776test server_fns::permissions::storage_tests::additive_migration_preserves_populated_legacy_records ... ok1777test server_fns::project_creation::editing::tests::editor_keeps_archived_selected_identities_and_nullable_overrides ... ok1778test server_fns::project_creation::editing::tests::editing_milestones_keeps_invoice_snapshots_and_fee_identities_immutable ... ok1779test server_fns::permissions::storage_tests::unicode_name_migration_preserves_existing_templates ... ok1780test server_fns::project_creation::editing::tests::editor_preserves_fee_schedule_and_operational_milestone_ids ... ok1781test server_fns::project_creation::editing::tests::editor_rechecks_tenant_role_and_active_status ... ok1782test server_fns::project_creation::editing::tests::editor_loads_legacy_values_without_fabricating_a_billing_mode_or_draft ... ok1783test server_fns::project_creation::editing::tests::manager_edit_preserves_private_settings_and_cannot_remove_them_indirectly ... ok1784test server_fns::project_creation::editing::tests::editor_recovers_full_configuration_and_redacts_private_values_after_role_change ... ok1785test server_fns::permissions::template_tests::revocation_winning_org_gate_denies_pending_replay_and_new_command ... ok1786test server_fns::project_creation::editing::tests::editor_recovers_each_budget_scope_without_turning_absence_into_zero ... ok1787test server_fns::project_creation::editing::tests::foreign_actor_cannot_save_or_retry_another_organizations_edit ... ok1788test server_fns::permissions::profile_tests::project_people_tests::project_people_cancellation_releases_connection_and_preserves_pool_defaults ... ok1789test server_fns::project_creation::editing::tests::save_edits_the_same_legacy_project_and_never_creates_a_draft_or_configuration ... ok1790test server_fns::project_creation::editing::tests::save_preserves_recorded_time_and_rejects_removing_its_task_or_person ... ok1791test server_fns::project_creation::editing::tests::save_updates_configured_sections_atomically_and_rejects_stale_or_invalid_edits ... ok1792test server_fns::project_creation::editing::tests::task_catalog_and_graph_changes_roll_back_together_on_duplicate_resolution ... ok1793test server_fns::permissions::template_tests::equivalent_names_and_invalid_confirmed_selections_roll_back ... ok1794test server_fns::project_creation::editing::tests::saves_recheck_current_authority_and_do_not_repeat_noops ... ok1795test server_fns::project_creation::tests::billing_schema_rejects_partial_fee_schedules ... ok1796test server_fns::project_creation::tests::client_dialog_validates_details_and_persists_an_explicit_zero_rate ... ok1797test server_fns::permissions::template_tests::delete_replay_does_not_touch_a_same_name_replacement ... ok1798test server_fns::project_creation::tests::creation_actor_is_revalidated_inside_the_transaction ... ok1799test server_fns::project_creation::tests::creation_client_must_be_active_and_in_the_same_organization ... ok1800test server_fns::project_creation::tests::creation_options_are_scoped_bounded_and_redact_manager_costs ... ok1801test server_fns::project_creation::tests::draft_ownership_discard_and_role_changes_are_enforced ... ok1802test server_fns::project_creation::tests::draft_validation_preserves_incomplete_input_but_bounds_its_size ... ok1803test server_fns::permissions::template_tests::template_command_overrides_readonly_defaults_and_keeps_stricter_timeouts ... ok1804test server_fns::project_creation::tests::final_validation_checks_invoice_defaults_and_scoped_budget_totals ... ok1805test server_fns::project_creation::tests::final_validation_preserves_exact_budgets_and_rejects_unavailable_email ... ok1806test server_fns::project_creation::tests::final_validation_requires_complete_fee_schedules_and_distinct_entities ... ok1807test server_fns::project_creation::tests::final_validation_requires_real_details_and_ignores_hidden_type_settings ... ok1808test server_fns::project_creation::tests::draft_schema_enforces_one_current_draft_per_creator ... ok1809test server_fns::project_creation::tests::draft_save_retries_do_not_overwrite_a_newer_revision ... ok1810test server_fns::project_creation::tests::draft_schema_rejects_foreign_creator_and_completed_project ... ok1811test server_fns::project_creation::tests::draft_schema_rejects_oversize_payload_and_invalid_revision ... ok1812test server_fns::project_creation::tests::managers_cannot_store_administrator_notes_or_costs_in_a_draft ... ok1813test server_fns::project_creation::tests::existing_projects_have_no_implicit_new_billing_configuration ... ok1814test server_fns::project_creation::tests::finalization_rechecks_client_role_revision_and_rate_currency ... ok1815test server_fns::permissions::project_management_tests::revocation_winning_gate_denies_waiting_delegation ... ok1816test server_fns::project_creation::tests::finalization_persists_task_access_and_project_only_financial_overrides ... ok1817test server_fns::project_creation::tests::finalize_is_atomic_and_repeated_submission_returns_one_project ... ok1818test server_fns::project_creation::validation::tests::assignment_rejections_identify_the_invalid_row ... ok1819test server_fns::project_creation::validation::tests::basic_rejections_identify_the_field_without_echoing_input ... ok1820test server_fns::project_creation::validation::tests::billing_rejections_identify_the_active_control ... ok1821test server_fns::project_creation::validation::tests::inactive_billing_inputs_remain_in_the_draft_without_blocking_creation ... ok1822test server_fns::project_creation::validation::tests::invoice_rejections_identify_the_field_without_echoing_input ... ok1823test server_fns::project_creation::validation::tests::milestone_rejections_target_the_invalid_row_by_identity ... ok1824test server_fns::project_creation::validation::tests::non_billable_projects_ignore_hidden_invoice_inputs ... ok1825test server_fns::project_creation::validation::tests::task_name_and_access_rejections_identify_the_invalid_row ... ok1826test server_fns::project_creation::tests::invalid_task_rolls_back_project_and_keeps_the_draft ... ok1827test server_fns::project_creation::tests::selected_catalog_bounds_requests_and_excludes_inactive_people ... ok1828test server_fns::project_creation::tests::missing_draft_responses_do_not_disclose_foreign_ownership ... ok1829test server_fns::project_creation::tests::selected_catalog_is_scoped_deduplicated_and_redacts_manager_costs ... ok1830test server_fns::project_creation::tests::selected_client_lookup_is_scoped_and_keeps_archived_identity ... ok1831test server_fns::permissions::template_tests::command_receipts_are_not_shared_between_administrators ... ok1832test server_fns::project_creation::tests::simultaneous_draft_updates_have_one_winner ... ok1833test server_fns::projects::bulk_tests::bulk_database_failure_rolls_back_earlier_changes ... ok1834test server_fns::projects::bulk_tests::bulk_ids_validate_before_writes_and_normalize_duplicates ... ok1835test server_fns::projects::bulk_tests::bulk_accepts_one_hundred_projects_and_mixed_status_noops ... ok1836test server_fns::permissions::template_tests::legacy_future_missing_foreign_and_non_admin_authority_deny ... ok1837test server_fns::permissions::profile_tests::subjects_tests::subject_discovery_requires_current_explicit_identity_and_supported_policy has been running for over 60 seconds1838test server_fns::projects::bulk_tests::bulk_preserves_invoiced_history_assignments_and_spend ... ok1839test server_fns::projects::bulk_tests::bulk_reversed_overlapping_batches_finish_without_deadlock ... ok1840test server_fns::permissions::storage_tests::source_shape_and_revision_constraints_reject_invalid_rows ... ok1841test server_fns::projects::bulk_tests::bulk_missing_or_foreign_project_rolls_back_earlier_changes ... ok1842test server_fns::permissions::project_management_tests::project_delegation_denies_manager_deactivated_before_check ... ok1843test server_fns::projects::bulk_tests::bulk_status_preserves_details_history_and_noop_versions ... ok1844test server_fns::projects::assignment_tests::creation_rejects_foreign_and_unknown_project_or_person ... ok1845test server_fns::projects::mutation_tests::project::both_activation_transitions_preserve_details_and_change_once ... ok1846test server_fns::permissions::storage_tests::storage_does_not_activate_or_infer_legacy_roles ... ok1847test server_fns::projects::mutation_tests::project::budgets_and_rates_distinguish_null_zero_and_normalized_values ... ok1848test server_fns::projects::mutation_tests::project::concurrent_deletion_is_rejected_by_both_mutations ... ok1849test server_fns::projects::mutation_tests::project::configured_edits_recheck_settings_after_waiting_for_the_project ... ok1850test server_fns::projects::mutation_tests::project::configured_edits_preserve_compatible_changes_and_idempotence ... ok1851test server_fns::projects::assignment_tests::assignment_mutations_wait_for_revocation_and_recheck_authority ... ok1852test server_fns::projects::mutation_tests::project::configured_edits_preserve_non_hourly_billing ... ok1853test server_fns::projects::mutation_tests::project::configured_edits_reject_incompatible_financial_changes_atomically ... ok1854test server_fns::importers::commands::tests::authorized_job_lifecycle_and_duplicate_retention_work_with_one_connection ... ok1855test server_fns::projects::mutation_tests::project::inactive_project_edits_preserve_identity_and_reject_implicit_migrations ... ok1856test server_fns::projects::mutation_tests::project::missing_and_foreign_rows_are_not_noops ... ok1857test server_fns::permissions::template_tests::unsupported_receipt_version_fails_without_repeating_the_change ... ok1858test server_fns::projects::mutation_tests::project::repeating_a_competing_deactivation_reports_no_transition ... ok1859test server_fns::projects::mutation_tests::project::invalid_project_fields_leave_the_row_unchanged ... ok1860test server_fns::projects::mutation_tests::project::repeating_a_competing_edit_requires_a_fresh_revision ... ok1861test server_fns::projects::mutation_tests::project::restoring_a_competing_edit_does_not_overwrite_the_other_session ... ok1862test server_fns::projects::mutation_tests::project::restoring_a_competing_deactivation_reports_reactivation ... ok1863test server_fns::projects::mutation_tests::project::unchanged_activation_preserves_the_row ... ok1864test server_fns::projects::mutation_tests::project::unchanged_edit_preserves_the_row ... ok1865test server_fns::projects::mutation_tests::task::both_activation_transitions_preserve_details_and_change_once ... ok1866test server_fns::projects::mutation_tests::task::each_detail_field_changes_once_and_preserves_inactive_status ... ok1867test server_fns::permissions::project_management_tests::transaction_tests::project_and_manager_changes_commit_with_the_same_receipt ... ok1868test server_fns::projects::mutation_tests::task::concurrent_deletion_returns_not_found_for_both_mutations ... ok1869test server_fns::projects::mutation_tests::task::repeating_a_competing_deactivation_reports_no_transition ... ok1870test server_fns::projects::mutation_tests::task::missing_and_foreign_rows_are_not_noops ... ok1871test server_fns::projects::mutation_tests::task::rate_edits_set_currency_without_relabelling_renames_or_noops ... ok1872test server_fns::projects::mutation_tests::task::repeating_a_competing_edit_does_not_report_a_change ... ok1873test server_fns::projects::mutation_tests::task::restoring_a_competing_deactivation_reports_reactivation ... ok1874test server_fns::projects::mutation_tests::task::restoring_a_competing_edit_reports_a_change ... ok1875test server_fns::projects::privacy_tests::client_project_filter_preserves_progress_access_and_rate_redaction ... ok1876test server_fns::projects::mutation_tests::task::unchanged_activation_preserves_the_row ... ok1877test server_fns::projects::privacy_tests::legacy_members_retain_progress_without_new_settings ... ok1878test server_fns::projects::mutation_tests::task::unchanged_edit_preserves_the_row ... ok1879test server_fns::permissions::template_tests::concurrent_exact_retry_creates_one_receipt_without_changing_people ... ok1880test server_fns::projects::privacy_tests::private_progress_does_not_prevent_tracking_or_reveal_financial_fields ... ok1881test server_fns::projects::privacy_tests::project_members_and_leads_receive_progress_without_rates ... ok1882test server_fns::projects::privacy_tests::outsiders_and_inactive_viewers_have_no_project_reads ... ok1883test server_fns::projects::privacy_tests::project_reads_use_current_authority_and_reject_foreign_scope ... ok1884test server_fns::projects::tests::creating_a_project_task_enables_it_with_its_defaults ... ok1885test server_fns::projects::privacy_tests::revoked_membership_preserves_only_own_historical_tracking_identity ... ok1886test server_fns::projects::tests::assignments_are_scoped_to_the_viewers_organization ... ok1887test server_fns::projects::tests::enabling_tasks_only_inherits_rates_used_by_configured_projects ... ok1888test server_fns::projects::tests::project_rate_distinguishes_inheritance_zero_and_exact_amounts ... ok1889test server_fns::projects::tests::enabling_is_tenant_scoped_even_for_existing_links_and_preserves_overrides ... ok1890test server_fns::projects::tests::enabling_tasks_accepts_exact_project_currency_rates_and_preserves_existing_links ... ok1891test server_fns::projects::tests::enabling_tasks_rejects_incompatible_catalog_currency ... ok1892test server_fns::projects::tests::enabling_tasks_rejects_explicit_rates_unused_by_the_project ... ok1893test server_fns::projects::tests::enabling_tasks_rejects_invalid_or_wrong_currency_explicit_rates_without_linking ... ok1894test server_fns::projects::tests::managers_and_admins_can_read_assignment_rates ... ok1895test server_fns::projects::tests::failed_project_task_creation_leaves_no_orphan_task ... ok1896test server_fns::projects::tests::members_can_list_identities_but_not_assignment_rates ... ok1897test server_fns::projects::tests::project_rate_sql_matches_rust_for_missing_zero_and_present_sources ... ok1898test server_fns::projects::tests::project_rate_helper_has_no_public_execute_grant ... ok1899test server_fns::invoices::tests::invoice_preview_rejects_large_results_instead_of_truncating_them ... ok1900test server_fns::projects::tests::unknown_catalog_currency_requires_explicit_configured_rates_but_preserves_legacy ... ok1901test server_fns::permissions::project_management_tests::historical_replay_does_not_reapply_removed_or_now_ineligible_designations ... ok1902test server_fns::reports::tests::filters_and_renames_keep_report_identity_and_totals ... ok1903test server_fns::invoices::fee_tests::draft_fee_edit_requires_current_balance_and_exact_excess_confirmation ... ok1904test server_fns::permissions::profile_tests::time_entries_tests::time_reads_recheck_grants_relationships_and_activity_after_wait has been running for over 60 seconds1905test server_fns::snapshot::reader_tests::legacy_invoice_detail_keeps_metadata_and_lines_in_one_snapshot ... ok1906test server_fns::project_creation::import_tests::imported_catalog_rate_cannot_be_relabelled_as_workspace_currency ... ok1907test server_fns::time_entries::activity_tests::admitted_time_writer_finishes_before_account_deactivation ... ok1908test server_fns::permissions::profile_tests::subjects_tests::subject_discovery_requires_current_explicit_identity_and_supported_policy ... ok1909test server_fns::time_entries::activity_tests::cancelled_time_writer_releases_fences_and_preserves_pool_defaults ... ok1910test server_fns::time_entries::tests::a_limit_bounds_a_listing_on_its_own ... ok1911test server_fns::time_entries::tests::a_reorder_rejects_foreign_missing_timed_and_duplicate_ids ... ok1912test server_fns::permissions::profile_tests::timesheet_people_tests::profiles_and_custom_grants_use_time_scope_not_legacy_role_or_directory ... ok1913test server_fns::time_entries::activity_tests::every_time_mutation_denies_inactive_and_missing_owners_without_changes ... ok1914test server_fns::time_entries::activity_tests::waiting_time_writer_rechecks_committed_or_rolled_back_deactivation ... ok1915test server_fns::time_entries::tests::an_unlimited_listing_needs_both_ends_of_the_range ... ok1916test server_fns::time_entries::tests::a_running_timer_cannot_be_moved_to_another_day ... ok1917test server_fns::time_entries::tests::clamps_duration_against_the_snapped_start ... ok1918test server_fns::time_entries::tests::admin_may_log_time_without_assignment ... ok1919test server_fns::permissions::template_tests::malformed_assignee_aborts_all_detachments ... ok1920test server_fns::time_entries::tests::an_open_entry_can_move_into_a_day_with_locked_time ... ok1921test server_fns::time_entries::tests::assigned_member_may_log_time ... ok1922test server_fns::time_entries::tests::concurrent_timer_starts_insert_exactly_one_entry ... ok1923test server_fns::time_entries::tests::moving_locked_time_rejects_the_entire_reorder ... ok1924test server_fns::approvals::isolation_tests::own_organization_can_reopen_without_unlocking_invoiced_entries ... ok1925test server_fns::time_entries::tests::rejects_out_of_range_start ... ok1926test server_fns::time_entries::tests::snaps_unaligned_start_to_the_grid ... ok1927test server_fns::time_entries::tests::inactive_project_cannot_accept_new_time_even_for_admin ... ok1928test server_fns::time_entries::tests::edits_preserve_archived_time_but_cannot_override_non_billability ... ok1929test server_fns::time_entries::tests::new_time_and_picker_require_a_project_task_link ... ok1930test server_fns::time_entries::tests::untimed_start_is_left_untouched ... ok1931test server_fns::time_entries::tests::submission_barrier_blocks_edits_and_cross_week_reorders ... ok1932test server_fns::time_entries::tests::unassigned_member_is_forbidden ... ok1933test server_fns::time_entries::tests::new_time_and_picker_reject_inactive_or_foreign_contexts ... ok1934test server_fns::time_entries::tests::submission_barrier_blocks_manual_entries_and_timer_starts ... ok1935test server_fns::permissions::project_management_tests::receipt_conflicts_precede_decoding_and_replay_requires_current_authority ... ok1936test server_fns::time_entries::tests::new_time_uses_effective_billability_for_manual_entries_and_timers ... ok1937test server_fns::time_entries::update_tests::each_editable_field_changes_once_including_nulls ... ok1938test server_fns::time_entries::update_tests::competing_edit_that_restores_old_values_still_reports_a_change ... ok1939test server_fns::time_entries::update_tests::concurrent_lock_or_delete_is_rechecked_before_editing ... ok1940test server_fns::time_entries::update_tests::competing_identical_edit_is_a_noop_after_the_first_commit ... ok1941test server_fns::time_entries::update_tests::effective_billability_noop_preserves_the_row ... ok1942test server_fns::projects::details_tests::project_details_only_offer_task_rate_currency_to_current_managers ... ok1943test server_fns::time_entries::update_tests::inactive_owner_cannot_edit_time_after_session_lookup ... ok1944test server_fns::time_entries::update_tests::missing_foreign_and_locked_entries_are_not_noops ... ok1945test server_fns::permissions::project_management_tests::designation_is_required_before_managed_editor_can_delegate has been running for over 60 seconds1946test server_fns::time_entries::update_tests::restricted_empty_task_rejects_changes_and_noop_edits ... ok1947test server_fns::time_entries::update_tests::restricted_empty_task_rejects_picker_manual_and_timer_starts ... ok1948test server_fns::time_entries::update_tests::normalized_noop_preserves_the_row_and_updated_at ... ok1949test server_fns::time_entries::update_tests::restricted_task_rejects_reschedule_and_delete ... ok1950test server_fns::time_entries::update_tests::restricted_reordering_rejects_the_whole_batch ... ok1951test server_fns::snapshot::reader_tests::legacy_readers_hold_reader_first_authority_until_materialized ... ok1952test server_fns::time_entries::update_tests::revoked_timer_stop_preserves_the_open_state_guard ... ok1953test server_fns::time_entries::update_tests::revoked_grant_does_not_trap_an_own_running_timer ... ok1954test server_fns::time_entries::update_tests::restriction_changes_are_rechecked_before_manual_or_timer_insertion ... ok1955test server_fns::time_entries::update_tests::task_grant_revocation_committed_during_an_edit_is_rechecked ... ok1956test server_fns::time_entries::update_tests::task_grants_allow_tracking_and_archived_history_for_every_role ... ok1957test server_fns::project_creation::editing::tests::editor_load_uses_current_role_across_all_billing_configurations ... ok1958test server_fns::users::tests::concurrency::access_changes_cannot_target_another_organization ... ok1959test server_fns::snapshot::reader_tests::legacy_readers_deny_writer_first_revocation ... ok1960test server_fns::users::tests::concurrency::concurrent_deactivations_keep_an_active_admin ... ok1961test server_fns::permissions::project_management_tests::project_delegation_retains_added_manager_activity_until_commit has been running for over 60 seconds1962test server_fns::users::tests::concurrency::concurrent_demotions_keep_an_active_admin ... ok1963test server_fns::snapshot::reader_tests::legacy_readers_preserve_actor_tenant_filters_and_missing_resources ... ok1964test server_fns::users::tests::concurrency::deactivation_and_demotion_keep_an_active_admin ... ok1965test server_fns::users::tests::concurrency::the_last_admin_cannot_be_demoted_or_deactivated ... ok1966test server_fns::users::tests::concurrency::demotion_and_deactivation_keep_an_active_admin ... ok1967test server_fns::permissions::template_tests::create_canonical_retry_returns_one_historical_change ... ok1968test server_fns::permissions::project_management_tests::reader_tests::manager_reader_rechecks_revocation_after_the_organization_wait has been running for over 60 seconds1969test server_fns::users::tests::authority::foreign_and_unknown_actors_cannot_change_local_user_access ... ok1970test server_fns::users::tests::concurrency::unchanged_admin_access_is_allowed ... ok1971test server_fns::users::tests::authority::duplicate_creation_rolls_back_and_leaves_access_changes_usable ... ok1972test server_fns::users::tests::authority::access_transaction_holds_actor_authority_until_commit ... ok1973test server_fns::reports::tests::report_uses_current_active_actor_and_tenant_for_every_filter ... ok1974test server_fns::project_creation::locking_tests::every_project_entry_gates_before_actor_and_rechecks_revocation ... ok1975test server_fns::reports::tests::tag_filters_keep_report_dimensions_and_details_in_sync ... ok1976test server_fns::permissions::storage_tests::unicode_name_collision_rolls_back_migration_without_changing_profiles has been running for over 60 seconds1977test server_fns::permissions::template_tests::actor_share_lock_does_not_block_template_command has been running for over 60 seconds1978test server_fns::permissions::profile_tests::project_people_tests::project_people_validates_bounded_input_only_after_authorization ... ok1979test server_fns::projects::assignment_tests::removal_preserves_foreign_and_malformed_assignments ... ok1980test server_fns::permissions::template_tests::delete_preserves_adjusted_grants_identity_and_business_rows has been running for over 60 seconds1981test server_fns::users::tests::concurrency::repeatable_read_default_cannot_remove_every_administrator ... ok1982test server_fns::permissions::profile_tests::editor_tests::editor_preview_matches_saved_effects_without_writing ... ok1983test server_fns::permissions::template_tests::invalid_stored_authority_and_template_grants_fail_closed has been running for over 60 seconds1984test server_fns::permissions::profile_tests::concurrent_self_demotions_leave_one_active_explicit_administrator ... ok1985test server_fns::permissions::template_tests::receipts_enforce_tenant_exclusive_principal_and_request_uniqueness has been running for over 60 seconds1986test reports::streaming::database_tests::authorization::streamed_authority_releases_successful_locks_and_overrides_inherited_settings ... ok1987test server_fns::permissions::template_tests::actor_share_lock_does_not_block_template_command ... ok1988test server_fns::projects::assignment_tests::own_assignment_lifecycle_preserves_role_and_duplicate_behavior ... ok1989test server_fns::permissions::template_tests::stale_foreign_and_exhausted_revisions_never_partially_delete has been running for over 60 seconds1990test server_fns::users::tests::authority::user_mutations_wait_for_actor_revocation_and_recheck_after_commit ... ok1991test server_fns::projects::assignment_tests::project_membership_and_task_callers_wait_before_authorizing ... ok1992test server_fns::permissions::template_tests::delete_preserves_adjusted_grants_identity_and_business_rows ... ok1993test server_fns::projects::assignment_tests::stale_administrator_cannot_create_or_remove_after_revocation ... ok1994test server_fns::permissions::template_tests::stale_foreign_and_exhausted_revisions_never_partially_delete ... ok1995test server_fns::permissions::template_tests::invalid_stored_authority_and_template_grants_fail_closed ... ok1996test server_fns::permissions::profile_tests::revocation_winning_gate_denies_new_and_replayed_changes ... ok1997test server_fns::users::tests::authority::user_mutations_recheck_revocation_after_waiting_for_organization_lock ... ok1998test server_fns::project_creation::import_tests::imports_preserve_finalized_project_configuration_and_restricted_access has been running for over 60 seconds1999test server_fns::project_creation::import_tests::imports_preserve_finalized_project_configuration_and_restricted_access ... ok2000test server_fns::users::tests::authority::revoked_administrator_cannot_create_change_roles_or_deactivate ... ok2001test server_fns::users::tests::authority::active_administrator_can_create_change_roles_and_deactivate ... ok2002test server_fns::projects::details_tests::project_details_and_tags_follow_current_progress_and_private_permissions has been running for over 60 seconds2003test server_fns::projects::details_tests::unlinked_and_private_project_tags_do_not_leak_into_filters has been running for over 60 seconds2004test server_fns::projects::details_tests::project_details_and_tags_follow_current_progress_and_private_permissions ... ok2005test server_fns::projects::details_tests::unlinked_and_private_project_tags_do_not_leak_into_filters ... ok2006test server_fns::users::tests::authority::project_editor_and_user_revocation_commit_in_gate_order ... ok2007test server_fns::time_entries::update_tests::assignment_cascade_allows_an_inflight_entry_project_fk_to_finish ... ok2008test server_fns::permissions::profile_tests::subjects_tests::subject_cursor_is_only_a_bound_and_exact_page_has_no_continuation ... ok2009test server_fns::snapshot::reader_tests::legacy_readers_reject_revoked_session_identity ... ok2010test server_fns::reports::tests::manager_report_omits_groups_containing_private_project_costs has been running for over 60 seconds2011test server_fns::reports::tests::same_names_keep_separate_groups_for_every_dimension has been running for over 60 seconds2012test server_fns::reports::tests::shared_person_and_task_are_partitioned_by_currency has been running for over 60 seconds2013test server_fns::snapshot::reader_tests::legacy_readers_cancel_without_retaining_authority_or_pool_connection has been running for over 60 seconds2014test server_fns::snapshot::reader_tests::legacy_readers_preserve_inherited_connection_settings has been running for over 60 seconds2015test server_fns::snapshot::reader_tests::legacy_readers_preserve_inherited_connection_settings ... ok2016test server_fns::permissions::profile_tests::profile_command_rechecks_target_activation_before_demotion ... ok2017test server_fns::permissions::storage_tests::unicode_name_collision_rolls_back_migration_without_changing_profiles ... ok2018test server_fns::reports::tests::same_names_keep_separate_groups_for_every_dimension ... ok2019test server_fns::permissions::audit_tests::revocation_winning_gate_denies_waiting_historical_reader ... ok2020test server_fns::reports::tests::manager_report_omits_groups_containing_private_project_costs ... ok2021test server_fns::permissions::profile_tests::project_people_tests::project_people_rechecks_designation_after_waiting_for_revocation ... ok2022test server_fns::snapshot::reader_tests::legacy_readers_cancel_without_retaining_authority_or_pool_connection ... ok2023test server_fns::permissions::profile_tests::time_entries_tests::time_reads_recheck_grants_relationships_and_activity_after_wait ... ok2024test server_fns::permissions::project_management_tests::reader_tests::manager_reader_rechecks_revocation_after_the_organization_wait ... ok2025test server_fns::permissions::project_management_tests::project_delegation_retains_added_manager_activity_until_commit ... ok2026test server_fns::permissions::project_management_tests::designation_is_required_before_managed_editor_can_delegate ... ok2027test server_fns::reports::tests::shared_person_and_task_are_partitioned_by_currency ... ok2028test server_fns::permissions::template_tests::receipts_enforce_tenant_exclusive_principal_and_request_uniqueness ... ok20292030failures:20312032---- importers::harvest::engine_tests::csv_streaming::durable_csv_cancel_preserves_its_completed_batches_for_manual_retry stdout ----20332034thread 'importers::harvest::engine_tests::csv_streaming::durable_csv_cancel_preserves_its_completed_batches_for_manual_retry' (2271) panicked at crates/horae/src/importers/harvest/engine_tests/csv_streaming.rs:494:5:2035a durable batch must commit before source EOF2036note: run with `RUST_BACKTRACE=1` environment variable to display a backtrace20372038---- importers::harvest::engine_tests::csv_streaming::durable_csv_preview_cancel_preserves_simulation_for_manual_retry stdout ----20392040thread 'importers::harvest::engine_tests::csv_streaming::durable_csv_preview_cancel_preserves_simulation_for_manual_retry' (2343) panicked at crates/horae/src/importers/harvest/engine_tests/csv_streaming.rs:494:5:2041a durable batch must commit before source EOF20422043---- importers::harvest::engine_tests::csv_streaming::durable_csv_preview_rejects_a_stale_next_batch stdout ----20442045thread 'importers::harvest::engine_tests::csv_streaming::durable_csv_preview_rejects_a_stale_next_batch' (2405) panicked at crates/horae/src/importers/harvest/engine_tests/csv_streaming.rs:494:5:2046a durable batch must commit before source EOF20472048---- importers::harvest::engine_tests::csv_streaming::durable_csv_resumes_committed_batches_without_recounting_duplicate_rows stdout ----20492050thread 'importers::harvest::engine_tests::csv_streaming::durable_csv_resumes_committed_batches_without_recounting_duplicate_rows' (2415) panicked at crates/horae/src/importers/harvest/engine_tests/csv_streaming.rs:494:5:2051a durable batch must commit before source EOF20522053---- importers::harvest::engine_tests::csv_streaming::durable_csv_waits_for_input_without_an_open_transaction stdout ----20542055thread 'importers::harvest::engine_tests::csv_streaming::durable_csv_waits_for_input_without_an_open_transaction' (2434) panicked at crates/horae/src/importers/harvest/engine_tests/csv_streaming.rs:73:18:2056called `Result::unwrap()` on an `Err` value: Elapsed(())20572058---- importers::harvest::engine_tests::csv_streaming::durable_csv_preview_matches_existing_and_new_rows_with_one_connection stdout ----20592060thread 'importers::harvest::engine_tests::csv_streaming::durable_csv_preview_matches_existing_and_new_rows_with_one_connection' (2367) panicked at crates/horae/src/importers/harvest/engine_tests/csv_streaming.rs:366:6:2061called `Result::unwrap()` on an `Err` value: Elapsed(())206220632064failures:2065 importers::harvest::engine_tests::csv_streaming::durable_csv_cancel_preserves_its_completed_batches_for_manual_retry2066 importers::harvest::engine_tests::csv_streaming::durable_csv_preview_cancel_preserves_simulation_for_manual_retry2067 importers::harvest::engine_tests::csv_streaming::durable_csv_preview_matches_existing_and_new_rows_with_one_connection2068 importers::harvest::engine_tests::csv_streaming::durable_csv_preview_rejects_a_stale_next_batch2069 importers::harvest::engine_tests::csv_streaming::durable_csv_resumes_committed_batches_without_recounting_duplicate_rows2070 importers::harvest::engine_tests::csv_streaming::durable_csv_waits_for_input_without_an_open_transaction20712072test result: FAILED. 1149 passed; 6 failed; 11 ignored; 0 measured; 0 filtered out; finished in 1371.92s20732074error: test failed, to rerun pass `-p horae --bin horae`