nixbot

builds

succeeded setup checks.x86_64-linux.tests · build #586 · raw

1this derivation will be built:2 /nix/store/22brmjkz0f79qq6x45knqa0mh7ib923m-horae-tests-0.1.0.drv3error: Cannot build '/nix/store/22brmjkz0f79qq6x45knqa0mh7ib923m-horae-tests-0.1.0.drv'.4 Reason: builder failed with exit code 101.5 Output paths:6 /nix/store/n1ywisjy1dqkvnahwr90nwydsqhp66wx-horae-tests-0.1.07 Last 25 log lines:8 > thread 'importers::harvest::engine_tests::csv_streaming::durable_csv_resumes_committed_batches_without_recounting_duplicate_rows' (2415) panicked at crates/horae/src/importers/harvest/engine_tests/csv_streaming.rs:494:5:9 > a durable batch must commit before source EOF10 >11 > ---- importers::harvest::engine_tests::csv_streaming::durable_csv_waits_for_input_without_an_open_transaction stdout ----12 >13 > thread 'importers::harvest::engine_tests::csv_streaming::durable_csv_waits_for_input_without_an_open_transaction' (2434) panicked at crates/horae/src/importers/harvest/engine_tests/csv_streaming.rs:73:18:14 > called `Result::unwrap()` on an `Err` value: Elapsed(())15 >16 > ---- importers::harvest::engine_tests::csv_streaming::durable_csv_preview_matches_existing_and_new_rows_with_one_connection stdout ----17 >18 > thread 'importers::harvest::engine_tests::csv_streaming::durable_csv_preview_matches_existing_and_new_rows_with_one_connection' (2367) panicked at crates/horae/src/importers/harvest/engine_tests/csv_streaming.rs:366:6:19 > called `Result::unwrap()` on an `Err` value: Elapsed(())20 >21 >22 > failures:23 > importers::harvest::engine_tests::csv_streaming::durable_csv_cancel_preserves_its_completed_batches_for_manual_retry24 > importers::harvest::engine_tests::csv_streaming::durable_csv_preview_cancel_preserves_simulation_for_manual_retry25 > importers::harvest::engine_tests::csv_streaming::durable_csv_preview_matches_existing_and_new_rows_with_one_connection26 > importers::harvest::engine_tests::csv_streaming::durable_csv_preview_rejects_a_stale_next_batch27 > importers::harvest::engine_tests::csv_streaming::durable_csv_resumes_committed_batches_without_recounting_duplicate_rows28 > importers::harvest::engine_tests::csv_streaming::durable_csv_waits_for_input_without_an_open_transaction29 >30 > test result: FAILED. 1149 passed; 6 failed; 11 ignored; 0 measured; 0 filtered out; finished in 1371.92s31 >32 > error: test failed, to rerun pass `-p horae --bin horae`33 For full logs, run:34 nix log /nix/store/22brmjkz0f79qq6x45knqa0mh7ib923m-horae-tests-0.1.0.drv