this derivation will be built: /nix/store/pid66zfwfv0p5zp9gy367nxicgg17f39-horae-tests-0.1.0.drv error: Cannot build '/nix/store/pid66zfwfv0p5zp9gy367nxicgg17f39-horae-tests-0.1.0.drv'. Reason: builder failed with exit code 101. Output paths: /nix/store/v3mhdw3c0yv0lia10w1sc3j3wx610gp2-horae-tests-0.1.0 Last 25 log lines: > > running 5 tests > test invalid_remote_arguments_have_a_machine_readable_exit ... ok > test remote_configuration_errors_are_json_and_do_not_load_server_configuration ... ok > test executable_wait_and_failure_exit_codes_match_the_json_contract ... FAILED > test interrupting_the_executable_waiter_keeps_job_identity_and_never_sends_cancel ... ok > test executable_commands_use_the_documented_authenticated_wire_contract ... ok > > failures: > > ---- executable_wait_and_failure_exit_codes_match_the_json_contract stdout ---- > > thread 'executable_wait_and_failure_exit_codes_match_the_json_contract' (6580) panicked at crates/horae/tests/cli_imports.rs:330:13: > assertion `left == right` failed: ["jobs", "wait", "01a11ad2-e680-74c2-a7d4-3bda51c2a8fe", "--timeout", "1"]: {"error":{"category":"timeout","message":"Wait deadline reached; job was not cancelled"},"job_id":"01a11ad2-e680-74c2-a7d4-3bda51c2a8fe","operation":"jobs.wait","outcome":"error","version":1} > left: Some(5) > right: Some(3) > note: run with `RUST_BACKTRACE=1` environment variable to display a backtrace > > > failures: > executable_wait_and_failure_exit_codes_match_the_json_contract > > test result: FAILED. 4 passed; 1 failed; 0 ignored; 0 measured; 0 filtered out; finished in 8.76s > > error: test failed, to rerun pass `-p horae --test cli_imports` For full logs, run: nix log /nix/store/pid66zfwfv0p5zp9gy367nxicgg17f39-horae-tests-0.1.0.drv