nixbot

builds

succeeded setup checks.x86_64-linux.tests · build #494 · raw

1this derivation will be built:2 /nix/store/fk1l3qgq1r9dzp3v1pcmkvlmqp3czj6i-horae-tests-0.1.0.drv3error: Cannot build '/nix/store/fk1l3qgq1r9dzp3v1pcmkvlmqp3czj6i-horae-tests-0.1.0.drv'.4 Reason: builder failed with exit code 101.5 Output paths:6 /nix/store/zsacxfwbsl4mc8s9fa9iygz9p32ymcs0-horae-tests-0.1.07 Last 25 log lines:8 > ---- importers::harvest::engine_tests::csv_streaming::durable_csv_reclaimed_lease_cannot_commit_the_next_batch stdout ----9 >10 > thread 'importers::harvest::engine_tests::csv_streaming::durable_csv_reclaimed_lease_cannot_commit_the_next_batch' (2019) panicked at crates/horae/src/importers/harvest/engine_tests/csv_streaming.rs:338:5:11 > a durable batch must commit before source EOF12 >13 > ---- importers::harvest::engine_tests::csv_streaming::durable_csv_resumes_committed_batches_without_recounting_duplicate_rows stdout ----14 >15 > thread 'importers::harvest::engine_tests::csv_streaming::durable_csv_resumes_committed_batches_without_recounting_duplicate_rows' (2033) panicked at crates/horae/src/importers/harvest/engine_tests/csv_streaming.rs:338:5:16 > a durable batch must commit before source EOF17 > note: run with `RUST_BACKTRACE=1` environment variable to display a backtrace18 >19 > ---- importers::harvest::engine_tests::csv_streaming::durable_csv_preview_resumes_after_a_crash_without_recounting_rows stdout ----20 >21 > thread 'importers::harvest::engine_tests::csv_streaming::durable_csv_preview_resumes_after_a_crash_without_recounting_rows' (2018) panicked at crates/horae/src/importers/harvest/engine_tests/csv_streaming.rs:338:5:22 > a durable batch must commit before source EOF23 >24 >25 > failures:26 > importers::harvest::engine_tests::csv_streaming::durable_csv_preview_resumes_after_a_crash_without_recounting_rows27 > importers::harvest::engine_tests::csv_streaming::durable_csv_reclaimed_lease_cannot_commit_the_next_batch28 > importers::harvest::engine_tests::csv_streaming::durable_csv_resumes_committed_batches_without_recounting_duplicate_rows29 >30 > test result: FAILED. 823 passed; 3 failed; 11 ignored; 0 measured; 0 filtered out; finished in 190.26s31 >32 > error: test failed, to rerun pass `-p horae --bin horae`33 For full logs, run:34 nix log /nix/store/fk1l3qgq1r9dzp3v1pcmkvlmqp3czj6i-horae-tests-0.1.0.drv