failed attributes
| status |
attribute |
duration |
| failed |
checks.aarch64-linux.clippy
|
28m 32s |
horae-clippy-0.1.0:
Checking horae-core v0.1.0 (/build/source/crates/core)
Finished `dev` profile [unoptimized + debuginfo] target(s) in 52.54s
+++ comm …
horae-clippy-0.1.0:
Checking horae-core v0.1.0 (/build/source/crates/core)
Finished `dev` profile [unoptimized + debuginfo] target(s) in 52.54s
+++ command cargo clippy -p horae --features server --all-targets -- -D warnings -W clippy::perf
Compiling horae v0.1.0 (/build/source/crates/horae)
Checking horae-core v0.1.0 (/build/source/crates/core)
error: could not compile `horae` (bin "horae" test)
Caused by:
process didn't exit successfully: `/nix/store/hjgh23038sv98mkszp9lr4qknqjqpwl1-rust-mixed/bin/clippy-driver rustc --crate-name horae --edition=2024 crates/horae/src/main.rs --error-format=json --json=diagnostic-rendered-ansi,artifacts,future-incompat --emit=dep-info,metadata -C embed-bitcode=no -C debuginfo=2 --test --cfg 'feature="default"' --cfg 'feature="server"' --check-cfg 'cfg(docsrs,test)' --check-cfg 'cfg(feature, values("default", "server", "web"))' -C metadata=3ae0677f7afbc510 -C extra-filename=-b79d91d0e2618f03 --out-dir /build/source/target/debug/deps -L dependency=/build/source/target/debug/deps --extern anyhow=/build/source/t…
|
| failed |
checks.aarch64-linux.e2e-oidc
|
22m 32s |
vm-test-run-horae-e2e-oidc:
!!! File "<string>", line 5, in <module>
!!! retry(lambda _: "connecting to host..." in server.get_console_log(), timeout_seco …
vm-test-run-horae-e2e-oidc:
!!! File "<string>", line 5, in <module>
!!! retry(lambda _: "connecting to host..." in server.get_console_log(), timeout_seconds=900)
!!!
!!! RequestedAssertionFailed: action timed out after 900.97 seconds (timeout=900)
cleanup
kill QemuMachine (pid 12)
server # qemu-system-aarch64: terminating on signal 15 from pid 6 (/nix/store/smwd56pl54f0pcjdspgh5vnf20c8xwsc-python3-3.13.13/bin/python3.13)
(finished: cleanup, in 0.29 seconds)
|
| failed |
checks.aarch64-linux.sqlx-prepare
|
25m 1s |
horae-sqlx-prepare-0.1.0:
Applied 47/migrate permission template name collation (7.716118ms)
+++ command cargo sqlx prepare --workspace --check -- --features se …
horae-sqlx-prepare-0.1.0:
Applied 47/migrate permission template name collation (7.716118ms)
+++ command cargo sqlx prepare --workspace --check -- --features server --all-targets
Compiling horae v0.1.0 (/build/source/crates/horae)
Checking horae-core v0.1.0 (/build/source/crates/core)
error: could not compile `horae` (bin "horae" test)
Caused by:
process didn't exit successfully: `rustc --crate-name horae --edition=2024 crates/horae/src/main.rs --error-format=json --json=diagnostic-rendered-ansi,artifacts,future-incompat --emit=dep-info,metadata -C embed-bitcode=no -C debuginfo=2 --test --cfg 'feature="default"' --cfg 'feature="server"' --check-cfg 'cfg(docsrs,test)' --check-cfg 'cfg(feature, values("default", "server", "web"))' -C metadata=e37f7552d41161e6 -C extra-filename=-4c23e829d0120aed --out-dir /build/source/target/debug/deps -L dependency=/build/source/target/debug/deps --extern anyhow=/build/source/target/debug/deps/libanyhow-8a13c592572915cb.rmeta --extern axum=/build/so…
error: `cargo check` failed with status: exit status: 101
|
| failed |
checks.aarch64-linux.tests
|
16m 27s |
horae-tests-0.1.0:
warning: build failed, waiting for other jobs to finish...
error: linking with `cc` failed: exit status: 1
|
= note: "cc" "/build/source …
horae-tests-0.1.0:
warning: build failed, waiting for other jobs to finish...
error: linking with `cc` failed: exit status: 1
|
= note: "cc" "/build/source/target/debug/deps/rustcqhUWXu/symbols.o" "<17 object files omitted>" "-Wl,--as-needed" "-Wl,-Bstatic" "/build/source/target/debug/deps/{librust_xlsxwriter-1cc50daf3c2bf4a0,libzip-3f204359bd9edede,libzopfli-407dacfc7bb7cafa,libtypst_pdf-2c8369c7eac9474c,libkrilla_svg-ba0918eb55ba272e,libresvg-368e8f696c3d4043,librgb-ada14a83bb926402,libtiny_skia-9298ff7bb8f4cabc,libkrilla-483477f15f899ab6,libsubsetter-b433211d6c60d38b,libwrite_fonts-087c42bc71cf675a,libhayro_write-28cd47fc58f609da,libxmp_writer-16c78c58adc8c948,libpdf_writer-6c11060832735a20,libtypst_as_lib-448404cdae7721b6,libdirs-ae484b77501a9fb1,libdirs_sys-0…
= note: some arguments are omitted. use `--verbose` to show all linker arguments
= note: /nix/store/vfw9ldx2fqqcmz43cxb5hlcrrayd78mh-binutils-wrapper-2.46/bin/ld: line 292: 1763 Killed /nix/store/xy2zvwkq0rsm0gqlzjbd14vzf8vqv3ic-binutils-2.46/bin/ld ${extraBefore+"${extraBefore[@]}"} ${params+"${params[@]}"} ${extraAfter+"${extraAfter[@]}"}
collect2: error: ld returned 137 exit status
error: could not compile `horae` (bin "horae") due to 1 previous error
|
| failed |
checks.x86_64-linux.tests
|
21m 29s |
horae-tests-0.1.0:
failures:
---- reports::streaming::database_tests::authorization::streamed_cancelled_fetch_reclaims_connection_without_authority_locks stdout …
horae-tests-0.1.0:
failures:
---- reports::streaming::database_tests::authorization::streamed_cancelled_fetch_reclaims_connection_without_authority_locks stdout ----
thread 'reports::streaming::database_tests::authorization::streamed_cancelled_fetch_reclaims_connection_without_authority_locks' (4601) panicked at crates/horae/src/reports/streaming/database_tests/authorization.rs:682:6:
cancelled export must close its connection: Elapsed(())
failures:
reports::streaming::database_tests::authorization::streamed_cancelled_fetch_reclaims_connection_without_authority_locks
test result: FAILED. 1097 passed; 1 failed; 11 ignored; 0 measured; 0 filtered out; finished in 352.89s
error: test failed, to rerun pass `-p horae --bin horae`
|