failed attributes
| status |
attribute |
duration |
| failed |
checks.aarch64-linux.clippy
|
41m 36s |
horae-clippy-0.1.0:
Checking horae-core v0.1.0 (/build/source/crates/core)
Finished `dev` profile [unoptimized + debuginfo] target(s) in 33.59s
+++ comm …
horae-clippy-0.1.0:
Checking horae-core v0.1.0 (/build/source/crates/core)
Finished `dev` profile [unoptimized + debuginfo] target(s) in 33.59s
+++ command cargo clippy -p horae --features server --all-targets -- -D warnings -W clippy::perf
Compiling horae v0.1.0 (/build/source/crates/horae)
Checking horae-core v0.1.0 (/build/source/crates/core)
error: could not compile `horae` (bin "horae" test)
Caused by:
process didn't exit successfully: `/nix/store/hjgh23038sv98mkszp9lr4qknqjqpwl1-rust-mixed/bin/clippy-driver rustc --crate-name horae --edition=2024 crates/horae/src/main.rs --error-format=json --json=diagnostic-rendered-ansi,artifacts,future-incompat --emit=dep-info,metadata -C embed-bitcode=no -C debuginfo=2 --test --cfg 'feature="default"' --cfg 'feature="server"' --check-cfg 'cfg(docsrs,test)' --check-cfg 'cfg(feature, values("default", "server", "web"))' -C metadata=3ae0677f7afbc510 -C extra-filename=-b79d91d0e2618f03 --out-dir /build/source/target/debug/deps -L dependency=/build/source/target/debug/deps --extern anyhow=/build/source/t…
|
| failed |
checks.aarch64-linux.e2e
|
22m 42s |
vm-test-run-horae-e2e:
!!! File "<string>", line 8, in <module>
!!! retry(lambda _: "connecting to host..." in server.get_console_log(), timeout_seconds=9 …
vm-test-run-horae-e2e:
!!! File "<string>", line 8, in <module>
!!! retry(lambda _: "connecting to host..." in server.get_console_log(), timeout_seconds=900)
!!!
!!! RequestedAssertionFailed: action timed out after 900.20 seconds (timeout=900)
cleanup
kill QemuMachine (pid 12)
server # qemu-system-aarch64: terminating on signal 15 from pid 6 (/nix/store/smwd56pl54f0pcjdspgh5vnf20c8xwsc-python3-3.13.13/bin/python3.13)
(finished: cleanup, in 0.45 seconds)
|
| failed |
checks.aarch64-linux.tests
|
21m 8s |
horae-tests-0.1.0:
= note: some arguments are omitted. use `--verbose` to show all linker arguments
= note: /nix/store/vfw9ldx2fqqcmz43cxb5hlcrrayd78mh-binu …
horae-tests-0.1.0:
= note: some arguments are omitted. use `--verbose` to show all linker arguments
= note: /nix/store/vfw9ldx2fqqcmz43cxb5hlcrrayd78mh-binutils-wrapper-2.46/bin/ld: line 292: 1766 Killed /nix/store/xy2zvwkq0rsm0gqlzjbd14vzf8vqv3ic-binutils-2.46/bin/ld ${extraBefore+"${extraBefore[@]}"} ${params+"${params[@]}"} ${extraAfter+"${extraAfter[@]}"}
collect2: error: ld returned 137 exit status
error: could not compile `horae` (bin "horae") due to 1 previous error
warning: build failed, waiting for other jobs to finish...
error: could not compile `horae` (bin "horae" test)
Caused by:
process didn't exit successfully: `rustc --crate-name horae --edition=2024 crates/horae/src/main.rs --error-format=json --json=diagnostic-rendered-ansi,artifacts,future-incompat --emit=dep-info,link -C embed-bitcode=no -C debuginfo=2 --test --cfg 'feature="default"' --cfg 'feature="server"' --check-cfg 'cfg(docsrs,test)' --check-cfg 'cfg(feature, values("default", "server", "web"))' -C metadata=29d10d74d1b8bc4c -C extra-filename=-28e72b71798c6b17 --out-dir /build/source/target/debug/deps -L dependency=/build/source/target/debug/deps --extern anyhow=/build/source/target/debug/deps/libanyhow-0813d260fb765952.rlib --extern axum=/build/source/…
|
| failed |
checks.x86_64-linux.tests
|
22m 25s |
horae-tests-0.1.0:
failures:
---- server_fns::permissions::project_management_tests::legacy_project_lock_returns_busy_instead_of_forming_an_org_fk_cycle stdout …
horae-tests-0.1.0:
failures:
---- server_fns::permissions::project_management_tests::legacy_project_lock_returns_busy_instead_of_forming_an_org_fk_cycle stdout ----
thread 'server_fns::permissions::project_management_tests::legacy_project_lock_returns_busy_instead_of_forming_an_org_fk_cycle' (6037) panicked at crates/horae/src/server_fns/permissions/tests/project_management.rs:797:5:
Ok(ProjectManagersOutcome { project_id: 01a119c1-0dce-7173-8b3f-2bf6acf49832, access_revision: 1, changed: true })
failures:
server_fns::permissions::project_management_tests::legacy_project_lock_returns_busy_instead_of_forming_an_org_fk_cycle
test result: FAILED. 970 passed; 1 failed; 11 ignored; 0 measured; 0 filtered out; finished in 350.67s
error: test failed, to rerun pass `-p horae --bin horae`
|