setup
checks.x86_64-linux.tests
· build #440
· raw
1this derivation will be built:2 /nix/store/ihb4frxhz13n5wfx3n6dz689jcihjkqc-horae-tests-0.1.0.drv3error: Cannot build '/nix/store/ihb4frxhz13n5wfx3n6dz689jcihjkqc-horae-tests-0.1.0.drv'.4 Reason: builder failed with exit code 101.5 Output paths:6 /nix/store/sg61vffpa4l26rvsc7v3ka495d71bknl-horae-tests-0.1.07 Last 25 log lines:8 > thread 'importers::harvest::engine_tests::csv_streaming::durable_csv_waits_for_input_without_an_open_transaction' (2287) panicked at crates/horae/src/importers/harvest/engine_tests/csv_streaming.rs:73:18:9 > called `Result::unwrap()` on an `Err` value: Elapsed(())10 >11 > ---- importers::harvest::sync_tests::checkpoints::durable_api_preview_reclaimed_worker_cannot_checkpoint_its_next_page stdout ----12 >13 > thread 'importers::harvest::sync_tests::checkpoints::durable_api_preview_reclaimed_worker_cannot_checkpoint_its_next_page' (2727) panicked at crates/horae/src/importers/harvest/sync_tests/checkpoints.rs:452:10:14 > called `Result::unwrap()` on an `Err` value: Elapsed(())15 >16 > thread '<unnamed>' (2846) panicked at crates/horae/src/importers/harvest/sync_tests/checkpoints.rs:414:56:17 > called `Result::unwrap()` on an `Err` value: Timeout18 >19 >20 > failures:21 > importers::harvest::engine_tests::csv_streaming::durable_csv_cancel_preserves_its_completed_batches_for_manual_retry22 > importers::harvest::engine_tests::csv_streaming::durable_csv_preview_cancel_preserves_simulation_for_manual_retry23 > importers::harvest::engine_tests::csv_streaming::durable_csv_preview_rejects_a_stale_next_batch24 > importers::harvest::engine_tests::csv_streaming::durable_csv_preview_resumes_after_a_crash_without_recounting_rows25 > importers::harvest::engine_tests::csv_streaming::durable_csv_reclaimed_lease_cannot_commit_the_next_batch26 > importers::harvest::engine_tests::csv_streaming::durable_csv_resumes_committed_batches_without_recounting_duplicate_rows27 > importers::harvest::engine_tests::csv_streaming::durable_csv_waits_for_input_without_an_open_transaction28 > importers::harvest::sync_tests::checkpoints::durable_api_preview_reclaimed_worker_cannot_checkpoint_its_next_page29 >30 > test result: FAILED. 856 passed; 8 failed; 11 ignored; 0 measured; 0 filtered out; finished in 1044.32s31 >32 > error: test failed, to rerun pass `-p horae --bin horae`33 For full logs, run:34 nix log /nix/store/ihb4frxhz13n5wfx3n6dz689jcihjkqc-horae-tests-0.1.0.drv