nixbot

builds

numtide/horae build #388 failed

branch integration/permission-readers-editor-check · PR #269 · commit 1442e01640 · · took 2h 31m · eval 18s

2 failed
failed attributes
status attribute duration
failed checks.aarch64-linux.e2e-oidc 45m 27s
vm-test-run-horae-e2e-oidc: !!! File "<string>", line 5, in <module> !!! retry(lambda _: "connecting to host..." in server.get_console_log(), timeout_seco …
vm-test-run-horae-e2e-oidc:
!!!   File "<string>", line 5, in <module>
!!!     retry(lambda _: "connecting to host..." in server.get_console_log(), timeout_seconds=900)
!!! 
!!! RequestedAssertionFailed: action timed out after 900.35 seconds (timeout=900)
cleanup
kill QemuMachine (pid 12)
server # qemu-system-aarch64: terminating on signal 15 from pid 6 (/nix/store/smwd56pl54f0pcjdspgh5vnf20c8xwsc-python3-3.13.13/bin/python3.13)
(finished: cleanup, in 0.19 seconds)
failed checks.aarch64-linux.tests 17m 36s
horae-tests-0.1.0: thread 'server_fns::importers::authorization_tests::job_endpoints_enforce_session_role_and_organization' (5106) panicked at crates/horae/src/ …
horae-tests-0.1.0:
thread 'server_fns::importers::authorization_tests::job_endpoints_enforce_session_role_and_organization' (5106) panicked at crates/horae/src/server_fns/importers/authorization_tests/cli.rs:75:13:
assertion `left == right` failed: ["import", "harvest-csv", "/build/.tmpDjAU7K/source.csv", "--dry-run"]: {"error":{"category":"indeterminate_submission","message":"Submission acknowledgement unavailable; resubmit identical input with the same request ID"},"operation":"import.harvest-csv","outcome":"error","request_id":"01a1188b-2bbe-7d03-8bd7-8262e4045c25","version":1}
  left: 6
 right: 1
failures:
    server_fns::importers::authorization_tests::job_endpoints_enforce_session_role_and_organization
test result: FAILED. 1044 passed; 1 failed; 11 ignored; 0 measured; 0 filtered out; finished in 171.54s
error: test failed, to rerun pass `-p horae --bin horae`
14 succeeded
succeeded attributes
status attribute duration
loading…
4 already built
skipped attributes
status attribute duration
loading…