setup
checks.x86_64-linux.tests
· build #381
· raw
1this derivation will be built:2 /nix/store/gz3jnfc7xk3jfjr51y40dzwi2yzly4k9-horae-tests-0.1.0.drv3error: Cannot build '/nix/store/gz3jnfc7xk3jfjr51y40dzwi2yzly4k9-horae-tests-0.1.0.drv'.4 Reason: builder failed with exit code 101.5 Output paths:6 /nix/store/47c5w21j6mcl20dq174h37d8qsr7hlj6-horae-tests-0.1.07 Last 25 log lines:8 >9 > thread 'importers::harvest::engine_tests::csv_streaming::durable_csv_preview_resumes_after_a_crash_without_recounting_rows' (2354) panicked at crates/horae/src/importers/harvest/engine_tests/csv_streaming.rs:338:5:10 > a durable batch must commit before source EOF11 >12 > ---- importers::harvest::engine_tests::csv_streaming::durable_csv_resumes_committed_batches_without_recounting_duplicate_rows stdout ----13 >14 > thread 'importers::harvest::engine_tests::csv_streaming::durable_csv_resumes_committed_batches_without_recounting_duplicate_rows' (2362) panicked at crates/horae/src/importers/harvest/engine_tests/csv_streaming.rs:338:5:15 > a durable batch must commit before source EOF16 >17 > ---- importers::harvest::engine_tests::csv_streaming::durable_csv_preview_rejects_a_stale_next_batch stdout ----18 >19 > thread 'importers::harvest::engine_tests::csv_streaming::durable_csv_preview_rejects_a_stale_next_batch' (2352) panicked at crates/horae/src/importers/harvest/engine_tests/csv_streaming.rs:338:5:20 > a durable batch must commit before source EOF21 >22 >23 > failures:24 > importers::harvest::engine_tests::csv_streaming::durable_csv_cancel_preserves_its_completed_batches_for_manual_retry25 > importers::harvest::engine_tests::csv_streaming::durable_csv_preview_cancel_preserves_simulation_for_manual_retry26 > importers::harvest::engine_tests::csv_streaming::durable_csv_preview_rejects_a_stale_next_batch27 > importers::harvest::engine_tests::csv_streaming::durable_csv_preview_resumes_after_a_crash_without_recounting_rows28 > importers::harvest::engine_tests::csv_streaming::durable_csv_resumes_committed_batches_without_recounting_duplicate_rows29 >30 > test result: FAILED. 1134 passed; 5 failed; 11 ignored; 0 measured; 0 filtered out; finished in 232.39s31 >32 > error: test failed, to rerun pass `-p horae --bin horae`33 For full logs, run:34 nix log /nix/store/gz3jnfc7xk3jfjr51y40dzwi2yzly4k9-horae-tests-0.1.0.drv