vm-test-run-horae-e2e:
!!! File "<string>", line 8, in <module>
!!! retry(lambda _: "connecting to host..." in server.get_console_log(), timeout_seconds=9 …
vm-test-run-horae-e2e:
!!! File "<string>", line 8, in <module>
!!! retry(lambda _: "connecting to host..." in server.get_console_log(), timeout_seconds=900)
!!!
!!! RequestedAssertionFailed: action timed out after 900.40 seconds (timeout=900)
cleanup
kill QemuMachine (pid 12)
server # qemu-system-aarch64: terminating on signal 15 from pid 6 (/nix/store/smwd56pl54f0pcjdspgh5vnf20c8xwsc-python3-3.13.13/bin/python3.13)
(finished: cleanup, in 0.10 seconds)
|
horae-tests-0.1.0:
thread 'server_fns::importers::authorization_tests::job_endpoints_enforce_session_role_and_organization' (5059) panicked at crates/horae/src/ …
horae-tests-0.1.0:
thread 'server_fns::importers::authorization_tests::job_endpoints_enforce_session_role_and_organization' (5059) panicked at crates/horae/src/server_fns/importers/authorization_tests/cli.rs:75:13:
assertion `left == right` failed: ["import", "harvest-csv", "/build/.tmp5FZgB3/source.csv", "--dry-run"]: {"error":{"category":"indeterminate_submission","message":"Submission acknowledgement unavailable; resubmit identical input with the same request ID"},"operation":"import.harvest-csv","outcome":"error","request_id":"01a1186a-883c-78f2-97c2-17928df4569f","version":1}
left: 6
right: 1
failures:
server_fns::importers::authorization_tests::job_endpoints_enforce_session_role_and_organization
test result: FAILED. 984 passed; 1 failed; 11 ignored; 0 measured; 0 filtered out; finished in 154.91s
error: test failed, to rerun pass `-p horae --bin horae`
|